Guest User

Untitled

a guest
Jul 16th, 2022
277
0
Never
Not a member of Pastebin yet? Sign Up, it unlocks many cool features!
text 56.50 KB | None | 0 0
  1. ---> Configuring glfw
  2. Error: Failed to configure glfw: consult /opt/local/var/macports/build/_opt_local_var_macports_sources_rsync.macports.org_macports_release_tarballs_ports_graphics_glfw/glfw/work/build/CMakeFiles/CMakeError.log
  3. Error: Failed to configure glfw: configure failure: command execution failed
  4. Error: See /opt/local/var/macports/logs/_opt_local_var_macports_sources_rsync.macports.org_macports_release_tarballs_ports_graphics_glfw/glfw/main.log for details.
  5. Error: Follow https://guide.macports.org/#project.tickets if you believe there
  6. is a bug.
  7. Error: Processing of port glfw failed
  8.  
  9.  
  10.  
  11.  
  12. Compiling the C compiler identification source file "CMakeCCompilerId.c" failed.
  13. Compiler: /opt/local/bin/clang-mp-13
  14. Build flags: -pipe;-Os;-DNDEBUG;-I/opt/local/include
  15. Id flags:
  16.  
  17. The output was:
  18. 69
  19. 2022-07-16 05:15:16.281 xcodebuild[15492:1207] [MT] DVTAssertions: ASSERTION FAILURE in /SourceCache/DVTFoundation/DVTFoundation-1828/Framework/Classes/FilePaths/DVTFilePath.m:379
  20. Details: fsrep is absolute (starts with /) ('/opt/local/libexec/llvm-13/bin/clang') parentPath must be nil but it is not ('<DVTFilePath:0x40012a880:'/Applications/Xcode.app/Contents/Developer/Toolchains/XcodeDefault.xctoolchain/usr/bin'>')
  21. Object: <DVTFilePath>
  22. Method: +_filePathForParent:fileSystemRepresentation:length:allowCreation:
  23. Thread: <NSThread: 0x40030a1e0>{name = (null), num = 1}
  24. Hints: None
  25. Backtrace:
  26. 0 0x000000010660644c -[DVTAssertionHandler handleFailureInMethod:object:fileName:lineNumber:messageFormat:arguments:] (in DVTFoundation)
  27. 1 0x00000001066062a5 _DVTAssertionFailureHandler (in DVTFoundation)
  28. 2 0x0000000106589694 +[DVTFilePath _filePathForParent:fileSystemRepresentation:length:allowCreation:] (in DVTFoundation)
  29. 3 0x0000000106589372 +[DVTFilePath _filePathForParent:pathString:] (in DVTFoundation)
  30. 4 0x00000001065bd16b -[DVTSearchPath pathForFileWithRelativePathString:] (in DVTFoundation)
  31. 5 0x0000000106de8a5b -[Xcode3CommandLineBuildTool _printPathToExecutableAndExit] (in Xcode3Core)
  32. 6 0x0000000106deabd4 -[Xcode3CommandLineBuildTool run] (in Xcode3Core)
  33. 7 0x000000010657ab46 (in xcodebuild)
  34. 8 0x000000010657a91c (in xcodebuild)
  35. 9 0x0000000000000005
  36. xcrun: error: /Applications/Xcode.app/Contents/Developer/usr/bin/xcodebuild failed with exit code 6
  37.  
  38.  
  39. Compiling the C compiler identification source file "CMakeCCompilerId.c" failed.
  40. Compiler: /opt/local/bin/clang-mp-13
  41. Build flags: -pipe;-Os;-DNDEBUG;-I/opt/local/include
  42. Id flags: -c
  43.  
  44. The output was:
  45. 69
  46. 2022-07-16 05:15:22.002 xcodebuild[15497:1207] [MT] DVTAssertions: ASSERTION FAILURE in /SourceCache/DVTFoundation/DVTFoundation-1828/Framework/Classes/FilePaths/DVTFilePath.m:379
  47. Details: fsrep is absolute (starts with /) ('/opt/local/libexec/llvm-13/bin/clang') parentPath must be nil but it is not ('<DVTFilePath:0x40012a880:'/Applications/Xcode.app/Contents/Developer/Toolchains/XcodeDefault.xctoolchain/usr/bin'>')
  48. Object: <DVTFilePath>
  49. Method: +_filePathForParent:fileSystemRepresentation:length:allowCreation:
  50. Thread: <NSThread: 0x40030a1e0>{name = (null), num = 1}
  51. Hints: None
  52. Backtrace:
  53. 0 0x000000010abfc44c -[DVTAssertionHandler handleFailureInMethod:object:fileName:lineNumber:messageFormat:arguments:] (in DVTFoundation)
  54. 1 0x000000010abfc2a5 _DVTAssertionFailureHandler (in DVTFoundation)
  55. 2 0x000000010ab7f694 +[DVTFilePath _filePathForParent:fileSystemRepresentation:length:allowCreation:] (in DVTFoundation)
  56. 3 0x000000010ab7f372 +[DVTFilePath _filePathForParent:pathString:] (in DVTFoundation)
  57. 4 0x000000010abb316b -[DVTSearchPath pathForFileWithRelativePathString:] (in DVTFoundation)
  58. 5 0x000000010b3d9a5b -[Xcode3CommandLineBuildTool _printPathToExecutableAndExit] (in Xcode3Core)
  59. 6 0x000000010b3dbbd4 -[Xcode3CommandLineBuildTool run] (in Xcode3Core)
  60. 7 0x000000010ab71b46 (in xcodebuild)
  61. 8 0x000000010ab7191c (in xcodebuild)
  62. 9 0x0000000000000005
  63. xcrun: error: /Applications/Xcode.app/Contents/Developer/usr/bin/xcodebuild failed with exit code 6
  64.  
  65.  
  66. Compiling the C compiler identification source file "CMakeCCompilerId.c" failed.
  67. Compiler: /opt/local/bin/clang-mp-13
  68. Build flags: -pipe;-Os;-DNDEBUG;-I/opt/local/include
  69. Id flags: -Aa
  70.  
  71. The output was:
  72. 69
  73. 2022-07-16 05:15:26.538 xcodebuild[15499:1207] [MT] DVTAssertions: ASSERTION FAILURE in /SourceCache/DVTFoundation/DVTFoundation-1828/Framework/Classes/FilePaths/DVTFilePath.m:379
  74. Details: fsrep is absolute (starts with /) ('/opt/local/libexec/llvm-13/bin/clang') parentPath must be nil but it is not ('<DVTFilePath:0x40012a880:'/Applications/Xcode.app/Contents/Developer/Toolchains/XcodeDefault.xctoolchain/usr/bin'>')
  75. Object: <DVTFilePath>
  76. Method: +_filePathForParent:fileSystemRepresentation:length:allowCreation:
  77. Thread: <NSThread: 0x40030a1e0>{name = (null), num = 1}
  78. Hints: None
  79. Backtrace:
  80. 0 0x000000010d6b844c -[DVTAssertionHandler handleFailureInMethod:object:fileName:lineNumber:messageFormat:arguments:] (in DVTFoundation)
  81. 1 0x000000010d6b82a5 _DVTAssertionFailureHandler (in DVTFoundation)
  82. 2 0x000000010d63b694 +[DVTFilePath _filePathForParent:fileSystemRepresentation:length:allowCreation:] (in DVTFoundation)
  83. 3 0x000000010d63b372 +[DVTFilePath _filePathForParent:pathString:] (in DVTFoundation)
  84. 4 0x000000010d66f16b -[DVTSearchPath pathForFileWithRelativePathString:] (in DVTFoundation)
  85. 5 0x000000010de9ba5b -[Xcode3CommandLineBuildTool _printPathToExecutableAndExit] (in Xcode3Core)
  86. 6 0x000000010de9dbd4 -[Xcode3CommandLineBuildTool run] (in Xcode3Core)
  87. 7 0x000000010d62bb46 (in xcodebuild)
  88. 8 0x000000010d62b91c (in xcodebuild)
  89. 9 0x0000000000000005
  90. xcrun: error: /Applications/Xcode.app/Contents/Developer/usr/bin/xcodebuild failed with exit code 6
  91.  
  92.  
  93. Compiling the C compiler identification source file "CMakeCCompilerId.c" failed.
  94. Compiler: /opt/local/bin/clang-mp-13
  95. Build flags: -pipe;-Os;-DNDEBUG;-I/opt/local/include
  96. Id flags: -D__CLASSIC_C__
  97.  
  98. The output was:
  99. 69
  100. 2022-07-16 05:15:32.002 xcodebuild[15506:1207] [MT] DVTAssertions: ASSERTION FAILURE in /SourceCache/DVTFoundation/DVTFoundation-1828/Framework/Classes/FilePaths/DVTFilePath.m:379
  101. Details: fsrep is absolute (starts with /) ('/opt/local/libexec/llvm-13/bin/clang') parentPath must be nil but it is not ('<DVTFilePath:0x40012a880:'/Applications/Xcode.app/Contents/Developer/Toolchains/XcodeDefault.xctoolchain/usr/bin'>')
  102. Object: <DVTFilePath>
  103. Method: +_filePathForParent:fileSystemRepresentation:length:allowCreation:
  104. Thread: <NSThread: 0x40030a1e0>{name = (null), num = 1}
  105. Hints: None
  106. Backtrace:
  107. 0 0x000000010bfa344c -[DVTAssertionHandler handleFailureInMethod:object:fileName:lineNumber:messageFormat:arguments:] (in DVTFoundation)
  108. 1 0x000000010bfa32a5 _DVTAssertionFailureHandler (in DVTFoundation)
  109. 2 0x000000010bf26694 +[DVTFilePath _filePathForParent:fileSystemRepresentation:length:allowCreation:] (in DVTFoundation)
  110. 3 0x000000010bf26372 +[DVTFilePath _filePathForParent:pathString:] (in DVTFoundation)
  111. 4 0x000000010bf5a16b -[DVTSearchPath pathForFileWithRelativePathString:] (in DVTFoundation)
  112. 5 0x000000010c787a5b -[Xcode3CommandLineBuildTool _printPathToExecutableAndExit] (in Xcode3Core)
  113. 6 0x000000010c789bd4 -[Xcode3CommandLineBuildTool run] (in Xcode3Core)
  114. 7 0x000000010bf16b46 (in xcodebuild)
  115. 8 0x000000010bf1691c (in xcodebuild)
  116. 9 0x0000000000000005
  117. xcrun: error: /Applications/Xcode.app/Contents/Developer/usr/bin/xcodebuild failed with exit code 6
  118.  
  119.  
  120. Compiling the C compiler identification source file "CMakeCCompilerId.c" failed.
  121. Compiler: /opt/local/bin/clang-mp-13
  122. Build flags: -pipe;-Os;-DNDEBUG;-I/opt/local/include
  123. Id flags: --target=arm-arm-none-eabi;-mcpu=cortex-m3
  124.  
  125. The output was:
  126. 69
  127. 2022-07-16 05:15:36.810 xcodebuild[15509:1207] [MT] DVTAssertions: ASSERTION FAILURE in /SourceCache/DVTFoundation/DVTFoundation-1828/Framework/Classes/FilePaths/DVTFilePath.m:379
  128. Details: fsrep is absolute (starts with /) ('/opt/local/libexec/llvm-13/bin/clang') parentPath must be nil but it is not ('<DVTFilePath:0x40012a740:'/Applications/Xcode.app/Contents/Developer/Toolchains/XcodeDefault.xctoolchain/usr/bin'>')
  129. Object: <DVTFilePath>
  130. Method: +_filePathForParent:fileSystemRepresentation:length:allowCreation:
  131. Thread: <NSThread: 0x40030a1e0>{name = (null), num = 1}
  132. Hints: None
  133. Backtrace:
  134. 0 0x0000000107ce144c -[DVTAssertionHandler handleFailureInMethod:object:fileName:lineNumber:messageFormat:arguments:] (in DVTFoundation)
  135. 1 0x0000000107ce12a5 _DVTAssertionFailureHandler (in DVTFoundation)
  136. 2 0x0000000107c64694 +[DVTFilePath _filePathForParent:fileSystemRepresentation:length:allowCreation:] (in DVTFoundation)
  137. 3 0x0000000107c64372 +[DVTFilePath _filePathForParent:pathString:] (in DVTFoundation)
  138. 4 0x0000000107c9816b -[DVTSearchPath pathForFileWithRelativePathString:] (in DVTFoundation)
  139. 5 0x00000001084c3a5b -[Xcode3CommandLineBuildTool _printPathToExecutableAndExit] (in Xcode3Core)
  140. 6 0x00000001084c5bd4 -[Xcode3CommandLineBuildTool run] (in Xcode3Core)
  141. 7 0x0000000107c58b46 (in xcodebuild)
  142. 8 0x0000000107c5891c (in xcodebuild)
  143. 9 0x0000000000000005
  144. xcrun: error: /Applications/Xcode.app/Contents/Developer/usr/bin/xcodebuild failed with exit code 6
  145.  
  146.  
  147. Compiling the C compiler identification source file "CMakeCCompilerId.c" failed.
  148. Compiler: /opt/local/bin/clang-mp-13
  149. Build flags: -pipe;-Os;-DNDEBUG;-I/opt/local/include
  150. Id flags: -c;-I__does_not_exist__
  151.  
  152. The output was:
  153. 69
  154. 2022-07-16 05:15:42.002 xcodebuild[15512:1207] [MT] DVTAssertions: ASSERTION FAILURE in /SourceCache/DVTFoundation/DVTFoundation-1828/Framework/Classes/FilePaths/DVTFilePath.m:379
  155. Details: fsrep is absolute (starts with /) ('/opt/local/libexec/llvm-13/bin/clang') parentPath must be nil but it is not ('<DVTFilePath:0x40012a880:'/Applications/Xcode.app/Contents/Developer/Toolchains/XcodeDefault.xctoolchain/usr/bin'>')
  156. Object: <DVTFilePath>
  157. Method: +_filePathForParent:fileSystemRepresentation:length:allowCreation:
  158. Thread: <NSThread: 0x40030a1e0>{name = (null), num = 1}
  159. Hints: None
  160. Backtrace:
  161. 0 0x000000010833544c -[DVTAssertionHandler handleFailureInMethod:object:fileName:lineNumber:messageFormat:arguments:] (in DVTFoundation)
  162. 1 0x00000001083352a5 _DVTAssertionFailureHandler (in DVTFoundation)
  163. 2 0x00000001082b8694 +[DVTFilePath _filePathForParent:fileSystemRepresentation:length:allowCreation:] (in DVTFoundation)
  164. 3 0x00000001082b8372 +[DVTFilePath _filePathForParent:pathString:] (in DVTFoundation)
  165. 4 0x00000001082ec16b -[DVTSearchPath pathForFileWithRelativePathString:] (in DVTFoundation)
  166. 5 0x0000000108b15a5b -[Xcode3CommandLineBuildTool _printPathToExecutableAndExit] (in Xcode3Core)
  167. 6 0x0000000108b17bd4 -[Xcode3CommandLineBuildTool run] (in Xcode3Core)
  168. 7 0x00000001082a6b46 (in xcodebuild)
  169. 8 0x00000001082a691c (in xcodebuild)
  170. 9 0x0000000000000005
  171. xcrun: error: /Applications/Xcode.app/Contents/Developer/usr/bin/xcodebuild failed with exit code 6
  172.  
  173.  
  174. Compiling the C compiler identification source file "CMakeCCompilerId.c" failed.
  175. Compiler: /opt/local/bin/clang-mp-13
  176. Build flags:
  177. Id flags:
  178.  
  179. The output was:
  180. 69
  181. 2022-07-16 05:15:47.006 xcodebuild[15514:1207] [MT] DVTAssertions: ASSERTION FAILURE in /SourceCache/DVTFoundation/DVTFoundation-1828/Framework/Classes/FilePaths/DVTFilePath.m:379
  182. Details: fsrep is absolute (starts with /) ('/opt/local/libexec/llvm-13/bin/clang') parentPath must be nil but it is not ('<DVTFilePath:0x40012a880:'/Applications/Xcode.app/Contents/Developer/Toolchains/XcodeDefault.xctoolchain/usr/bin'>')
  183. Object: <DVTFilePath>
  184. Method: +_filePathForParent:fileSystemRepresentation:length:allowCreation:
  185. Thread: <NSThread: 0x40030a1e0>{name = (null), num = 1}
  186. Hints: None
  187. Backtrace:
  188. 0 0x0000000104b7944c -[DVTAssertionHandler handleFailureInMethod:object:fileName:lineNumber:messageFormat:arguments:] (in DVTFoundation)
  189. 1 0x0000000104b792a5 _DVTAssertionFailureHandler (in DVTFoundation)
  190. 2 0x0000000104afc694 +[DVTFilePath _filePathForParent:fileSystemRepresentation:length:allowCreation:] (in DVTFoundation)
  191. 3 0x0000000104afc372 +[DVTFilePath _filePathForParent:pathString:] (in DVTFoundation)
  192. 4 0x0000000104b3016b -[DVTSearchPath pathForFileWithRelativePathString:] (in DVTFoundation)
  193. 5 0x0000000105356a5b -[Xcode3CommandLineBuildTool _printPathToExecutableAndExit] (in Xcode3Core)
  194. 6 0x0000000105358bd4 -[Xcode3CommandLineBuildTool run] (in Xcode3Core)
  195. 7 0x0000000104aeeb46 (in xcodebuild)
  196. 8 0x0000000104aee91c (in xcodebuild)
  197. 9 0x0000000000000005
  198. xcrun: error: /Applications/Xcode.app/Contents/Developer/usr/bin/xcodebuild failed with exit code 6
  199.  
  200.  
  201. Compiling the C compiler identification source file "CMakeCCompilerId.c" failed.
  202. Compiler: /opt/local/bin/clang-mp-13
  203. Build flags:
  204. Id flags: -c
  205.  
  206. The output was:
  207. 69
  208. 2022-07-16 05:15:52.002 xcodebuild[15517:1207] [MT] DVTAssertions: ASSERTION FAILURE in /SourceCache/DVTFoundation/DVTFoundation-1828/Framework/Classes/FilePaths/DVTFilePath.m:379
  209. Details: fsrep is absolute (starts with /) ('/opt/local/libexec/llvm-13/bin/clang') parentPath must be nil but it is not ('<DVTFilePath:0x40012a600:'/Applications/Xcode.app/Contents/Developer/Toolchains/XcodeDefault.xctoolchain/usr/bin'>')
  210. Object: <DVTFilePath>
  211. Method: +_filePathForParent:fileSystemRepresentation:length:allowCreation:
  212. Thread: <NSThread: 0x40030a1e0>{name = (null), num = 1}
  213. Hints: None
  214. Backtrace:
  215. 0 0x000000010789744c -[DVTAssertionHandler handleFailureInMethod:object:fileName:lineNumber:messageFormat:arguments:] (in DVTFoundation)
  216. 1 0x00000001078972a5 _DVTAssertionFailureHandler (in DVTFoundation)
  217. 2 0x000000010781a694 +[DVTFilePath _filePathForParent:fileSystemRepresentation:length:allowCreation:] (in DVTFoundation)
  218. 3 0x000000010781a372 +[DVTFilePath _filePathForParent:pathString:] (in DVTFoundation)
  219. 4 0x000000010784e16b -[DVTSearchPath pathForFileWithRelativePathString:] (in DVTFoundation)
  220. 5 0x000000010807ea5b -[Xcode3CommandLineBuildTool _printPathToExecutableAndExit] (in Xcode3Core)
  221. 6 0x0000000108080bd4 -[Xcode3CommandLineBuildTool run] (in Xcode3Core)
  222. 7 0x000000010780db46 (in xcodebuild)
  223. 8 0x000000010780d91c (in xcodebuild)
  224. 9 0x0000000000000005
  225. xcrun: error: /Applications/Xcode.app/Contents/Developer/usr/bin/xcodebuild failed with exit code 6
  226.  
  227.  
  228. Compiling the C compiler identification source file "CMakeCCompilerId.c" failed.
  229. Compiler: /opt/local/bin/clang-mp-13
  230. Build flags:
  231. Id flags: -Aa
  232.  
  233. The output was:
  234. 69
  235. 2022-07-16 05:15:57.007 xcodebuild[15519:1207] [MT] DVTAssertions: ASSERTION FAILURE in /SourceCache/DVTFoundation/DVTFoundation-1828/Framework/Classes/FilePaths/DVTFilePath.m:379
  236. Details: fsrep is absolute (starts with /) ('/opt/local/libexec/llvm-13/bin/clang') parentPath must be nil but it is not ('<DVTFilePath:0x40012a880:'/Applications/Xcode.app/Contents/Developer/Toolchains/XcodeDefault.xctoolchain/usr/bin'>')
  237. Object: <DVTFilePath>
  238. Method: +_filePathForParent:fileSystemRepresentation:length:allowCreation:
  239. Thread: <NSThread: 0x40030a1e0>{name = (null), num = 1}
  240. Hints: None
  241. Backtrace:
  242. 0 0x000000010729d44c -[DVTAssertionHandler handleFailureInMethod:object:fileName:lineNumber:messageFormat:arguments:] (in DVTFoundation)
  243. 1 0x000000010729d2a5 _DVTAssertionFailureHandler (in DVTFoundation)
  244. 2 0x0000000107220694 +[DVTFilePath _filePathForParent:fileSystemRepresentation:length:allowCreation:] (in DVTFoundation)
  245. 3 0x0000000107220372 +[DVTFilePath _filePathForParent:pathString:] (in DVTFoundation)
  246. 4 0x000000010725416b -[DVTSearchPath pathForFileWithRelativePathString:] (in DVTFoundation)
  247. 5 0x0000000107a7ba5b -[Xcode3CommandLineBuildTool _printPathToExecutableAndExit] (in Xcode3Core)
  248. 6 0x0000000107a7dbd4 -[Xcode3CommandLineBuildTool run] (in Xcode3Core)
  249. 7 0x000000010720eb46 (in xcodebuild)
  250. 8 0x000000010720e91c (in xcodebuild)
  251. 9 0x0000000000000005
  252. xcrun: error: /Applications/Xcode.app/Contents/Developer/usr/bin/xcodebuild failed with exit code 6
  253.  
  254.  
  255. Compiling the C compiler identification source file "CMakeCCompilerId.c" failed.
  256. Compiler: /opt/local/bin/clang-mp-13
  257. Build flags:
  258. Id flags: -D__CLASSIC_C__
  259.  
  260. The output was:
  261. 69
  262. 2022-07-16 05:16:02.002 xcodebuild[15522:1207] [MT] DVTAssertions: ASSERTION FAILURE in /SourceCache/DVTFoundation/DVTFoundation-1828/Framework/Classes/FilePaths/DVTFilePath.m:379
  263. Details: fsrep is absolute (starts with /) ('/opt/local/libexec/llvm-13/bin/clang') parentPath must be nil but it is not ('<DVTFilePath:0x40012a880:'/Applications/Xcode.app/Contents/Developer/Toolchains/XcodeDefault.xctoolchain/usr/bin'>')
  264. Object: <DVTFilePath>
  265. Method: +_filePathForParent:fileSystemRepresentation:length:allowCreation:
  266. Thread: <NSThread: 0x40030a1e0>{name = (null), num = 1}
  267. Hints: None
  268. Backtrace:
  269. 0 0x000000010cbf044c -[DVTAssertionHandler handleFailureInMethod:object:fileName:lineNumber:messageFormat:arguments:] (in DVTFoundation)
  270. 1 0x000000010cbf02a5 _DVTAssertionFailureHandler (in DVTFoundation)
  271. 2 0x000000010cb73694 +[DVTFilePath _filePathForParent:fileSystemRepresentation:length:allowCreation:] (in DVTFoundation)
  272. 3 0x000000010cb73372 +[DVTFilePath _filePathForParent:pathString:] (in DVTFoundation)
  273. 4 0x000000010cba716b -[DVTSearchPath pathForFileWithRelativePathString:] (in DVTFoundation)
  274. 5 0x000000010d3d4a5b -[Xcode3CommandLineBuildTool _printPathToExecutableAndExit] (in Xcode3Core)
  275. 6 0x000000010d3d6bd4 -[Xcode3CommandLineBuildTool run] (in Xcode3Core)
  276. 7 0x000000010cb66b46 (in xcodebuild)
  277. 8 0x000000010cb6691c (in xcodebuild)
  278. 9 0x0000000000000005
  279. xcrun: error: /Applications/Xcode.app/Contents/Developer/usr/bin/xcodebuild failed with exit code 6
  280.  
  281.  
  282. Compiling the C compiler identification source file "CMakeCCompilerId.c" failed.
  283. Compiler: /opt/local/bin/clang-mp-13
  284. Build flags:
  285. Id flags: --target=arm-arm-none-eabi;-mcpu=cortex-m3
  286.  
  287. The output was:
  288. 69
  289. 2022-07-16 05:16:07.004 xcodebuild[15524:1207] [MT] DVTAssertions: ASSERTION FAILURE in /SourceCache/DVTFoundation/DVTFoundation-1828/Framework/Classes/FilePaths/DVTFilePath.m:379
  290. Details: fsrep is absolute (starts with /) ('/opt/local/libexec/llvm-13/bin/clang') parentPath must be nil but it is not ('<DVTFilePath:0x40012a880:'/Applications/Xcode.app/Contents/Developer/Toolchains/XcodeDefault.xctoolchain/usr/bin'>')
  291. Object: <DVTFilePath>
  292. Method: +_filePathForParent:fileSystemRepresentation:length:allowCreation:
  293. Thread: <NSThread: 0x40030a1e0>{name = (null), num = 1}
  294. Hints: None
  295. Backtrace:
  296. 0 0x000000010f99344c -[DVTAssertionHandler handleFailureInMethod:object:fileName:lineNumber:messageFormat:arguments:] (in DVTFoundation)
  297. 1 0x000000010f9932a5 _DVTAssertionFailureHandler (in DVTFoundation)
  298. 2 0x000000010f916694 +[DVTFilePath _filePathForParent:fileSystemRepresentation:length:allowCreation:] (in DVTFoundation)
  299. 3 0x000000010f916372 +[DVTFilePath _filePathForParent:pathString:] (in DVTFoundation)
  300. 4 0x000000010f94a16b -[DVTSearchPath pathForFileWithRelativePathString:] (in DVTFoundation)
  301. 5 0x0000000110174a5b -[Xcode3CommandLineBuildTool _printPathToExecutableAndExit] (in Xcode3Core)
  302. 6 0x0000000110176bd4 -[Xcode3CommandLineBuildTool run] (in Xcode3Core)
  303. 7 0x000000010f908b46 (in xcodebuild)
  304. 8 0x000000010f90891c (in xcodebuild)
  305. 9 0x0000000000000005
  306. xcrun: error: /Applications/Xcode.app/Contents/Developer/usr/bin/xcodebuild failed with exit code 6
  307.  
  308.  
  309. Compiling the C compiler identification source file "CMakeCCompilerId.c" failed.
  310. Compiler: /opt/local/bin/clang-mp-13
  311. Build flags:
  312. Id flags: -c;-I__does_not_exist__
  313.  
  314. The output was:
  315. 69
  316. 2022-07-16 05:16:13.007 xcodebuild[15527:1207] [MT] DVTAssertions: ASSERTION FAILURE in /SourceCache/DVTFoundation/DVTFoundation-1828/Framework/Classes/FilePaths/DVTFilePath.m:379
  317. Details: fsrep is absolute (starts with /) ('/opt/local/libexec/llvm-13/bin/clang') parentPath must be nil but it is not ('<DVTFilePath:0x40012a880:'/Applications/Xcode.app/Contents/Developer/Toolchains/XcodeDefault.xctoolchain/usr/bin'>')
  318. Object: <DVTFilePath>
  319. Method: +_filePathForParent:fileSystemRepresentation:length:allowCreation:
  320. Thread: <NSThread: 0x40030a1e0>{name = (null), num = 1}
  321. Hints: None
  322. Backtrace:
  323. 0 0x00000001032d844c -[DVTAssertionHandler handleFailureInMethod:object:fileName:lineNumber:messageFormat:arguments:] (in DVTFoundation)
  324. 1 0x00000001032d82a5 _DVTAssertionFailureHandler (in DVTFoundation)
  325. 2 0x000000010325b694 +[DVTFilePath _filePathForParent:fileSystemRepresentation:length:allowCreation:] (in DVTFoundation)
  326. 3 0x000000010325b372 +[DVTFilePath _filePathForParent:pathString:] (in DVTFoundation)
  327. 4 0x000000010328f16b -[DVTSearchPath pathForFileWithRelativePathString:] (in DVTFoundation)
  328. 5 0x0000000103abaa5b -[Xcode3CommandLineBuildTool _printPathToExecutableAndExit] (in Xcode3Core)
  329. 6 0x0000000103abcbd4 -[Xcode3CommandLineBuildTool run] (in Xcode3Core)
  330. 7 0x000000010324eb46 (in xcodebuild)
  331. 8 0x000000010324e91c (in xcodebuild)
  332. 9 0x0000000000000005
  333. xcrun: error: /Applications/Xcode.app/Contents/Developer/usr/bin/xcodebuild failed with exit code 6
  334.  
  335.  
  336. Checking whether the C compiler is IAR using "" did not match "IAR .+ Compiler":
  337. 2022-07-16 05:16:17.396 xcodebuild[15531:1207] [MT] DVTAssertions: ASSERTION FAILURE in /SourceCache/DVTFoundation/DVTFoundation-1828/Framework/Classes/FilePaths/DVTFilePath.m:379
  338. Details: fsrep is absolute (starts with /) ('/opt/local/libexec/llvm-13/bin/clang') parentPath must be nil but it is not ('<DVTFilePath:0x40012a740:'/Applications/Xcode.app/Contents/Developer/Toolchains/XcodeDefault.xctoolchain/usr/bin'>')
  339. Object: <DVTFilePath>
  340. Method: +_filePathForParent:fileSystemRepresentation:length:allowCreation:
  341. Thread: <NSThread: 0x40030a1e0>{name = (null), num = 1}
  342. Hints: None
  343. Backtrace:
  344. 0 0x000000010614044c -[DVTAssertionHandler handleFailureInMethod:object:fileName:lineNumber:messageFormat:arguments:] (in DVTFoundation)
  345. 1 0x00000001061402a5 _DVTAssertionFailureHandler (in DVTFoundation)
  346. 2 0x00000001060c3694 +[DVTFilePath _filePathForParent:fileSystemRepresentation:length:allowCreation:] (in DVTFoundation)
  347. 3 0x00000001060c3372 +[DVTFilePath _filePathForParent:pathString:] (in DVTFoundation)
  348. 4 0x00000001060f716b -[DVTSearchPath pathForFileWithRelativePathString:] (in DVTFoundation)
  349. 5 0x0000000106926a5b -[Xcode3CommandLineBuildTool _printPathToExecutableAndExit] (in Xcode3Core)
  350. 6 0x0000000106928bd4 -[Xcode3CommandLineBuildTool run] (in Xcode3Core)
  351. 7 0x00000001060b1b46 (in xcodebuild)
  352. 8 0x00000001060b191c (in xcodebuild)
  353. 9 0x0000000000000005
  354. xcrun: error: /Applications/Xcode.app/Contents/Developer/usr/bin/xcodebuild failed with exit code 6
  355. Checking whether the C compiler is IAR using "" did not match "IAR .+ Compiler":
  356. 2022-07-16 05:16:23.002 xcodebuild[15535:1207] [MT] DVTAssertions: ASSERTION FAILURE in /SourceCache/DVTFoundation/DVTFoundation-1828/Framework/Classes/FilePaths/DVTFilePath.m:379
  357. Details: fsrep is absolute (starts with /) ('/opt/local/libexec/llvm-13/bin/clang') parentPath must be nil but it is not ('<DVTFilePath:0x40012a740:'/Applications/Xcode.app/Contents/Developer/Toolchains/XcodeDefault.xctoolchain/usr/bin'>')
  358. Object: <DVTFilePath>
  359. Method: +_filePathForParent:fileSystemRepresentation:length:allowCreation:
  360. Thread: <NSThread: 0x40030a1e0>{name = (null), num = 1}
  361. Hints: None
  362. Backtrace:
  363. 0 0x000000010609644c -[DVTAssertionHandler handleFailureInMethod:object:fileName:lineNumber:messageFormat:arguments:] (in DVTFoundation)
  364. 1 0x00000001060962a5 _DVTAssertionFailureHandler (in DVTFoundation)
  365. 2 0x0000000106019694 +[DVTFilePath _filePathForParent:fileSystemRepresentation:length:allowCreation:] (in DVTFoundation)
  366. 3 0x0000000106019372 +[DVTFilePath _filePathForParent:pathString:] (in DVTFoundation)
  367. 4 0x000000010604d16b -[DVTSearchPath pathForFileWithRelativePathString:] (in DVTFoundation)
  368. 5 0x0000000106877a5b -[Xcode3CommandLineBuildTool _printPathToExecutableAndExit] (in Xcode3Core)
  369. 6 0x0000000106879bd4 -[Xcode3CommandLineBuildTool run] (in Xcode3Core)
  370. 7 0x000000010600ab46 (in xcodebuild)
  371. 8 0x000000010600a91c (in xcodebuild)
  372. 9 0x0000000000000005
  373. xcrun: error: /Applications/Xcode.app/Contents/Developer/usr/bin/xcodebuild failed with exit code 6
  374. Detecting C compiler ABI info failed to compile with the following output:
  375. Change Dir: /opt/local/var/macports/build/_opt_local_var_macports_sources_rsync.macports.org_macports_release_tarballs_ports_graphics_glfw/glfw/work/build/CMakeFiles/CMakeTmp
  376.  
  377. Run Build Command(s):/usr/bin/make -f Makefile cmTC_8df63/fast && /usr/bin/make -f CMakeFiles/cmTC_8df63.dir/build.make CMakeFiles/cmTC_8df63.dir/build
  378. Building C object CMakeFiles/cmTC_8df63.dir/CMakeCCompilerABI.c.o
  379. /opt/local/bin/clang-mp-13 -pipe -Os -DNDEBUG -I/opt/local/include -arch x86_64 -o CMakeFiles/cmTC_8df63.dir/CMakeCCompilerABI.c.o -c /opt/local/share/cmake-3.23/Modules/CMakeCCompilerABI.c
  380. 2022-07-16 05:16:27.640 xcodebuild[15544:1207] [MT] DVTAssertions: ASSERTION FAILURE in /SourceCache/DVTFoundation/DVTFoundation-1828/Framework/Classes/FilePaths/DVTFilePath.m:379
  381. Details: fsrep is absolute (starts with /) ('/opt/local/libexec/llvm-13/bin/clang') parentPath must be nil but it is not ('<DVTFilePath:0x40012ab00:'/Applications/Xcode.app/Contents/Developer/Toolchains/XcodeDefault.xctoolchain/usr/bin'>')
  382. Object: <DVTFilePath>
  383. Method: +_filePathForParent:fileSystemRepresentation:length:allowCreation:
  384. Thread: <NSThread: 0x40030a1e0>{name = (null), num = 1}
  385. Hints: None
  386. Backtrace:
  387. 0 0x000000010439544c -[DVTAssertionHandler handleFailureInMethod:object:fileName:lineNumber:messageFormat:arguments:] (in DVTFoundation)
  388. 1 0x00000001043952a5 _DVTAssertionFailureHandler (in DVTFoundation)
  389. 2 0x0000000104318694 +[DVTFilePath _filePathForParent:fileSystemRepresentation:length:allowCreation:] (in DVTFoundation)
  390. 3 0x0000000104318372 +[DVTFilePath _filePathForParent:pathString:] (in DVTFoundation)
  391. 4 0x000000010434c16b -[DVTSearchPath pathForFileWithRelativePathString:] (in DVTFoundation)
  392. 5 0x0000000104b78a5b -[Xcode3CommandLineBuildTool _printPathToExecutableAndExit] (in Xcode3Core)
  393. 6 0x0000000104b7abd4 -[Xcode3CommandLineBuildTool run] (in Xcode3Core)
  394. 7 0x000000010430bb46 (in xcodebuild)
  395. 8 0x000000010430b91c (in xcodebuild)
  396. 9 0x0000000000000005
  397. xcrun: error: /Applications/Xcode.app/Contents/Developer/usr/bin/xcodebuild failed with exit code 6
  398. make[1]: *** [CMakeFiles/cmTC_8df63.dir/CMakeCCompilerABI.c.o] Error 69
  399. make: *** [cmTC_8df63/fast] Error 2
  400.  
  401.  
  402.  
  403.  
  404. Determining if the C compiler works failed with the following output:
  405. Change Dir: /opt/local/var/macports/build/_opt_local_var_macports_sources_rsync.macports.org_macports_release_tarballs_ports_graphics_glfw/glfw/work/build/CMakeFiles/CMakeTmp
  406.  
  407. Run Build Command(s):/usr/bin/make -f Makefile cmTC_a72fc/fast && /usr/bin/make -f CMakeFiles/cmTC_a72fc.dir/build.make CMakeFiles/cmTC_a72fc.dir/build
  408. Building C object CMakeFiles/cmTC_a72fc.dir/testCCompiler.c.o
  409. /opt/local/bin/clang-mp-13 -pipe -Os -DNDEBUG -I/opt/local/include -arch x86_64 -o CMakeFiles/cmTC_a72fc.dir/testCCompiler.c.o -c /opt/local/var/macports/build/_opt_local_var_macports_sources_rsync.macports.org_macports_release_tarballs_ports_graphics_glfw/glfw/work/build/CMakeFiles/CMakeTmp/testCCompiler.c
  410. 2022-07-16 05:16:33.002 xcodebuild[15553:1207] [MT] DVTAssertions: ASSERTION FAILURE in /SourceCache/DVTFoundation/DVTFoundation-1828/Framework/Classes/FilePaths/DVTFilePath.m:379
  411. Details: fsrep is absolute (starts with /) ('/opt/local/libexec/llvm-13/bin/clang') parentPath must be nil but it is not ('<DVTFilePath:0x40012a740:'/Applications/Xcode.app/Contents/Developer/Toolchains/XcodeDefault.xctoolchain/usr/bin'>')
  412. Object: <DVTFilePath>
  413. Method: +_filePathForParent:fileSystemRepresentation:length:allowCreation:
  414. Thread: <NSThread: 0x40030a1e0>{name = (null), num = 1}
  415. Hints: None
  416. Backtrace:
  417. 0 0x000000010a72844c -[DVTAssertionHandler handleFailureInMethod:object:fileName:lineNumber:messageFormat:arguments:] (in DVTFoundation)
  418. 1 0x000000010a7282a5 _DVTAssertionFailureHandler (in DVTFoundation)
  419. 2 0x000000010a6ab694 +[DVTFilePath _filePathForParent:fileSystemRepresentation:length:allowCreation:] (in DVTFoundation)
  420. 3 0x000000010a6ab372 +[DVTFilePath _filePathForParent:pathString:] (in DVTFoundation)
  421. 4 0x000000010a6df16b -[DVTSearchPath pathForFileWithRelativePathString:] (in DVTFoundation)
  422. 5 0x000000010af04a5b -[Xcode3CommandLineBuildTool _printPathToExecutableAndExit] (in Xcode3Core)
  423. 6 0x000000010af06bd4 -[Xcode3CommandLineBuildTool run] (in Xcode3Core)
  424. 7 0x000000010a69ab46 (in xcodebuild)
  425. 8 0x000000010a69a91c (in xcodebuild)
  426. xcrun: error: /Applications/Xcode.app/Contents/Developer/usr/bin/xcodebuild failed with exit code 6
  427. make[1]: *** [CMakeFiles/cmTC_a72fc.dir/testCCompiler.c.o] Error 69
  428. make: *** [cmTC_a72fc/fast] Error 2
  429.  
  430.  
  431.  
  432. Compiling the C compiler identification source file "CMakeCCompilerId.c" failed.
  433. Compiler: /opt/local/bin/clang-mp-13
  434. Build flags: -pipe;-Os;-DNDEBUG;-I/opt/local/include
  435. Id flags:
  436.  
  437. The output was:
  438. 69
  439. 2022-07-16 05:19:19.939 xcodebuild[15598:1207] [MT] DVTAssertions: ASSERTION FAILURE in /SourceCache/DVTFoundation/DVTFoundation-1828/Framework/Classes/FilePaths/DVTFilePath.m:379
  440. Details: fsrep is absolute (starts with /) ('/opt/local/libexec/llvm-13/bin/clang') parentPath must be nil but it is not ('<DVTFilePath:0x40012a600:'/Applications/Xcode.app/Contents/Developer/Toolchains/XcodeDefault.xctoolchain/usr/bin'>')
  441. Object: <DVTFilePath>
  442. Method: +_filePathForParent:fileSystemRepresentation:length:allowCreation:
  443. Thread: <NSThread: 0x40030a1e0>{name = (null), num = 1}
  444. Hints: None
  445. Backtrace:
  446. 0 0x000000010fbbb44c -[DVTAssertionHandler handleFailureInMethod:object:fileName:lineNumber:messageFormat:arguments:] (in DVTFoundation)
  447. 1 0x000000010fbbb2a5 _DVTAssertionFailureHandler (in DVTFoundation)
  448. 2 0x000000010fb3e694 +[DVTFilePath _filePathForParent:fileSystemRepresentation:length:allowCreation:] (in DVTFoundation)
  449. 3 0x000000010fb3e372 +[DVTFilePath _filePathForParent:pathString:] (in DVTFoundation)
  450. 4 0x000000010fb7216b -[DVTSearchPath pathForFileWithRelativePathString:] (in DVTFoundation)
  451. 5 0x000000011039ba5b -[Xcode3CommandLineBuildTool _printPathToExecutableAndExit] (in Xcode3Core)
  452. 6 0x000000011039dbd4 -[Xcode3CommandLineBuildTool run] (in Xcode3Core)
  453. 7 0x000000010fb33b46 (in xcodebuild)
  454. 8 0x000000010fb3391c (in xcodebuild)
  455. 9 0x0000000000000005
  456. xcrun: error: /Applications/Xcode.app/Contents/Developer/usr/bin/xcodebuild failed with exit code 6
  457.  
  458.  
  459. Compiling the C compiler identification source file "CMakeCCompilerId.c" failed.
  460. Compiler: /opt/local/bin/clang-mp-13
  461. Build flags: -pipe;-Os;-DNDEBUG;-I/opt/local/include
  462. Id flags: -c
  463.  
  464. The output was:
  465. 69
  466. 2022-07-16 05:19:25.002 xcodebuild[15603:1207] [MT] DVTAssertions: ASSERTION FAILURE in /SourceCache/DVTFoundation/DVTFoundation-1828/Framework/Classes/FilePaths/DVTFilePath.m:379
  467. Details: fsrep is absolute (starts with /) ('/opt/local/libexec/llvm-13/bin/clang') parentPath must be nil but it is not ('<DVTFilePath:0x40012a880:'/Applications/Xcode.app/Contents/Developer/Toolchains/XcodeDefault.xctoolchain/usr/bin'>')
  468. Object: <DVTFilePath>
  469. Method: +_filePathForParent:fileSystemRepresentation:length:allowCreation:
  470. Thread: <NSThread: 0x40030a1e0>{name = (null), num = 1}
  471. Hints: None
  472. Backtrace:
  473. 0 0x000000010778544c -[DVTAssertionHandler handleFailureInMethod:object:fileName:lineNumber:messageFormat:arguments:] (in DVTFoundation)
  474. 1 0x00000001077852a5 _DVTAssertionFailureHandler (in DVTFoundation)
  475. 2 0x0000000107708694 +[DVTFilePath _filePathForParent:fileSystemRepresentation:length:allowCreation:] (in DVTFoundation)
  476. 3 0x0000000107708372 +[DVTFilePath _filePathForParent:pathString:] (in DVTFoundation)
  477. 4 0x000000010773c16b -[DVTSearchPath pathForFileWithRelativePathString:] (in DVTFoundation)
  478. 5 0x0000000107f68a5b -[Xcode3CommandLineBuildTool _printPathToExecutableAndExit] (in Xcode3Core)
  479. 6 0x0000000107f6abd4 -[Xcode3CommandLineBuildTool run] (in Xcode3Core)
  480. 7 0x00000001076f8b46 (in xcodebuild)
  481. 8 0x00000001076f891c (in xcodebuild)
  482. 9 0x0000000000000005
  483. xcrun: error: /Applications/Xcode.app/Contents/Developer/usr/bin/xcodebuild failed with exit code 6
  484.  
  485.  
  486. Compiling the C compiler identification source file "CMakeCCompilerId.c" failed.
  487. Compiler: /opt/local/bin/clang-mp-13
  488. Build flags: -pipe;-Os;-DNDEBUG;-I/opt/local/include
  489. Id flags: -Aa
  490.  
  491. The output was:
  492. 69
  493. 2022-07-16 05:19:30.003 xcodebuild[15605:1207] [MT] DVTAssertions: ASSERTION FAILURE in /SourceCache/DVTFoundation/DVTFoundation-1828/Framework/Classes/FilePaths/DVTFilePath.m:379
  494. Details: fsrep is absolute (starts with /) ('/opt/local/libexec/llvm-13/bin/clang') parentPath must be nil but it is not ('<DVTFilePath:0x40012a600:'/Applications/Xcode.app/Contents/Developer/Toolchains/XcodeDefault.xctoolchain/usr/bin'>')
  495. Object: <DVTFilePath>
  496. Method: +_filePathForParent:fileSystemRepresentation:length:allowCreation:
  497. Thread: <NSThread: 0x40030a1e0>{name = (null), num = 1}
  498. Hints: None
  499. Backtrace:
  500. 0 0x0000000108d4044c -[DVTAssertionHandler handleFailureInMethod:object:fileName:lineNumber:messageFormat:arguments:] (in DVTFoundation)
  501. 1 0x0000000108d402a5 _DVTAssertionFailureHandler (in DVTFoundation)
  502. 2 0x0000000108cc3694 +[DVTFilePath _filePathForParent:fileSystemRepresentation:length:allowCreation:] (in DVTFoundation)
  503. 3 0x0000000108cc3372 +[DVTFilePath _filePathForParent:pathString:] (in DVTFoundation)
  504. 4 0x0000000108cf716b -[DVTSearchPath pathForFileWithRelativePathString:] (in DVTFoundation)
  505. 5 0x000000010951ca5b -[Xcode3CommandLineBuildTool _printPathToExecutableAndExit] (in Xcode3Core)
  506. 6 0x000000010951ebd4 -[Xcode3CommandLineBuildTool run] (in Xcode3Core)
  507. 7 0x0000000108cb5b46 (in xcodebuild)
  508. 8 0x0000000108cb591c (in xcodebuild)
  509. 9 0x0000000000000005
  510. xcrun: error: /Applications/Xcode.app/Contents/Developer/usr/bin/xcodebuild failed with exit code 6
  511.  
  512.  
  513. Compiling the C compiler identification source file "CMakeCCompilerId.c" failed.
  514. Compiler: /opt/local/bin/clang-mp-13
  515. Build flags: -pipe;-Os;-DNDEBUG;-I/opt/local/include
  516. Id flags: -D__CLASSIC_C__
  517.  
  518. The output was:
  519. 69
  520. 2022-07-16 05:19:35.002 xcodebuild[15608:1207] [MT] DVTAssertions: ASSERTION FAILURE in /SourceCache/DVTFoundation/DVTFoundation-1828/Framework/Classes/FilePaths/DVTFilePath.m:379
  521. Details: fsrep is absolute (starts with /) ('/opt/local/libexec/llvm-13/bin/clang') parentPath must be nil but it is not ('<DVTFilePath:0x40012a880:'/Applications/Xcode.app/Contents/Developer/Toolchains/XcodeDefault.xctoolchain/usr/bin'>')
  522. Object: <DVTFilePath>
  523. Method: +_filePathForParent:fileSystemRepresentation:length:allowCreation:
  524. Thread: <NSThread: 0x40030a1e0>{name = (null), num = 1}
  525. Hints: None
  526. Backtrace:
  527. 0 0x00000001057a744c -[DVTAssertionHandler handleFailureInMethod:object:fileName:lineNumber:messageFormat:arguments:] (in DVTFoundation)
  528. 1 0x00000001057a72a5 _DVTAssertionFailureHandler (in DVTFoundation)
  529. 2 0x000000010572a694 +[DVTFilePath _filePathForParent:fileSystemRepresentation:length:allowCreation:] (in DVTFoundation)
  530. 3 0x000000010572a372 +[DVTFilePath _filePathForParent:pathString:] (in DVTFoundation)
  531. 4 0x000000010575e16b -[DVTSearchPath pathForFileWithRelativePathString:] (in DVTFoundation)
  532. 5 0x0000000105f88a5b -[Xcode3CommandLineBuildTool _printPathToExecutableAndExit] (in Xcode3Core)
  533. 6 0x0000000105f8abd4 -[Xcode3CommandLineBuildTool run] (in Xcode3Core)
  534. 7 0x000000010571eb46 (in xcodebuild)
  535. 8 0x000000010571e91c (in xcodebuild)
  536. 9 0x0000000000000005
  537. xcrun: error: /Applications/Xcode.app/Contents/Developer/usr/bin/xcodebuild failed with exit code 6
  538.  
  539.  
  540. Compiling the C compiler identification source file "CMakeCCompilerId.c" failed.
  541. Compiler: /opt/local/bin/clang-mp-13
  542. Build flags: -pipe;-Os;-DNDEBUG;-I/opt/local/include
  543. Id flags: --target=arm-arm-none-eabi;-mcpu=cortex-m3
  544.  
  545. The output was:
  546. 69
  547. 2022-07-16 05:19:40.011 xcodebuild[15610:1207] [MT] DVTAssertions: ASSERTION FAILURE in /SourceCache/DVTFoundation/DVTFoundation-1828/Framework/Classes/FilePaths/DVTFilePath.m:379
  548. Details: fsrep is absolute (starts with /) ('/opt/local/libexec/llvm-13/bin/clang') parentPath must be nil but it is not ('<DVTFilePath:0x40012a880:'/Applications/Xcode.app/Contents/Developer/Toolchains/XcodeDefault.xctoolchain/usr/bin'>')
  549. Object: <DVTFilePath>
  550. Method: +_filePathForParent:fileSystemRepresentation:length:allowCreation:
  551. Thread: <NSThread: 0x40030a1e0>{name = (null), num = 1}
  552. Hints: None
  553. Backtrace:
  554. 0 0x00000001062ea44c -[DVTAssertionHandler handleFailureInMethod:object:fileName:lineNumber:messageFormat:arguments:] (in DVTFoundation)
  555. 1 0x00000001062ea2a5 _DVTAssertionFailureHandler (in DVTFoundation)
  556. 2 0x000000010626d694 +[DVTFilePath _filePathForParent:fileSystemRepresentation:length:allowCreation:] (in DVTFoundation)
  557. 3 0x000000010626d372 +[DVTFilePath _filePathForParent:pathString:] (in DVTFoundation)
  558. 4 0x00000001062a116b -[DVTSearchPath pathForFileWithRelativePathString:] (in DVTFoundation)
  559. 5 0x0000000106ac7a5b -[Xcode3CommandLineBuildTool _printPathToExecutableAndExit] (in Xcode3Core)
  560. 6 0x0000000106ac9bd4 -[Xcode3CommandLineBuildTool run] (in Xcode3Core)
  561. 7 0x0000000106261b46 (in xcodebuild)
  562. 8 0x000000010626191c (in xcodebuild)
  563. 9 0x0000000000000005
  564. xcrun: error: /Applications/Xcode.app/Contents/Developer/usr/bin/xcodebuild failed with exit code 6
  565.  
  566.  
  567. Compiling the C compiler identification source file "CMakeCCompilerId.c" failed.
  568. Compiler: /opt/local/bin/clang-mp-13
  569. Build flags: -pipe;-Os;-DNDEBUG;-I/opt/local/include
  570. Id flags: -c;-I__does_not_exist__
  571.  
  572. The output was:
  573. 69
  574. 2022-07-16 05:19:45.002 xcodebuild[15613:1207] [MT] DVTAssertions: ASSERTION FAILURE in /SourceCache/DVTFoundation/DVTFoundation-1828/Framework/Classes/FilePaths/DVTFilePath.m:379
  575. Details: fsrep is absolute (starts with /) ('/opt/local/libexec/llvm-13/bin/clang') parentPath must be nil but it is not ('<DVTFilePath:0x40012a880:'/Applications/Xcode.app/Contents/Developer/Toolchains/XcodeDefault.xctoolchain/usr/bin'>')
  576. Object: <DVTFilePath>
  577. Method: +_filePathForParent:fileSystemRepresentation:length:allowCreation:
  578. Thread: <NSThread: 0x40030a1e0>{name = (null), num = 1}
  579. Hints: None
  580. Backtrace:
  581. 0 0x0000000109ec244c -[DVTAssertionHandler handleFailureInMethod:object:fileName:lineNumber:messageFormat:arguments:] (in DVTFoundation)
  582. 1 0x0000000109ec22a5 _DVTAssertionFailureHandler (in DVTFoundation)
  583. 2 0x0000000109e45694 +[DVTFilePath _filePathForParent:fileSystemRepresentation:length:allowCreation:] (in DVTFoundation)
  584. 3 0x0000000109e45372 +[DVTFilePath _filePathForParent:pathString:] (in DVTFoundation)
  585. 4 0x0000000109e7916b -[DVTSearchPath pathForFileWithRelativePathString:] (in DVTFoundation)
  586. 5 0x000000010a6a7a5b -[Xcode3CommandLineBuildTool _printPathToExecutableAndExit] (in Xcode3Core)
  587. 6 0x000000010a6a9bd4 -[Xcode3CommandLineBuildTool run] (in Xcode3Core)
  588. 7 0x0000000109e33b46 (in xcodebuild)
  589. 8 0x0000000109e3391c (in xcodebuild)
  590. 9 0x0000000000000005
  591. xcrun: error: /Applications/Xcode.app/Contents/Developer/usr/bin/xcodebuild failed with exit code 6
  592.  
  593.  
  594. Compiling the C compiler identification source file "CMakeCCompilerId.c" failed.
  595. Compiler: /opt/local/bin/clang-mp-13
  596. Build flags:
  597. Id flags:
  598.  
  599. The output was:
  600. 69
  601. 2022-07-16 05:19:50.009 xcodebuild[15615:1207] [MT] DVTAssertions: ASSERTION FAILURE in /SourceCache/DVTFoundation/DVTFoundation-1828/Framework/Classes/FilePaths/DVTFilePath.m:379
  602. Details: fsrep is absolute (starts with /) ('/opt/local/libexec/llvm-13/bin/clang') parentPath must be nil but it is not ('<DVTFilePath:0x40012a880:'/Applications/Xcode.app/Contents/Developer/Toolchains/XcodeDefault.xctoolchain/usr/bin'>')
  603. Object: <DVTFilePath>
  604. Method: +_filePathForParent:fileSystemRepresentation:length:allowCreation:
  605. Thread: <NSThread: 0x40030a1e0>{name = (null), num = 1}
  606. Hints: None
  607. Backtrace:
  608. 0 0x00000001031ac44c -[DVTAssertionHandler handleFailureInMethod:object:fileName:lineNumber:messageFormat:arguments:] (in DVTFoundation)
  609. 1 0x00000001031ac2a5 _DVTAssertionFailureHandler (in DVTFoundation)
  610. 2 0x000000010312f694 +[DVTFilePath _filePathForParent:fileSystemRepresentation:length:allowCreation:] (in DVTFoundation)
  611. 3 0x000000010312f372 +[DVTFilePath _filePathForParent:pathString:] (in DVTFoundation)
  612. 4 0x000000010316316b -[DVTSearchPath pathForFileWithRelativePathString:] (in DVTFoundation)
  613. 5 0x0000000103992a5b -[Xcode3CommandLineBuildTool _printPathToExecutableAndExit] (in Xcode3Core)
  614. 6 0x0000000103994bd4 -[Xcode3CommandLineBuildTool run] (in Xcode3Core)
  615. 7 0x000000010311db46 (in xcodebuild)
  616. 8 0x000000010311d91c (in xcodebuild)
  617. 9 0x0000000000000005
  618. xcrun: error: /Applications/Xcode.app/Contents/Developer/usr/bin/xcodebuild failed with exit code 6
  619.  
  620.  
  621. Compiling the C compiler identification source file "CMakeCCompilerId.c" failed.
  622. Compiler: /opt/local/bin/clang-mp-13
  623. Build flags:
  624. Id flags: -c
  625.  
  626. The output was:
  627. 69
  628. 2022-07-16 05:19:56.003 xcodebuild[15618:1207] [MT] DVTAssertions: ASSERTION FAILURE in /SourceCache/DVTFoundation/DVTFoundation-1828/Framework/Classes/FilePaths/DVTFilePath.m:379
  629. Details: fsrep is absolute (starts with /) ('/opt/local/libexec/llvm-13/bin/clang') parentPath must be nil but it is not ('<DVTFilePath:0x40012a880:'/Applications/Xcode.app/Contents/Developer/Toolchains/XcodeDefault.xctoolchain/usr/bin'>')
  630. Object: <DVTFilePath>
  631. Method: +_filePathForParent:fileSystemRepresentation:length:allowCreation:
  632. Thread: <NSThread: 0x40030a1e0>{name = (null), num = 1}
  633. Hints: None
  634. Backtrace:
  635. 0 0x000000010112344c -[DVTAssertionHandler handleFailureInMethod:object:fileName:lineNumber:messageFormat:arguments:] (in DVTFoundation)
  636. 1 0x00000001011232a5 _DVTAssertionFailureHandler (in DVTFoundation)
  637. 2 0x00000001010a6694 +[DVTFilePath _filePathForParent:fileSystemRepresentation:length:allowCreation:] (in DVTFoundation)
  638. 3 0x00000001010a6372 +[DVTFilePath _filePathForParent:pathString:] (in DVTFoundation)
  639. 4 0x00000001010da16b -[DVTSearchPath pathForFileWithRelativePathString:] (in DVTFoundation)
  640. 5 0x0000000101902a5b -[Xcode3CommandLineBuildTool _printPathToExecutableAndExit] (in Xcode3Core)
  641. 6 0x0000000101904bd4 -[Xcode3CommandLineBuildTool run] (in Xcode3Core)
  642. 7 0x0000000101095b46 (in xcodebuild)
  643. 8 0x000000010109591c (in xcodebuild)
  644. 9 0x0000000000000005
  645. xcrun: error: /Applications/Xcode.app/Contents/Developer/usr/bin/xcodebuild failed with exit code 6
  646.  
  647.  
  648. Compiling the C compiler identification source file "CMakeCCompilerId.c" failed.
  649. Compiler: /opt/local/bin/clang-mp-13
  650. Build flags:
  651. Id flags: -Aa
  652.  
  653. The output was:
  654. 69
  655. 2022-07-16 05:20:00.402 xcodebuild[15620:1207] [MT] DVTAssertions: ASSERTION FAILURE in /SourceCache/DVTFoundation/DVTFoundation-1828/Framework/Classes/FilePaths/DVTFilePath.m:379
  656. Details: fsrep is absolute (starts with /) ('/opt/local/libexec/llvm-13/bin/clang') parentPath must be nil but it is not ('<DVTFilePath:0x40012a880:'/Applications/Xcode.app/Contents/Developer/Toolchains/XcodeDefault.xctoolchain/usr/bin'>')
  657. Object: <DVTFilePath>
  658. Method: +_filePathForParent:fileSystemRepresentation:length:allowCreation:
  659. Thread: <NSThread: 0x40030a1e0>{name = (null), num = 1}
  660. Hints: None
  661. Backtrace:
  662. 0 0x000000010824144c -[DVTAssertionHandler handleFailureInMethod:object:fileName:lineNumber:messageFormat:arguments:] (in DVTFoundation)
  663. 1 0x00000001082412a5 _DVTAssertionFailureHandler (in DVTFoundation)
  664. 2 0x00000001081c4694 +[DVTFilePath _filePathForParent:fileSystemRepresentation:length:allowCreation:] (in DVTFoundation)
  665. 3 0x00000001081c4372 +[DVTFilePath _filePathForParent:pathString:] (in DVTFoundation)
  666. 4 0x00000001081f816b -[DVTSearchPath pathForFileWithRelativePathString:] (in DVTFoundation)
  667. 5 0x0000000108a24a5b -[Xcode3CommandLineBuildTool _printPathToExecutableAndExit] (in Xcode3Core)
  668. 6 0x0000000108a26bd4 -[Xcode3CommandLineBuildTool run] (in Xcode3Core)
  669. 7 0x00000001081b4b46 (in xcodebuild)
  670. 8 0x00000001081b491c (in xcodebuild)
  671. 9 0x0000000000000005
  672. xcrun: error: /Applications/Xcode.app/Contents/Developer/usr/bin/xcodebuild failed with exit code 6
  673.  
  674.  
  675. Compiling the C compiler identification source file "CMakeCCompilerId.c" failed.
  676. Compiler: /opt/local/bin/clang-mp-13
  677. Build flags:
  678. Id flags: -D__CLASSIC_C__
  679.  
  680. The output was:
  681. 69
  682. 2022-07-16 05:20:06.002 xcodebuild[15623:1207] [MT] DVTAssertions: ASSERTION FAILURE in /SourceCache/DVTFoundation/DVTFoundation-1828/Framework/Classes/FilePaths/DVTFilePath.m:379
  683. Details: fsrep is absolute (starts with /) ('/opt/local/libexec/llvm-13/bin/clang') parentPath must be nil but it is not ('<DVTFilePath:0x40012a880:'/Applications/Xcode.app/Contents/Developer/Toolchains/XcodeDefault.xctoolchain/usr/bin'>')
  684. Object: <DVTFilePath>
  685. Method: +_filePathForParent:fileSystemRepresentation:length:allowCreation:
  686. Thread: <NSThread: 0x40030a1e0>{name = (null), num = 1}
  687. Hints: None
  688. Backtrace:
  689. 0 0x0000000107fc944c -[DVTAssertionHandler handleFailureInMethod:object:fileName:lineNumber:messageFormat:arguments:] (in DVTFoundation)
  690. 1 0x0000000107fc92a5 _DVTAssertionFailureHandler (in DVTFoundation)
  691. 2 0x0000000107f4c694 +[DVTFilePath _filePathForParent:fileSystemRepresentation:length:allowCreation:] (in DVTFoundation)
  692. 3 0x0000000107f4c372 +[DVTFilePath _filePathForParent:pathString:] (in DVTFoundation)
  693. 4 0x0000000107f8016b -[DVTSearchPath pathForFileWithRelativePathString:] (in DVTFoundation)
  694. 5 0x00000001087aca5b -[Xcode3CommandLineBuildTool _printPathToExecutableAndExit] (in Xcode3Core)
  695. 6 0x00000001087aebd4 -[Xcode3CommandLineBuildTool run] (in Xcode3Core)
  696. 7 0x0000000107f3cb46 (in xcodebuild)
  697. 8 0x0000000107f3c91c (in xcodebuild)
  698. 9 0x0000000000000005
  699. xcrun: error: /Applications/Xcode.app/Contents/Developer/usr/bin/xcodebuild failed with exit code 6
  700.  
  701.  
  702. Compiling the C compiler identification source file "CMakeCCompilerId.c" failed.
  703. Compiler: /opt/local/bin/clang-mp-13
  704. Build flags:
  705. Id flags: --target=arm-arm-none-eabi;-mcpu=cortex-m3
  706.  
  707. The output was:
  708. 69
  709. 2022-07-16 05:20:10.679 xcodebuild[15625:1207] [MT] DVTAssertions: ASSERTION FAILURE in /SourceCache/DVTFoundation/DVTFoundation-1828/Framework/Classes/FilePaths/DVTFilePath.m:379
  710. Details: fsrep is absolute (starts with /) ('/opt/local/libexec/llvm-13/bin/clang') parentPath must be nil but it is not ('<DVTFilePath:0x40012a740:'/Applications/Xcode.app/Contents/Developer/Toolchains/XcodeDefault.xctoolchain/usr/bin'>')
  711. Object: <DVTFilePath>
  712. Method: +_filePathForParent:fileSystemRepresentation:length:allowCreation:
  713. Thread: <NSThread: 0x40030a1e0>{name = (null), num = 1}
  714. Hints: None
  715. Backtrace:
  716. 0 0x000000010d7af44c -[DVTAssertionHandler handleFailureInMethod:object:fileName:lineNumber:messageFormat:arguments:] (in DVTFoundation)
  717. 1 0x000000010d7af2a5 _DVTAssertionFailureHandler (in DVTFoundation)
  718. 2 0x000000010d732694 +[DVTFilePath _filePathForParent:fileSystemRepresentation:length:allowCreation:] (in DVTFoundation)
  719. 3 0x000000010d732372 +[DVTFilePath _filePathForParent:pathString:] (in DVTFoundation)
  720. 4 0x000000010d76616b -[DVTSearchPath pathForFileWithRelativePathString:] (in DVTFoundation)
  721. 5 0x000000010df91a5b -[Xcode3CommandLineBuildTool _printPathToExecutableAndExit] (in Xcode3Core)
  722. 6 0x000000010df93bd4 -[Xcode3CommandLineBuildTool run] (in Xcode3Core)
  723. 7 0x000000010d726b46 (in xcodebuild)
  724. 8 0x000000010d72691c (in xcodebuild)
  725. 9 0x0000000000000005
  726. xcrun: error: /Applications/Xcode.app/Contents/Developer/usr/bin/xcodebuild failed with exit code 6
  727.  
  728.  
  729. Compiling the C compiler identification source file "CMakeCCompilerId.c" failed.
  730. Compiler: /opt/local/bin/clang-mp-13
  731. Build flags:
  732. Id flags: -c;-I__does_not_exist__
  733.  
  734. The output was:
  735. 69
  736. 2022-07-16 05:20:16.002 xcodebuild[15628:1207] [MT] DVTAssertions: ASSERTION FAILURE in /SourceCache/DVTFoundation/DVTFoundation-1828/Framework/Classes/FilePaths/DVTFilePath.m:379
  737. Details: fsrep is absolute (starts with /) ('/opt/local/libexec/llvm-13/bin/clang') parentPath must be nil but it is not ('<DVTFilePath:0x40012a880:'/Applications/Xcode.app/Contents/Developer/Toolchains/XcodeDefault.xctoolchain/usr/bin'>')
  738. Object: <DVTFilePath>
  739. Method: +_filePathForParent:fileSystemRepresentation:length:allowCreation:
  740. Thread: <NSThread: 0x40030a1e0>{name = (null), num = 1}
  741. Hints: None
  742. Backtrace:
  743. 0 0x00000001002bc44c -[DVTAssertionHandler handleFailureInMethod:object:fileName:lineNumber:messageFormat:arguments:] (in DVTFoundation)
  744. 1 0x00000001002bc2a5 _DVTAssertionFailureHandler (in DVTFoundation)
  745. 2 0x000000010023f694 +[DVTFilePath _filePathForParent:fileSystemRepresentation:length:allowCreation:] (in DVTFoundation)
  746. 3 0x000000010023f372 +[DVTFilePath _filePathForParent:pathString:] (in DVTFoundation)
  747. 4 0x000000010027316b -[DVTSearchPath pathForFileWithRelativePathString:] (in DVTFoundation)
  748. 5 0x0000000100a9ca5b -[Xcode3CommandLineBuildTool _printPathToExecutableAndExit] (in Xcode3Core)
  749. 6 0x0000000100a9ebd4 -[Xcode3CommandLineBuildTool run] (in Xcode3Core)
  750. 7 0x0000000100230b46 (in xcodebuild)
  751. 8 0x000000010023091c (in xcodebuild)
  752. 9 0x0000000000000005
  753. xcrun: error: /Applications/Xcode.app/Contents/Developer/usr/bin/xcodebuild failed with exit code 6
  754.  
  755.  
  756. Checking whether the C compiler is IAR using "" did not match "IAR .+ Compiler":
  757. 2022-07-16 05:20:20.959 xcodebuild[15630:1207] [MT] DVTAssertions: ASSERTION FAILURE in /SourceCache/DVTFoundation/DVTFoundation-1828/Framework/Classes/FilePaths/DVTFilePath.m:379
  758. Details: fsrep is absolute (starts with /) ('/opt/local/libexec/llvm-13/bin/clang') parentPath must be nil but it is not ('<DVTFilePath:0x40012a4c0:'/Applications/Xcode.app/Contents/Developer/Toolchains/XcodeDefault.xctoolchain/usr/bin'>')
  759. Object: <DVTFilePath>
  760. Method: +_filePathForParent:fileSystemRepresentation:length:allowCreation:
  761. Thread: <NSThread: 0x40030a1e0>{name = (null), num = 1}
  762. Hints: None
  763. Backtrace:
  764. 0 0x0000000109fe544c -[DVTAssertionHandler handleFailureInMethod:object:fileName:lineNumber:messageFormat:arguments:] (in DVTFoundation)
  765. 1 0x0000000109fe52a5 _DVTAssertionFailureHandler (in DVTFoundation)
  766. 2 0x0000000109f68694 +[DVTFilePath _filePathForParent:fileSystemRepresentation:length:allowCreation:] (in DVTFoundation)
  767. 3 0x0000000109f68372 +[DVTFilePath _filePathForParent:pathString:] (in DVTFoundation)
  768. 4 0x0000000109f9c16b -[DVTSearchPath pathForFileWithRelativePathString:] (in DVTFoundation)
  769. 5 0x000000010a7c5a5b -[Xcode3CommandLineBuildTool _printPathToExecutableAndExit] (in Xcode3Core)
  770. 6 0x000000010a7c7bd4 -[Xcode3CommandLineBuildTool run] (in Xcode3Core)
  771. 7 0x0000000109f57b46 (in xcodebuild)
  772. 8 0x0000000109f5791c (in xcodebuild)
  773. 9 0x0000000000000005
  774. xcrun: error: /Applications/Xcode.app/Contents/Developer/usr/bin/xcodebuild failed with exit code 6
  775. Checking whether the C compiler is IAR using "" did not match "IAR .+ Compiler":
  776. 2022-07-16 05:20:26.002 xcodebuild[15634:1207] [MT] DVTAssertions: ASSERTION FAILURE in /SourceCache/DVTFoundation/DVTFoundation-1828/Framework/Classes/FilePaths/DVTFilePath.m:379
  777. Details: fsrep is absolute (starts with /) ('/opt/local/libexec/llvm-13/bin/clang') parentPath must be nil but it is not ('<DVTFilePath:0x40012a740:'/Applications/Xcode.app/Contents/Developer/Toolchains/XcodeDefault.xctoolchain/usr/bin'>')
  778. Object: <DVTFilePath>
  779. Method: +_filePathForParent:fileSystemRepresentation:length:allowCreation:
  780. Thread: <NSThread: 0x40030a1e0>{name = (null), num = 1}
  781. Hints: None
  782. Backtrace:
  783. 0 0x000000010652d44c -[DVTAssertionHandler handleFailureInMethod:object:fileName:lineNumber:messageFormat:arguments:] (in DVTFoundation)
  784. 1 0x000000010652d2a5 _DVTAssertionFailureHandler (in DVTFoundation)
  785. 2 0x00000001064b0694 +[DVTFilePath _filePathForParent:fileSystemRepresentation:length:allowCreation:] (in DVTFoundation)
  786. 3 0x00000001064b0372 +[DVTFilePath _filePathForParent:pathString:] (in DVTFoundation)
  787. 4 0x00000001064e416b -[DVTSearchPath pathForFileWithRelativePathString:] (in DVTFoundation)
  788. 5 0x0000000106d10a5b -[Xcode3CommandLineBuildTool _printPathToExecutableAndExit] (in Xcode3Core)
  789. 6 0x0000000106d12bd4 -[Xcode3CommandLineBuildTool run] (in Xcode3Core)
  790. 7 0x00000001064a5b46 (in xcodebuild)
  791. 8 0x00000001064a591c (in xcodebuild)
  792. 9 0x0000000000000005
  793. xcrun: error: /Applications/Xcode.app/Contents/Developer/usr/bin/xcodebuild failed with exit code 6
  794. Detecting C compiler ABI info failed to compile with the following output:
  795. Change Dir: /opt/local/var/macports/build/_opt_local_var_macports_sources_rsync.macports.org_macports_release_tarballs_ports_graphics_glfw/glfw/work/build/CMakeFiles/CMakeTmp
  796.  
  797. Run Build Command(s):/usr/bin/make -f Makefile cmTC_f653b/fast && /usr/bin/make -f CMakeFiles/cmTC_f653b.dir/build.make CMakeFiles/cmTC_f653b.dir/build
  798. Building C object CMakeFiles/cmTC_f653b.dir/CMakeCCompilerABI.c.o
  799. /opt/local/bin/clang-mp-13 -pipe -Os -DNDEBUG -I/opt/local/include -arch x86_64 -o CMakeFiles/cmTC_f653b.dir/CMakeCCompilerABI.c.o -c /opt/local/share/cmake-3.23/Modules/CMakeCCompilerABI.c
  800. 2022-07-16 05:20:31.175 xcodebuild[15643:1207] [MT] DVTAssertions: ASSERTION FAILURE in /SourceCache/DVTFoundation/DVTFoundation-1828/Framework/Classes/FilePaths/DVTFilePath.m:379
  801. Details: fsrep is absolute (starts with /) ('/opt/local/libexec/llvm-13/bin/clang') parentPath must be nil but it is not ('<DVTFilePath:0x40012ab00:'/Applications/Xcode.app/Contents/Developer/Toolchains/XcodeDefault.xctoolchain/usr/bin'>')
  802. Object: <DVTFilePath>
  803. Method: +_filePathForParent:fileSystemRepresentation:length:allowCreation:
  804. Thread: <NSThread: 0x40030a1e0>{name = (null), num = 1}
  805. Hints: None
  806. Backtrace:
  807. 0 0x000000010624644c -[DVTAssertionHandler handleFailureInMethod:object:fileName:lineNumber:messageFormat:arguments:] (in DVTFoundation)
  808. 1 0x00000001062462a5 _DVTAssertionFailureHandler (in DVTFoundation)
  809. 2 0x00000001061c9694 +[DVTFilePath _filePathForParent:fileSystemRepresentation:length:allowCreation:] (in DVTFoundation)
  810. 3 0x00000001061c9372 +[DVTFilePath _filePathForParent:pathString:] (in DVTFoundation)
  811. 4 0x00000001061fd16b -[DVTSearchPath pathForFileWithRelativePathString:] (in DVTFoundation)
  812. 5 0x0000000106a23a5b -[Xcode3CommandLineBuildTool _printPathToExecutableAndExit] (in Xcode3Core)
  813. 6 0x0000000106a25bd4 -[Xcode3CommandLineBuildTool run] (in Xcode3Core)
  814. 7 0x00000001061b7b46 (in xcodebuild)
  815. 8 0x00000001061b791c (in xcodebuild)
  816. 9 0x0000000000000005
  817. xcrun: error: /Applications/Xcode.app/Contents/Developer/usr/bin/xcodebuild failed with exit code 6
  818. make[1]: *** [CMakeFiles/cmTC_f653b.dir/CMakeCCompilerABI.c.o] Error 69
  819. make: *** [cmTC_f653b/fast] Error 2
  820.  
  821.  
  822.  
  823.  
  824. Determining if the C compiler works failed with the following output:
  825. Change Dir: /opt/local/var/macports/build/_opt_local_var_macports_sources_rsync.macports.org_macports_release_tarballs_ports_graphics_glfw/glfw/work/build/CMakeFiles/CMakeTmp
  826.  
  827. Run Build Command(s):/usr/bin/make -f Makefile cmTC_6cb77/fast && /usr/bin/make -f CMakeFiles/cmTC_6cb77.dir/build.make CMakeFiles/cmTC_6cb77.dir/build
  828. Building C object CMakeFiles/cmTC_6cb77.dir/testCCompiler.c.o
  829. /opt/local/bin/clang-mp-13 -pipe -Os -DNDEBUG -I/opt/local/include -arch x86_64 -o CMakeFiles/cmTC_6cb77.dir/testCCompiler.c.o -c /opt/local/var/macports/build/_opt_local_var_macports_sources_rsync.macports.org_macports_release_tarballs_ports_graphics_glfw/glfw/work/build/CMakeFiles/CMakeTmp/testCCompiler.c
  830. 2022-07-16 05:20:37.002 xcodebuild[15652:1207] [MT] DVTAssertions: ASSERTION FAILURE in /SourceCache/DVTFoundation/DVTFoundation-1828/Framework/Classes/FilePaths/DVTFilePath.m:379
  831. Details: fsrep is absolute (starts with /) ('/opt/local/libexec/llvm-13/bin/clang') parentPath must be nil but it is not ('<DVTFilePath:0x40012a9c0:'/Applications/Xcode.app/Contents/Developer/Toolchains/XcodeDefault.xctoolchain/usr/bin'>')
  832. Object: <DVTFilePath>
  833. Method: +_filePathForParent:fileSystemRepresentation:length:allowCreation:
  834. Thread: <NSThread: 0x40030a1e0>{name = (null), num = 1}
  835. Hints: None
  836. Backtrace:
  837. 0 0x000000010e0ec44c -[DVTAssertionHandler handleFailureInMethod:object:fileName:lineNumber:messageFormat:arguments:] (in DVTFoundation)
  838. 1 0x000000010e0ec2a5 _DVTAssertionFailureHandler (in DVTFoundation)
  839. 2 0x000000010e06f694 +[DVTFilePath _filePathForParent:fileSystemRepresentation:length:allowCreation:] (in DVTFoundation)
  840. 3 0x000000010e06f372 +[DVTFilePath _filePathForParent:pathString:] (in DVTFoundation)
  841. 4 0x000000010e0a316b -[DVTSearchPath pathForFileWithRelativePathString:] (in DVTFoundation)
  842. 5 0x000000010e8c7a5b -[Xcode3CommandLineBuildTool _printPathToExecutableAndExit] (in Xcode3Core)
  843. 6 0x000000010e8c9bd4 -[Xcode3CommandLineBuildTool run] (in Xcode3Core)
  844. 7 0x000000010e05db46 (in xcodebuild)
  845. 8 0x000000010e05d91c (in xcodebuild)
  846. xcrun: error: /Applications/Xcode.app/Contents/Developer/usr/bin/xcodebuild failed with exit code 6
  847. make[1]: *** [CMakeFiles/cmTC_6cb77.dir/testCCompiler.c.o] Error 69
  848. make: *** [cmTC_6cb77/fast] Error 2
  849.  
  850.  
  851.  
  852.  
Advertisement
Add Comment
Please, Sign In to add comment