Advertisement
Guest User

Untitled

a guest
Aug 30th, 2023
43
0
Never
Not a member of Pastebin yet? Sign Up, it unlocks many cool features!
text 3.99 KB | None | 0 0
  1. src/libavcodec/x86/mathops.h:125: Error: operand type mismatch for `shr'
  2. src/libavcodec/x86/mathops.h:125: Error: operand type mismatch for `shr'
  3. src/libavcodec/x86/mathops.h:125: Error: operand type mismatch for `shr'
  4. src/libavcodec/x86/mathops.h:125: Error: operand type mismatch for `shr'
  5. src/libavcodec/x86/mathops.h:125: Error: operand type mismatch for `shr'
  6. src/libavcodec/x86/mathops.h:125: Error: operand type mismatch for `shr'
  7. src/libavcodec/x86/mathops.h:125: Error: operand type mismatch for `shr'
  8. src/libavcodec/x86/mathops.h:125: Error: operand type mismatch for `shr'
  9. src/libavcodec/x86/mathops.h:125: Error: operand type mismatch for `shr'
  10. src/libavcodec/x86/mathops.h:125: Error: operand type mismatch for `shr'
  11. src/libavcodec/x86/mathops.h:125: Error: operand type mismatch for `shr'
  12. src/libavcodec/x86/mathops.h:125: Error: operand type mismatch for `shr'
  13. src/libavcodec/x86/mathops.h:125: Error: operand type mismatch for `shr'
  14. src/libavcodec/x86/mathops.h:125: Error: operand type mismatch for `shr'
  15. src/libavcodec/x86/mathops.h:125: Error: operand type mismatch for `shr'
  16. src/libavcodec/x86/mathops.h:125: Error: operand type mismatch for `shr'
  17. src/libavcodec/x86/mathops.h:125: Error: operand type mismatch for `shr'
  18. src/libavcodec/x86/mathops.h:125: Error: operand type mismatch for `shr'
  19. src/libavcodec/x86/mathops.h:125: Error: operand type mismatch for `shr'
  20. src/libavcodec/x86/mathops.h:125: Error: operand type mismatch for `shr'
  21. src/libavcodec/x86/mathops.h:125: Error: operand type mismatch for `shr'
  22. src/libavcodec/x86/mathops.h:125: Error: operand type mismatch for `shr'
  23. src/libavcodec/x86/mathops.h:125: Error: operand type mismatch for `shr'
  24. src/libavcodec/x86/mathops.h:125: Error: operand type mismatch for `shr'
  25. src/libavcodec/x86/mathops.h:125: Error: operand type mismatch for `shr'
  26. src/libavcodec/x86/mathops.h:125: Error: operand type mismatch for `shr'
  27. src/libavcodec/x86/mathops.h:125: Error: operand type mismatch for `shr'
  28. src/libavcodec/x86/mathops.h:125: Error: operand type mismatch for `shr'
  29. src/libavcodec/x86/mathops.h:125: Error: operand type mismatch for `shr'
  30. src/libavcodec/x86/mathops.h:125: Error: operand type mismatch for `shr'
  31. src/libavcodec/x86/mathops.h:125: Error: operand type mismatch for `shr'
  32. make: *** [/home/es20490446e/Documents/Projects/Ikigai/darkmod-linux/darkmod-linux/_BUILD/1-workspace.../3-buildDevelLibs.../.conan/data/ffmpeg/4.4.1/thedarkmod/local/build/f6bc05e55d07c79c6d08b1bac3786ad7aabce255/source_subfolder/ffbuild/common.mak:67: libavcodec/aacdec.o] Error 1
  33. src/libavcodec/x86/mathops.h: Assembler messages:
  34. src/libavcodec/x86/mathops.h:125: Error: operand type mismatch for `shr'
  35. src/libavcodec/x86/mathops.h:125: Error: operand type mismatch for `shr'
  36. src/libavcodec/x86/mathops.h:125: Error: operand type mismatch for `shr'
  37. src/libavcodec/x86/mathops.h:125: Error: operand type mismatch for `shr'
  38. src/libavcodec/x86/mathops.h:125: Error: operand type mismatch for `shr'
  39. src/libavcodec/x86/mathops.h:125: Error: operand type mismatch for `shr'
  40. src/libavcodec/x86/mathops.h:125: Error: operand type mismatch for `shr'
  41. src/libavcodec/x86/mathops.h:125: Error: operand type mismatch for `shr'
  42. src/libavcodec/x86/mathops.h:125: Error: operand type mismatch for `shr'
  43. make: *** [/home/es20490446e/Documents/Projects/Ikigai/darkmod-linux/darkmod-linux/_BUILD/1-workspace.../3-buildDevelLibs.../.conan/data/ffmpeg/4.4.1/thedarkmod/local/build/f6bc05e55d07c79c6d08b1bac3786ad7aabce255/source_subfolder/ffbuild/common.mak:67: libavformat/mov.o] Error 1
  44. ffmpeg/4.4.1@thedarkmod/local: ERROR: Package 'f6bc05e55d07c79c6d08b1bac3786ad7aabce255' build failed
  45. ffmpeg/4.4.1@thedarkmod/local: WARN: Build folder /home/es20490446e/Documents/Projects/Ikigai/darkmod-linux/darkmod-linux/_BUILD/1-workspace.../3-buildDevelLibs.../.conan/data/ffmpeg/4.4.1/thedarkmod/local/build/f6bc05e55d07c79c6d08b1bac3786ad7aabce255
  46. ERROR: ffmpeg/4.4.1@thedarkmod/local: Error in build() method, line 418
  47. autotools.make()
  48. ConanException: Error 2 while executing make -j12
Advertisement
Add Comment
Please, Sign In to add comment
Advertisement