Guest User

logs

a guest
May 30th, 2021
23
Never
Not a member of Pastebin yet? Sign Up, it unlocks many cool features!
  1. ➜ openmrs-module-referenceapplication git:(master) ✗ mvn clean install -e
  2. [INFO] Error stacktraces are turned on.
  3. [INFO] Scanning for projects...
  4. [WARNING]
  5. [WARNING] Some problems were encountered while building the effective model for org.openmrs.module:referenceapplication-omod:jar:2.12.0-SNAPSHOT
  6. [WARNING] 'build.plugins.plugin.(groupId:artifactId)' must be unique but found duplicate declaration of plugin org.apache.maven.plugins:maven-dependency-plugin @ line 231, column 21
  7. [WARNING] 'build.plugins.plugin.version' for de.saumya.mojo:gem-maven-plugin is missing. @ line 256, column 21
  8. [WARNING]
  9. [WARNING] It is highly recommended to fix these problems because they threaten the stability of your build.
  10. [WARNING]
  11. [WARNING] For this reason, future Maven versions might no longer support building such malformed projects.
  12. [WARNING]
  13. [INFO] ------------------------------------------------------------------------
  14. [INFO] Reactor Build Order:
  15. [INFO]
  16. [INFO] Reference Application Module [pom]
  17. [INFO] Reference Application Module API [jar]
  18. [INFO] Reference Application Module OMOD [jar]
  19. [INFO]
  20. [INFO] --------------< org.openmrs.module:referenceapplication >---------------
  21. [INFO] Building Reference Application Module 2.12.0-SNAPSHOT [1/3]
  22. [INFO] --------------------------------[ pom ]---------------------------------
  23. [INFO]
  24. [INFO] --- maven-clean-plugin:2.5:clean (default-clean) @ referenceapplication ---
  25. [INFO]
  26. [INFO] --- maven-install-plugin:2.4:install (default-install) @ referenceapplication ---
  27. [INFO] Installing /Users/danialbetres/openmrs/openmrs-module-referenceapplication/pom.xml to /Users/danialbetres/.m2/repository/org/openmrs/module/referenceapplication/2.12.0-SNAPSHOT/referenceapplication-2.12.0-SNAPSHOT.pom
  28. [INFO]
  29. [INFO] ------------< org.openmrs.module:referenceapplication-api >-------------
  30. [INFO] Building Reference Application Module API 2.12.0-SNAPSHOT [2/3]
  31. [INFO] --------------------------------[ jar ]---------------------------------
  32. Downloading from maven-default-http-blocker: http://0.0.0.0/org/openmrs/module/uiframework-api/3.21.0-SNAPSHOT/maven-metadata.xml
  33. [WARNING] Could not transfer metadata org.openmrs.module:uiframework-api:3.21.0-SNAPSHOT/maven-metadata.xml from/to maven-default-http-blocker (http://0.0.0.0/): transfer failed for http://0.0.0.0/org/openmrs/module/uiframework-api/3.21.0-SNAPSHOT/maven-metadata.xml
  34. [WARNING] org.openmrs.module:uiframework-api:3.21.0-SNAPSHOT/maven-metadata.xmlfailed to transfer from http://0.0.0.0/ during a previous attempt. This failure was cached in the local repository and resolution will not be reattempted until the update interval of maven-default-http-blocker has elapsed or updates are forced. Original error: Could not transfer metadata org.openmrs.module:uiframework-api:3.21.0-SNAPSHOT/maven-metadata.xml from/to maven-default-http-blocker (http://0.0.0.0/): transfer failed for http://0.0.0.0/org/openmrs/module/uiframework-api/3.21.0-SNAPSHOT/maven-metadata.xml
  35. Downloading from maven-default-http-blocker: http://0.0.0.0/org/openmrs/module/uiframework/3.21.0-SNAPSHOT/maven-metadata.xml
  36. [WARNING] Could not transfer metadata org.openmrs.module:uiframework:3.21.0-SNAPSHOT/maven-metadata.xml from/to maven-default-http-blocker (http://0.0.0.0/): transfer failed for http://0.0.0.0/org/openmrs/module/uiframework/3.21.0-SNAPSHOT/maven-metadata.xml
  37. [INFO]
  38. [INFO] --- maven-clean-plugin:2.5:clean (default-clean) @ referenceapplication-api ---
  39. [INFO] Deleting /Users/danialbetres/openmrs/openmrs-module-referenceapplication/api/target
  40. [INFO]
  41. [INFO] --- maven-resources-plugin:2.6:resources (default-resources) @ referenceapplication-api ---
  42. [INFO] Using 'UTF-8' encoding to copy filtered resources.
  43. [INFO] Copying 22 resources
  44. [INFO]
  45. [INFO] --- maven-compiler-plugin:3.1:compile (default-compile) @ referenceapplication-api ---
  46. [INFO] Changes detected - recompiling the module!
  47. [INFO] Compiling 3 source files to /Users/danialbetres/openmrs/openmrs-module-referenceapplication/api/target/classes
  48. [INFO]
  49. [INFO] --- maven-resources-plugin:2.6:testResources (default-testResources) @ referenceapplication-api ---
  50. [INFO] Using 'UTF-8' encoding to copy filtered resources.
  51. [INFO] Copying 3 resources
  52. [INFO]
  53. [INFO] --- maven-compiler-plugin:3.1:testCompile (default-testCompile) @ referenceapplication-api ---
  54. [INFO] Changes detected - recompiling the module!
  55. [INFO] Compiling 3 source files to /Users/danialbetres/openmrs/openmrs-module-referenceapplication/api/target/test-classes
  56. [INFO]
  57. [INFO] --- maven-surefire-plugin:2.22.1:test (default-test) @ referenceapplication-api ---
  58. [INFO] Surefire report directory: /Users/danialbetres/openmrs/openmrs-module-referenceapplication/api/target/surefire-reports
  59. [INFO]
  60. [INFO] -------------------------------------------------------
  61. [INFO] T E S T S
  62. [INFO] -------------------------------------------------------
  63. [INFO] Running org.openmrs.module.referenceapplication.administrativenotification.ConfigureAtlasNotificationProducerTest
  64. [INFO] Tests run: 1, Failures: 0, Errors: 0, Skipped: 0, Time elapsed: 33.65 s - in org.openmrs.module.referenceapplication.administrativenotification.ConfigureAtlasNotificationProducerTest
  65. [INFO] Running org.openmrs.module.referenceapplication.ReferenceApplicationActivatorComponentTest
  66. ERROR - ReferenceApplicationActivator.setupHtmlForms(219) |2021-05-30 22:18:09,642| Unable to load HTML forms--this error is expected when running component tests
  67. ERROR - ReferenceApplicationActivator.setupHtmlForms(219) |2021-05-30 22:18:09,781| Unable to load HTML forms--this error is expected when running component tests
  68. ERROR - ReferenceApplicationActivator.setupHtmlForms(219) |2021-05-30 22:18:09,866| Unable to load HTML forms--this error is expected when running component tests
  69. [INFO] Tests run: 4, Failures: 0, Errors: 0, Skipped: 0, Time elapsed: 1.902 s - in org.openmrs.module.referenceapplication.ReferenceApplicationActivatorComponentTest
  70. [INFO] Running org.openmrs.module.referenceapplication.ReferenceApplicationActivatorTest
  71. [INFO] Tests run: 2, Failures: 0, Errors: 0, Skipped: 0, Time elapsed: 0.069 s - in org.openmrs.module.referenceapplication.ReferenceApplicationActivatorTest
  72. [INFO]
  73. [INFO] Results:
  74. [INFO]
  75. [INFO] Tests run: 7, Failures: 0, Errors: 0, Skipped: 0
  76. [INFO]
  77. [INFO]
  78. [INFO] --- maven-jar-plugin:2.4:jar (default-jar) @ referenceapplication-api ---
  79. [INFO] Building jar: /Users/danialbetres/openmrs/openmrs-module-referenceapplication/api/target/referenceapplication-api-2.12.0-SNAPSHOT.jar
  80. [INFO]
  81. [INFO] --- maven-install-plugin:2.4:install (default-install) @ referenceapplication-api ---
  82. [INFO] Installing /Users/danialbetres/openmrs/openmrs-module-referenceapplication/api/target/referenceapplication-api-2.12.0-SNAPSHOT.jar to /Users/danialbetres/.m2/repository/org/openmrs/module/referenceapplication-api/2.12.0-SNAPSHOT/referenceapplication-api-2.12.0-SNAPSHOT.jar
  83. [INFO] Installing /Users/danialbetres/openmrs/openmrs-module-referenceapplication/api/pom.xml to /Users/danialbetres/.m2/repository/org/openmrs/module/referenceapplication-api/2.12.0-SNAPSHOT/referenceapplication-api-2.12.0-SNAPSHOT.pom
  84. [INFO]
  85. [INFO] ------------< org.openmrs.module:referenceapplication-omod >------------
  86. [INFO] Building Reference Application Module OMOD 2.12.0-SNAPSHOT [3/3]
  87. [INFO] --------------------------------[ jar ]---------------------------------
  88. Downloading from maven-default-http-blocker: http://0.0.0.0/rubygems/sass/maven-metadata.xml
  89. [WARNING] Could not transfer metadata rubygems:sass/maven-metadata.xml from/to maven-default-http-blocker (http://0.0.0.0/): transfer failed for http://0.0.0.0/rubygems/sass/maven-metadata.xml
  90. Downloading from maven-default-http-blocker: http://0.0.0.0/rubygems/chunky_png/maven-metadata.xml
  91. [WARNING] Could not transfer metadata rubygems:chunky_png/maven-metadata.xml from/to maven-default-http-blocker (http://0.0.0.0/): transfer failed for http://0.0.0.0/rubygems/chunky_png/maven-metadata.xml
  92. Downloading from maven-default-http-blocker: http://0.0.0.0/rubygems/fssm/maven-metadata.xml
  93. [WARNING] Could not transfer metadata rubygems:fssm/maven-metadata.xml from/to maven-default-http-blocker (http://0.0.0.0/): transfer failed for http://0.0.0.0/rubygems/fssm/maven-metadata.xml
  94. [INFO] ------------------------------------------------------------------------
  95. [INFO] Reactor Summary for Reference Application Module 2.12.0-SNAPSHOT:
  96. [INFO]
  97. [INFO] Reference Application Module ....................... SUCCESS [ 0.087 s]
  98. [INFO] Reference Application Module API ................... SUCCESS [ 52.883 s]
  99. [INFO] Reference Application Module OMOD .................. FAILURE [ 15.157 s]
  100. [INFO] ------------------------------------------------------------------------
  101. [INFO] BUILD FAILURE
  102. [INFO] ------------------------------------------------------------------------
  103. [INFO] Total time: 01:08 min
  104. [INFO] Finished at: 2021-05-30T22:18:25-04:00
  105. [INFO] ------------------------------------------------------------------------
  106. [ERROR] Failed to execute goal on project referenceapplication-omod: Could not resolve dependencies for project org.openmrs.module:referenceapplication-omod:jar:2.12.0-SNAPSHOT: Failed to collect dependencies at rubygems:chunky_png:gem:1.3.12: Failed to read artifact descriptor for rubygems:chunky_png:gem:1.3.12: Could not transfer artifact rubygems:chunky_png:pom:1.3.12 from/to maven-default-http-blocker (http://0.0.0.0/): Blocked mirror for repositories: [rubygems-releases (http://rubygems-proxy.torquebox.org/releases, default, releases+snapshots)] -> [Help 1]
  107. org.apache.maven.lifecycle.LifecycleExecutionException: Failed to execute goal on project referenceapplication-omod: Could not resolve dependencies for project org.openmrs.module:referenceapplication-omod:jar:2.12.0-SNAPSHOT: Failed to collect dependencies at rubygems:chunky_png:gem:1.3.12
  108. at org.apache.maven.lifecycle.internal.LifecycleDependencyResolver.getDependencies (LifecycleDependencyResolver.java:269)
  109. at org.apache.maven.lifecycle.internal.LifecycleDependencyResolver.resolveProjectDependencies (LifecycleDependencyResolver.java:147)
  110. at org.apache.maven.lifecycle.internal.MojoExecutor.ensureDependenciesAreResolved (MojoExecutor.java:248)
  111. at org.apache.maven.lifecycle.internal.MojoExecutor.execute (MojoExecutor.java:202)
  112. at org.apache.maven.lifecycle.internal.MojoExecutor.execute (MojoExecutor.java:156)
  113. at org.apache.maven.lifecycle.internal.MojoExecutor.execute (MojoExecutor.java:148)
  114. at org.apache.maven.lifecycle.internal.LifecycleModuleBuilder.buildProject (LifecycleModuleBuilder.java:117)
  115. at org.apache.maven.lifecycle.internal.LifecycleModuleBuilder.buildProject (LifecycleModuleBuilder.java:81)
  116. at org.apache.maven.lifecycle.internal.builder.singlethreaded.SingleThreadedBuilder.build (SingleThreadedBuilder.java:56)
  117. at org.apache.maven.lifecycle.internal.LifecycleStarter.execute (LifecycleStarter.java:128)
  118. at org.apache.maven.DefaultMaven.doExecute (DefaultMaven.java:305)
  119. at org.apache.maven.DefaultMaven.doExecute (DefaultMaven.java:192)
  120. at org.apache.maven.DefaultMaven.execute (DefaultMaven.java:105)
  121. at org.apache.maven.cli.MavenCli.execute (MavenCli.java:957)
  122. at org.apache.maven.cli.MavenCli.doMain (MavenCli.java:289)
  123. at org.apache.maven.cli.MavenCli.main (MavenCli.java:193)
  124. at sun.reflect.NativeMethodAccessorImpl.invoke0 (Native Method)
  125. at sun.reflect.NativeMethodAccessorImpl.invoke (NativeMethodAccessorImpl.java:62)
  126. at sun.reflect.DelegatingMethodAccessorImpl.invoke (DelegatingMethodAccessorImpl.java:43)
  127. at java.lang.reflect.Method.invoke (Method.java:498)
  128. at org.codehaus.plexus.classworlds.launcher.Launcher.launchEnhanced (Launcher.java:282)
  129. at org.codehaus.plexus.classworlds.launcher.Launcher.launch (Launcher.java:225)
  130. at org.codehaus.plexus.classworlds.launcher.Launcher.mainWithExitCode (Launcher.java:406)
  131. at org.codehaus.plexus.classworlds.launcher.Launcher.main (Launcher.java:347)
  132. Caused by: org.apache.maven.project.DependencyResolutionException: Could not resolve dependencies for project org.openmrs.module:referenceapplication-omod:jar:2.12.0-SNAPSHOT: Failed to collect dependencies at rubygems:chunky_png:gem:1.3.12
  133. at org.apache.maven.project.DefaultProjectDependenciesResolver.resolve (DefaultProjectDependenciesResolver.java:178)
  134. at org.apache.maven.lifecycle.internal.LifecycleDependencyResolver.getDependencies (LifecycleDependencyResolver.java:243)
  135. at org.apache.maven.lifecycle.internal.LifecycleDependencyResolver.resolveProjectDependencies (LifecycleDependencyResolver.java:147)
  136. at org.apache.maven.lifecycle.internal.MojoExecutor.ensureDependenciesAreResolved (MojoExecutor.java:248)
  137. at org.apache.maven.lifecycle.internal.MojoExecutor.execute (MojoExecutor.java:202)
  138. at org.apache.maven.lifecycle.internal.MojoExecutor.execute (MojoExecutor.java:156)
  139. at org.apache.maven.lifecycle.internal.MojoExecutor.execute (MojoExecutor.java:148)
  140. at org.apache.maven.lifecycle.internal.LifecycleModuleBuilder.buildProject (LifecycleModuleBuilder.java:117)
  141. at org.apache.maven.lifecycle.internal.LifecycleModuleBuilder.buildProject (LifecycleModuleBuilder.java:81)
  142. at org.apache.maven.lifecycle.internal.builder.singlethreaded.SingleThreadedBuilder.build (SingleThreadedBuilder.java:56)
  143. at org.apache.maven.lifecycle.internal.LifecycleStarter.execute (LifecycleStarter.java:128)
  144. at org.apache.maven.DefaultMaven.doExecute (DefaultMaven.java:305)
  145. at org.apache.maven.DefaultMaven.doExecute (DefaultMaven.java:192)
  146. at org.apache.maven.DefaultMaven.execute (DefaultMaven.java:105)
  147. at org.apache.maven.cli.MavenCli.execute (MavenCli.java:957)
  148. at org.apache.maven.cli.MavenCli.doMain (MavenCli.java:289)
  149. at org.apache.maven.cli.MavenCli.main (MavenCli.java:193)
  150. at sun.reflect.NativeMethodAccessorImpl.invoke0 (Native Method)
  151. at sun.reflect.NativeMethodAccessorImpl.invoke (NativeMethodAccessorImpl.java:62)
  152. at sun.reflect.DelegatingMethodAccessorImpl.invoke (DelegatingMethodAccessorImpl.java:43)
  153. at java.lang.reflect.Method.invoke (Method.java:498)
  154. at org.codehaus.plexus.classworlds.launcher.Launcher.launchEnhanced (Launcher.java:282)
  155. at org.codehaus.plexus.classworlds.launcher.Launcher.launch (Launcher.java:225)
  156. at org.codehaus.plexus.classworlds.launcher.Launcher.mainWithExitCode (Launcher.java:406)
  157. at org.codehaus.plexus.classworlds.launcher.Launcher.main (Launcher.java:347)
  158. Caused by: org.eclipse.aether.collection.DependencyCollectionException: Failed to collect dependencies at rubygems:chunky_png:gem:1.3.12
  159. at org.eclipse.aether.internal.impl.collect.DefaultDependencyCollector.collectDependencies (DefaultDependencyCollector.java:288)
  160. at org.eclipse.aether.internal.impl.DefaultRepositorySystem.collectDependencies (DefaultRepositorySystem.java:284)
  161. at org.apache.maven.project.DefaultProjectDependenciesResolver.resolve (DefaultProjectDependenciesResolver.java:169)
  162. at org.apache.maven.lifecycle.internal.LifecycleDependencyResolver.getDependencies (LifecycleDependencyResolver.java:243)
  163. at org.apache.maven.lifecycle.internal.LifecycleDependencyResolver.resolveProjectDependencies (LifecycleDependencyResolver.java:147)
  164. at org.apache.maven.lifecycle.internal.MojoExecutor.ensureDependenciesAreResolved (MojoExecutor.java:248)
  165. at org.apache.maven.lifecycle.internal.MojoExecutor.execute (MojoExecutor.java:202)
  166. at org.apache.maven.lifecycle.internal.MojoExecutor.execute (MojoExecutor.java:156)
  167. at org.apache.maven.lifecycle.internal.MojoExecutor.execute (MojoExecutor.java:148)
  168. at org.apache.maven.lifecycle.internal.LifecycleModuleBuilder.buildProject (LifecycleModuleBuilder.java:117)
  169. at org.apache.maven.lifecycle.internal.LifecycleModuleBuilder.buildProject (LifecycleModuleBuilder.java:81)
  170. at org.apache.maven.lifecycle.internal.builder.singlethreaded.SingleThreadedBuilder.build (SingleThreadedBuilder.java:56)
  171. at org.apache.maven.lifecycle.internal.LifecycleStarter.execute (LifecycleStarter.java:128)
  172. at org.apache.maven.DefaultMaven.doExecute (DefaultMaven.java:305)
  173. at org.apache.maven.DefaultMaven.doExecute (DefaultMaven.java:192)
  174. at org.apache.maven.DefaultMaven.execute (DefaultMaven.java:105)
  175. at org.apache.maven.cli.MavenCli.execute (MavenCli.java:957)
  176. at org.apache.maven.cli.MavenCli.doMain (MavenCli.java:289)
  177. at org.apache.maven.cli.MavenCli.main (MavenCli.java:193)
  178. at sun.reflect.NativeMethodAccessorImpl.invoke0 (Native Method)
  179. at sun.reflect.NativeMethodAccessorImpl.invoke (NativeMethodAccessorImpl.java:62)
  180. at sun.reflect.DelegatingMethodAccessorImpl.invoke (DelegatingMethodAccessorImpl.java:43)
  181. at java.lang.reflect.Method.invoke (Method.java:498)
  182. at org.codehaus.plexus.classworlds.launcher.Launcher.launchEnhanced (Launcher.java:282)
  183. at org.codehaus.plexus.classworlds.launcher.Launcher.launch (Launcher.java:225)
  184. at org.codehaus.plexus.classworlds.launcher.Launcher.mainWithExitCode (Launcher.java:406)
  185. at org.codehaus.plexus.classworlds.launcher.Launcher.main (Launcher.java:347)
  186. Caused by: org.eclipse.aether.resolution.ArtifactDescriptorException: Failed to read artifact descriptor for rubygems:chunky_png:gem:1.3.12
  187. at org.apache.maven.repository.internal.DefaultArtifactDescriptorReader.loadPom (DefaultArtifactDescriptorReader.java:255)
  188. at org.apache.maven.repository.internal.DefaultArtifactDescriptorReader.readArtifactDescriptor (DefaultArtifactDescriptorReader.java:171)
  189. at org.eclipse.aether.internal.impl.collect.DefaultDependencyCollector.resolveCachedArtifactDescriptor (DefaultDependencyCollector.java:538)
  190. at org.eclipse.aether.internal.impl.collect.DefaultDependencyCollector.getArtifactDescriptorResult (DefaultDependencyCollector.java:523)
  191. at org.eclipse.aether.internal.impl.collect.DefaultDependencyCollector.processDependency (DefaultDependencyCollector.java:410)
  192. at org.eclipse.aether.internal.impl.collect.DefaultDependencyCollector.processDependency (DefaultDependencyCollector.java:362)
  193. at org.eclipse.aether.internal.impl.collect.DefaultDependencyCollector.process (DefaultDependencyCollector.java:349)
  194. at org.eclipse.aether.internal.impl.collect.DefaultDependencyCollector.collectDependencies (DefaultDependencyCollector.java:254)
  195. at org.eclipse.aether.internal.impl.DefaultRepositorySystem.collectDependencies (DefaultRepositorySystem.java:284)
  196. at org.apache.maven.project.DefaultProjectDependenciesResolver.resolve (DefaultProjectDependenciesResolver.java:169)
  197. at org.apache.maven.lifecycle.internal.LifecycleDependencyResolver.getDependencies (LifecycleDependencyResolver.java:243)
  198. at org.apache.maven.lifecycle.internal.LifecycleDependencyResolver.resolveProjectDependencies (LifecycleDependencyResolver.java:147)
  199. at org.apache.maven.lifecycle.internal.MojoExecutor.ensureDependenciesAreResolved (MojoExecutor.java:248)
  200. at org.apache.maven.lifecycle.internal.MojoExecutor.execute (MojoExecutor.java:202)
  201. at org.apache.maven.lifecycle.internal.MojoExecutor.execute (MojoExecutor.java:156)
  202. at org.apache.maven.lifecycle.internal.MojoExecutor.execute (MojoExecutor.java:148)
  203. at org.apache.maven.lifecycle.internal.LifecycleModuleBuilder.buildProject (LifecycleModuleBuilder.java:117)
  204. at org.apache.maven.lifecycle.internal.LifecycleModuleBuilder.buildProject (LifecycleModuleBuilder.java:81)
  205. at org.apache.maven.lifecycle.internal.builder.singlethreaded.SingleThreadedBuilder.build (SingleThreadedBuilder.java:56)
  206. at org.apache.maven.lifecycle.internal.LifecycleStarter.execute (LifecycleStarter.java:128)
  207. at org.apache.maven.DefaultMaven.doExecute (DefaultMaven.java:305)
  208. at org.apache.maven.DefaultMaven.doExecute (DefaultMaven.java:192)
  209. at org.apache.maven.DefaultMaven.execute (DefaultMaven.java:105)
  210. at org.apache.maven.cli.MavenCli.execute (MavenCli.java:957)
  211. at org.apache.maven.cli.MavenCli.doMain (MavenCli.java:289)
  212. at org.apache.maven.cli.MavenCli.main (MavenCli.java:193)
  213. at sun.reflect.NativeMethodAccessorImpl.invoke0 (Native Method)
  214. at sun.reflect.NativeMethodAccessorImpl.invoke (NativeMethodAccessorImpl.java:62)
  215. at sun.reflect.DelegatingMethodAccessorImpl.invoke (DelegatingMethodAccessorImpl.java:43)
  216. at java.lang.reflect.Method.invoke (Method.java:498)
  217. at org.codehaus.plexus.classworlds.launcher.Launcher.launchEnhanced (Launcher.java:282)
  218. at org.codehaus.plexus.classworlds.launcher.Launcher.launch (Launcher.java:225)
  219. at org.codehaus.plexus.classworlds.launcher.Launcher.mainWithExitCode (Launcher.java:406)
  220. at org.codehaus.plexus.classworlds.launcher.Launcher.main (Launcher.java:347)
  221. Caused by: org.eclipse.aether.resolution.ArtifactResolutionException: Could not transfer artifact rubygems:chunky_png:pom:1.3.12 from/to maven-default-http-blocker (http://0.0.0.0/): Blocked mirror for repositories: [rubygems-releases (http://rubygems-proxy.torquebox.org/releases, default, releases+snapshots)]
  222. at org.eclipse.aether.internal.impl.DefaultArtifactResolver.resolve (DefaultArtifactResolver.java:424)
  223. at org.eclipse.aether.internal.impl.DefaultArtifactResolver.resolveArtifacts (DefaultArtifactResolver.java:229)
  224. at org.eclipse.aether.internal.impl.DefaultArtifactResolver.resolveArtifact (DefaultArtifactResolver.java:207)
  225. at org.apache.maven.repository.internal.DefaultArtifactDescriptorReader.loadPom (DefaultArtifactDescriptorReader.java:240)
  226. at org.apache.maven.repository.internal.DefaultArtifactDescriptorReader.readArtifactDescriptor (DefaultArtifactDescriptorReader.java:171)
  227. at org.eclipse.aether.internal.impl.collect.DefaultDependencyCollector.resolveCachedArtifactDescriptor (DefaultDependencyCollector.java:538)
  228. at org.eclipse.aether.internal.impl.collect.DefaultDependencyCollector.getArtifactDescriptorResult (DefaultDependencyCollector.java:523)
  229. at org.eclipse.aether.internal.impl.collect.DefaultDependencyCollector.processDependency (DefaultDependencyCollector.java:410)
  230. at org.eclipse.aether.internal.impl.collect.DefaultDependencyCollector.processDependency (DefaultDependencyCollector.java:362)
  231. at org.eclipse.aether.internal.impl.collect.DefaultDependencyCollector.process (DefaultDependencyCollector.java:349)
  232. at org.eclipse.aether.internal.impl.collect.DefaultDependencyCollector.collectDependencies (DefaultDependencyCollector.java:254)
  233. at org.eclipse.aether.internal.impl.DefaultRepositorySystem.collectDependencies (DefaultRepositorySystem.java:284)
  234. at org.apache.maven.project.DefaultProjectDependenciesResolver.resolve (DefaultProjectDependenciesResolver.java:169)
  235. at org.apache.maven.lifecycle.internal.LifecycleDependencyResolver.getDependencies (LifecycleDependencyResolver.java:243)
  236. at org.apache.maven.lifecycle.internal.LifecycleDependencyResolver.resolveProjectDependencies (LifecycleDependencyResolver.java:147)
  237. at org.apache.maven.lifecycle.internal.MojoExecutor.ensureDependenciesAreResolved (MojoExecutor.java:248)
  238. at org.apache.maven.lifecycle.internal.MojoExecutor.execute (MojoExecutor.java:202)
  239. at org.apache.maven.lifecycle.internal.MojoExecutor.execute (MojoExecutor.java:156)
  240. at org.apache.maven.lifecycle.internal.MojoExecutor.execute (MojoExecutor.java:148)
  241. at org.apache.maven.lifecycle.internal.LifecycleModuleBuilder.buildProject (LifecycleModuleBuilder.java:117)
  242. at org.apache.maven.lifecycle.internal.LifecycleModuleBuilder.buildProject (LifecycleModuleBuilder.java:81)
  243. at org.apache.maven.lifecycle.internal.builder.singlethreaded.SingleThreadedBuilder.build (SingleThreadedBuilder.java:56)
  244. at org.apache.maven.lifecycle.internal.LifecycleStarter.execute (LifecycleStarter.java:128)
  245. at org.apache.maven.DefaultMaven.doExecute (DefaultMaven.java:305)
  246. at org.apache.maven.DefaultMaven.doExecute (DefaultMaven.java:192)
  247. at org.apache.maven.DefaultMaven.execute (DefaultMaven.java:105)
  248. at org.apache.maven.cli.MavenCli.execute (MavenCli.java:957)
  249. at org.apache.maven.cli.MavenCli.doMain (MavenCli.java:289)
  250. at org.apache.maven.cli.MavenCli.main (MavenCli.java:193)
  251. at sun.reflect.NativeMethodAccessorImpl.invoke0 (Native Method)
  252. at sun.reflect.NativeMethodAccessorImpl.invoke (NativeMethodAccessorImpl.java:62)
  253. at sun.reflect.DelegatingMethodAccessorImpl.invoke (DelegatingMethodAccessorImpl.java:43)
  254. at java.lang.reflect.Method.invoke (Method.java:498)
  255. at org.codehaus.plexus.classworlds.launcher.Launcher.launchEnhanced (Launcher.java:282)
  256. at org.codehaus.plexus.classworlds.launcher.Launcher.launch (Launcher.java:225)
  257. at org.codehaus.plexus.classworlds.launcher.Launcher.mainWithExitCode (Launcher.java:406)
  258. at org.codehaus.plexus.classworlds.launcher.Launcher.main (Launcher.java:347)
  259. Caused by: org.eclipse.aether.transfer.ArtifactTransferException: Could not transfer artifact rubygems:chunky_png:pom:1.3.12 from/to maven-default-http-blocker (http://0.0.0.0/): Blocked mirror for repositories: [rubygems-releases (http://rubygems-proxy.torquebox.org/releases, default, releases+snapshots)]
  260. at org.eclipse.aether.internal.impl.DefaultArtifactResolver.performDownloads (DefaultArtifactResolver.java:520)
  261. at org.eclipse.aether.internal.impl.DefaultArtifactResolver.resolve (DefaultArtifactResolver.java:401)
  262. at org.eclipse.aether.internal.impl.DefaultArtifactResolver.resolveArtifacts (DefaultArtifactResolver.java:229)
  263. at org.eclipse.aether.internal.impl.DefaultArtifactResolver.resolveArtifact (DefaultArtifactResolver.java:207)
  264. at org.apache.maven.repository.internal.DefaultArtifactDescriptorReader.loadPom (DefaultArtifactDescriptorReader.java:240)
  265. at org.apache.maven.repository.internal.DefaultArtifactDescriptorReader.readArtifactDescriptor (DefaultArtifactDescriptorReader.java:171)
  266. at org.eclipse.aether.internal.impl.collect.DefaultDependencyCollector.resolveCachedArtifactDescriptor (DefaultDependencyCollector.java:538)
  267. at org.eclipse.aether.internal.impl.collect.DefaultDependencyCollector.getArtifactDescriptorResult (DefaultDependencyCollector.java:523)
  268. at org.eclipse.aether.internal.impl.collect.DefaultDependencyCollector.processDependency (DefaultDependencyCollector.java:410)
  269. at org.eclipse.aether.internal.impl.collect.DefaultDependencyCollector.processDependency (DefaultDependencyCollector.java:362)
  270. at org.eclipse.aether.internal.impl.collect.DefaultDependencyCollector.process (DefaultDependencyCollector.java:349)
  271. at org.eclipse.aether.internal.impl.collect.DefaultDependencyCollector.collectDependencies (DefaultDependencyCollector.java:254)
  272. at org.eclipse.aether.internal.impl.DefaultRepositorySystem.collectDependencies (DefaultRepositorySystem.java:284)
  273. at org.apache.maven.project.DefaultProjectDependenciesResolver.resolve (DefaultProjectDependenciesResolver.java:169)
  274. at org.apache.maven.lifecycle.internal.LifecycleDependencyResolver.getDependencies (LifecycleDependencyResolver.java:243)
  275. at org.apache.maven.lifecycle.internal.LifecycleDependencyResolver.resolveProjectDependencies (LifecycleDependencyResolver.java:147)
  276. at org.apache.maven.lifecycle.internal.MojoExecutor.ensureDependenciesAreResolved (MojoExecutor.java:248)
  277. at org.apache.maven.lifecycle.internal.MojoExecutor.execute (MojoExecutor.java:202)
  278. at org.apache.maven.lifecycle.internal.MojoExecutor.execute (MojoExecutor.java:156)
  279. at org.apache.maven.lifecycle.internal.MojoExecutor.execute (MojoExecutor.java:148)
  280. at org.apache.maven.lifecycle.internal.LifecycleModuleBuilder.buildProject (LifecycleModuleBuilder.java:117)
  281. at org.apache.maven.lifecycle.internal.LifecycleModuleBuilder.buildProject (LifecycleModuleBuilder.java:81)
  282. at org.apache.maven.lifecycle.internal.builder.singlethreaded.SingleThreadedBuilder.build (SingleThreadedBuilder.java:56)
  283. at org.apache.maven.lifecycle.internal.LifecycleStarter.execute (LifecycleStarter.java:128)
  284. at org.apache.maven.DefaultMaven.doExecute (DefaultMaven.java:305)
  285. at org.apache.maven.DefaultMaven.doExecute (DefaultMaven.java:192)
  286. at org.apache.maven.DefaultMaven.execute (DefaultMaven.java:105)
  287. at org.apache.maven.cli.MavenCli.execute (MavenCli.java:957)
  288. at org.apache.maven.cli.MavenCli.doMain (MavenCli.java:289)
  289. at org.apache.maven.cli.MavenCli.main (MavenCli.java:193)
  290. at sun.reflect.NativeMethodAccessorImpl.invoke0 (Native Method)
  291. at sun.reflect.NativeMethodAccessorImpl.invoke (NativeMethodAccessorImpl.java:62)
  292. at sun.reflect.DelegatingMethodAccessorImpl.invoke (DelegatingMethodAccessorImpl.java:43)
  293. at java.lang.reflect.Method.invoke (Method.java:498)
  294. at org.codehaus.plexus.classworlds.launcher.Launcher.launchEnhanced (Launcher.java:282)
  295. at org.codehaus.plexus.classworlds.launcher.Launcher.launch (Launcher.java:225)
  296. at org.codehaus.plexus.classworlds.launcher.Launcher.mainWithExitCode (Launcher.java:406)
  297. at org.codehaus.plexus.classworlds.launcher.Launcher.main (Launcher.java:347)
  298. Caused by: org.eclipse.aether.transfer.NoRepositoryConnectorException: Blocked mirror for repositories: [rubygems-releases (http://rubygems-proxy.torquebox.org/releases, default, releases+snapshots)]
  299. at org.eclipse.aether.internal.impl.DefaultArtifactResolver.performDownloads (DefaultArtifactResolver.java:506)
  300. at org.eclipse.aether.internal.impl.DefaultArtifactResolver.resolve (DefaultArtifactResolver.java:401)
  301. at org.eclipse.aether.internal.impl.DefaultArtifactResolver.resolveArtifacts (DefaultArtifactResolver.java:229)
  302. at org.eclipse.aether.internal.impl.DefaultArtifactResolver.resolveArtifact (DefaultArtifactResolver.java:207)
  303. at org.apache.maven.repository.internal.DefaultArtifactDescriptorReader.loadPom (DefaultArtifactDescriptorReader.java:240)
  304. at org.apache.maven.repository.internal.DefaultArtifactDescriptorReader.readArtifactDescriptor (DefaultArtifactDescriptorReader.java:171)
  305. at org.eclipse.aether.internal.impl.collect.DefaultDependencyCollector.resolveCachedArtifactDescriptor (DefaultDependencyCollector.java:538)
  306. at org.eclipse.aether.internal.impl.collect.DefaultDependencyCollector.getArtifactDescriptorResult (DefaultDependencyCollector.java:523)
  307. at org.eclipse.aether.internal.impl.collect.DefaultDependencyCollector.processDependency (DefaultDependencyCollector.java:410)
  308. at org.eclipse.aether.internal.impl.collect.DefaultDependencyCollector.processDependency (DefaultDependencyCollector.java:362)
  309. at org.eclipse.aether.internal.impl.collect.DefaultDependencyCollector.process (DefaultDependencyCollector.java:349)
  310. at org.eclipse.aether.internal.impl.collect.DefaultDependencyCollector.collectDependencies (DefaultDependencyCollector.java:254)
  311. at org.eclipse.aether.internal.impl.DefaultRepositorySystem.collectDependencies (DefaultRepositorySystem.java:284)
  312. at org.apache.maven.project.DefaultProjectDependenciesResolver.resolve (DefaultProjectDependenciesResolver.java:169)
  313. at org.apache.maven.lifecycle.internal.LifecycleDependencyResolver.getDependencies (LifecycleDependencyResolver.java:243)
  314. at org.apache.maven.lifecycle.internal.LifecycleDependencyResolver.resolveProjectDependencies (LifecycleDependencyResolver.java:147)
  315. at org.apache.maven.lifecycle.internal.MojoExecutor.ensureDependenciesAreResolved (MojoExecutor.java:248)
  316. at org.apache.maven.lifecycle.internal.MojoExecutor.execute (MojoExecutor.java:202)
  317. at org.apache.maven.lifecycle.internal.MojoExecutor.execute (MojoExecutor.java:156)
  318. at org.apache.maven.lifecycle.internal.MojoExecutor.execute (MojoExecutor.java:148)
  319. at org.apache.maven.lifecycle.internal.LifecycleModuleBuilder.buildProject (LifecycleModuleBuilder.java:117)
  320. at org.apache.maven.lifecycle.internal.LifecycleModuleBuilder.buildProject (LifecycleModuleBuilder.java:81)
  321. at org.apache.maven.lifecycle.internal.builder.singlethreaded.SingleThreadedBuilder.build (SingleThreadedBuilder.java:56)
  322. at org.apache.maven.lifecycle.internal.LifecycleStarter.execute (LifecycleStarter.java:128)
  323. at org.apache.maven.DefaultMaven.doExecute (DefaultMaven.java:305)
  324. at org.apache.maven.DefaultMaven.doExecute (DefaultMaven.java:192)
  325. at org.apache.maven.DefaultMaven.execute (DefaultMaven.java:105)
  326. at org.apache.maven.cli.MavenCli.execute (MavenCli.java:957)
  327. at org.apache.maven.cli.MavenCli.doMain (MavenCli.java:289)
  328. at org.apache.maven.cli.MavenCli.main (MavenCli.java:193)
  329. at sun.reflect.NativeMethodAccessorImpl.invoke0 (Native Method)
  330. at sun.reflect.NativeMethodAccessorImpl.invoke (NativeMethodAccessorImpl.java:62)
  331. at sun.reflect.DelegatingMethodAccessorImpl.invoke (DelegatingMethodAccessorImpl.java:43)
  332. at java.lang.reflect.Method.invoke (Method.java:498)
  333. at org.codehaus.plexus.classworlds.launcher.Launcher.launchEnhanced (Launcher.java:282)
  334. at org.codehaus.plexus.classworlds.launcher.Launcher.launch (Launcher.java:225)
  335. at org.codehaus.plexus.classworlds.launcher.Launcher.mainWithExitCode (Launcher.java:406)
  336. at org.codehaus.plexus.classworlds.launcher.Launcher.main (Launcher.java:347)
  337. [ERROR]
  338. [ERROR] Re-run Maven using the -X switch to enable full debug logging.
  339. [ERROR]
  340. [ERROR] For more information about the errors and possible solutions, please read the following articles:
  341. [ERROR] [Help 1] http://cwiki.apache.org/confluence/display/MAVEN/DependencyResolutionException
  342. [ERROR]
  343. [ERROR] After correcting the problems, you can resume the build with the command
  344. [ERROR] mvn <args> -rf :referenceapplication-omod
RAW Paste Data