Guest User

Untitled

a guest
Oct 4th, 2017
78
Never
Not a member of Pastebin yet? Sign Up, it unlocks many cool features!
  1. [5170/29213] CXX obj/third_party/angle/libANGLE/RenderTargetVk.o
  2. [5171/29213] CXX obj/third_party/angle/libANGLE/ShaderVk.o
  3. [5172/29213] CXX obj/third_party/angle/libANGLE/VertexArrayVk.o
  4. [5173/29213] CXX obj/third_party/angle/libANGLE/RendererVk.o
  5. ../../third_party/angle/src/libANGLE/renderer/vulkan/RendererVk.cpp: In member function 'rx::vk::Error rx::RendererVk::submitCommandBuffer(rx::vk::CommandBuffer*)':
  6. ../../third_party/angle/src/libANGLE/renderer/vulkan/RendererVk.cpp:571:23: warning: variable 'fenceInfo' set but not used [-Wunused-but-set-variable]
  7. VkFenceCreateInfo fenceInfo;
  8. ^
  9. [5174/29213] CXX obj/third_party/angle/libANGLE/renderervk_utils.o
  10. [5175/29213] CXX obj/third_party/angle/libANGLE/TextureVk.o
  11. [5176/29213] CXX obj/third_party/angle/libANGLE/formatutilsvk.o
  12. [5177/29213] CXX obj/third_party/angle/libANGLE/vk_format_table_autogen.o
  13. [5178/29213] CXX obj/third_party/angle/libANGLE/SurfaceVk.o
  14. ../../third_party/angle/src/libANGLE/renderer/vulkan/SurfaceVk.cpp: In member function 'rx::vk::Error rx::WindowSurfaceVk::initializeImpl(rx::RendererVk*)':
  15. ../../third_party/angle/src/libANGLE/renderer/vulkan/SurfaceVk.cpp:229:14: warning: variable 'presentQueue' set but not used [-Wunused-but-set-variable]
  16. uint32_t presentQueue = 0;
  17. ^
  18. [5179/29213] CXX obj/third_party/angle/libANGLE/BufferNULL.o
  19. [5180/29213] CXX obj/third_party/angle/libANGLE/DisplayVkXcb.o
  20. [5181/29213] CXX obj/third_party/angle/libANGLE/FramebufferNULL.o
  21. [5182/29213] CXX obj/third_party/angle/libANGLE/CompilerNULL.o
  22. [5183/29213] CXX obj/third_party/angle/libANGLE/DeviceNULL.o
  23. [5184/29213] CXX obj/third_party/angle/libANGLE/ContextNULL.o
  24. [5185/29213] CXX obj/third_party/angle/libANGLE/FenceSyncNULL.o
  25. [5186/29213] CXX obj/third_party/angle/libANGLE/FenceNVNULL.o
  26. [5187/29213] CXX obj/third_party/angle/libANGLE/ImageNULL.o
  27. [5188/29213] CXX obj/third_party/angle/libANGLE/DisplayNULL.o
  28. [5189/29213] CXX obj/third_party/angle/libANGLE/RenderbufferNULL.o
  29. [5190/29213] CXX obj/third_party/angle/libANGLE/PathNULL.o
  30. [5191/29213] CXX obj/third_party/angle/libANGLE/ShaderNULL.o
  31. [5192/29213] CXX obj/third_party/angle/libANGLE/QueryNULL.o
  32. [5193/29213] STAMP obj/third_party/angle/libEGL.inputdeps.stamp
  33. [5194/29213] CXX obj/third_party/angle/libANGLE/ProgramNULL.o
  34. [5195/29213] STAMP obj/third_party/angle/libGLESv2.inputdeps.stamp
  35. [5196/29213] CXX obj/third_party/angle/libEGL/libEGL.o
  36. [5197/29213] CXX obj/third_party/angle/libANGLE/TransformFeedbackNULL.o
  37. [5198/29213] CXX obj/third_party/angle/libANGLE/SamplerNULL.o
  38. [5199/29213] CXX obj/third_party/angle/libANGLE/TextureNULL.o
  39. [5200/29213] CXX obj/third_party/angle/libANGLE/SurfaceNULL.o
  40. [5201/29213] CXX obj/third_party/angle/libGLESv2/global_state.o
  41. [5202/29213] CXX obj/third_party/angle/libGLESv2/entry_points_gles_3_1.o
  42. [5203/29213] CXX obj/third_party/angle/libGLESv2/entry_points_gles_2_0_autogen.o
  43. [5204/29213] STAMP obj/third_party/angle/src/vulkan_support/VkLayer_object_tracker.inputdeps.stamp
  44. [5205/29213] STAMP obj/third_party/angle/src/vulkan_support/VkLayer_swapchain.inputdeps.stamp
  45. [5206/29213] STAMP obj/third_party/angle/src/vulkan_support/VkLayer_threading.inputdeps.stamp
  46. [5207/29213] CXX obj/third_party/angle/libGLESv2/entry_points_gles_2_0_ext.o
  47. [5208/29213] STAMP obj/third_party/angle/src/vulkan_support/VkLayer_parameter_validation.inputdeps.stamp
  48. [5209/29213] STAMP obj/third_party/angle/src/vulkan_support/VkLayer_core_validation.inputdeps.stamp
  49. [5210/29213] CXX obj/third_party/angle/libGLESv2/entry_points_egl_ext.o
  50. [5211/29213] CXX obj/third_party/angle/libGLESv2/libGLESv2.o
  51. [5212/29213] CXX obj/third_party/angle/libGLESv2/entry_points_gles_3_0.o
  52. [5213/29213] STAMP obj/third_party/angle/src/vulkan_support/VkLayer_unique_objects.inputdeps.stamp
  53. [5214/29213] CXX obj/third_party/angle/src/vulkan_support/VkLayer_threading/threading.o
  54. [5215/29213] CXX obj/third_party/angle/libGLESv2/entry_points_egl.o
  55. [5216/29213] CXX obj/third_party/angle/src/vulkan_support/VkLayer_core_validation/descriptor_sets.o
  56. [5217/29213] CXX obj/third_party/angle/src/vulkan_support/VkLayer_unique_objects/unique_objects.o
  57. [5218/29213] STAMP obj/third_party/angle/src/vulkan_support/vulkan_generate_helper_files.stamp
  58. [5219/29213] STAMP obj/third_party/angle/src/vulkan_support/vulkan_layer_table.inputdeps.stamp
  59. [5220/29213] CXX obj/third_party/angle/src/vulkan_support/vulkan_layer_table/vk_layer_table.o
  60. [5221/29213] STAMP obj/third_party/angle/src/vulkan_support/vulkan_layer_table.stamp
  61. [5222/29213] STAMP obj/third_party/angle/src/vulkan_support/vulkan_layer_utils.inputdeps.stamp
  62. [5223/29213] CXX obj/third_party/angle/src/vulkan_support/VkLayer_object_tracker/object_tracker.o
  63. [5224/29213] CXX obj/third_party/angle/src/vulkan_support/VkLayer_swapchain/swapchain.o
  64. [5225/29213] STAMP obj/third_party/angle/src/vulkan_support/vulkan_loader.inputdeps.stamp
  65. [5226/29213] CXX obj/third_party/angle/src/vulkan_support/vulkan_layer_utils/vk_layer_extension_utils.o
  66. [5227/29213] CC obj/third_party/angle/src/vulkan_support/vulkan_loader/cJSON.o
  67. [5228/29213] CC obj/third_party/angle/src/vulkan_support/vulkan_loader/extension_manual.o
  68. FAILED: obj/third_party/angle/src/vulkan_support/vulkan_loader/extension_manual.o
  69. gcc -MMD -MF obj/third_party/angle/src/vulkan_support/vulkan_loader/extension_manual.o.d -DV8_DEPRECATION_WARNINGS -DUSE_UDEV -DUSE_AURA=1 -DUSE_PANGO=1 -DUSE_CAIRO=1 -DUSE_GLIB=1 -DUSE_NSS_CERTS=1 -DUSE_X11=1 -DNO_TCMALLOC -DDISABLE_NACL -DFULL_SAFE_BROWSING -DSAFE_BROWSING_CSD -DSAFE_BROWSING_DB_LOCAL -DCHROMIUM_BUILD -D_FILE_OFFSET_BITS=64 -D_LARGEFILE_SOURCE -D_LARGEFILE64_SOURCE -D__STDC_CONSTANT_MACROS -D__STDC_FORMAT_MACROS -D_FORTIFY_SOURCE=2 -DNDEBUG -DNVALGRIND -DDYNAMIC_ANNOTATIONS_ENABLED=0 -DVULKAN_NON_CMAKE_BUILD -DSYSCONFDIR=\"/etc\" -DFALLBACK_CONFIG_DIRS=\"/etc/xdg\" -DFALLBACK_DATA_DIRS=\"/usr/local/share:/usr/share\" -DVK_USE_PLATFORM_XCB_KHR -DVK_USE_PLATFORM_XCB_KHX -DLAYERS_SOURCE_PATH=\"angledata\" -DDEFAULT_VK_LAYERS_PATH=\".\" -DAPI_NAME=\"Vulkan\" -DHAVE_SECURE_GETENV -I../.. -Igen -I../../third_party/vulkan-validation-layers/src/include -I../../third_party/vulkan-validation-layers/src/loader -Igen/third_party/angle/src/vulkan_support/angle/vulkan -Igen/third_party/angle/src/vulkan_support/angle/vulkan -I../../third_party/vulkan-validation-layers/src/include -fno-strict-aliasing --param=ssp-buffer-size=4 -fstack-protector -Wno-builtin-macro-redefined -D__DATE__= -D__TIME__= -D__TIMESTAMP__= -funwind-tables -fPIC -pipe -pthread -fno-builtin-abs -m32 -msse2 -mfpmath=sse -mmmx -Wall -Wno-unused-local-typedefs -Wno-maybe-uninitialized -Wno-missing-field-initializers -Wno-unused-parameter -O2 -fno-ident -fdata-sections -ffunction-sections -fomit-frame-pointer -g0 -fvisibility=hidden -Wno-unused-function -Wno-ignored-attributes -c ../../third_party/vulkan-validation-layers/src/loader/extension_manual.c -o obj/third_party/angle/src/vulkan_support/vulkan_loader/extension_manual.o
  70. ../../third_party/vulkan-validation-layers/src/loader/extension_manual.c: In function 'terminator_EnumeratePhysicalDeviceGroupsKHX':
  71. ../../third_party/vulkan-validation-layers/src/loader/extension_manual.c:115:9: error: 'for' loop initial declarations are only allowed in C99 or C11 mode
  72. for (uint32_t i = 0; i < copy_count; i++) {
  73. ^
  74. ../../third_party/vulkan-validation-layers/src/loader/extension_manual.c:115:9: note: use option -std=c99, -std=gnu99, -std=c11 or -std=gnu11 to compile your code
  75. ../../third_party/vulkan-validation-layers/src/loader/extension_manual.c: In function 'setupLoaderTrampPhysDevGroups':
  76. ../../third_party/vulkan-validation-layers/src/loader/extension_manual.c:236:5: error: 'for' loop initial declarations are only allowed in C99 or C11 mode
  77. for (uint32_t group = 0; group < total_count; group++) {
  78. ^
  79. ../../third_party/vulkan-validation-layers/src/loader/extension_manual.c:253:19: error: redefinition of 'group'
  80. for (uint32_t group = 0; group < total_count; group++) {
  81. ^
  82. ../../third_party/vulkan-validation-layers/src/loader/extension_manual.c:236:19: note: previous definition of 'group' was here
  83. for (uint32_t group = 0; group < total_count; group++) {
  84. ^
  85. ../../third_party/vulkan-validation-layers/src/loader/extension_manual.c:253:5: error: 'for' loop initial declarations are only allowed in C99 or C11 mode
  86. for (uint32_t group = 0; group < total_count; group++) {
  87. ^
  88. ../../third_party/vulkan-validation-layers/src/loader/extension_manual.c:254:9: error: 'for' loop initial declarations are only allowed in C99 or C11 mode
  89. for (uint32_t group_gpu = 0; group_gpu < local_phys_dev_groups[group].physicalDeviceCount; group_gpu++) {
  90. ^
  91. ../../third_party/vulkan-validation-layers/src/loader/extension_manual.c:256:13: error: 'for' loop initial declarations are only allowed in C99 or C11 mode
  92. for (uint32_t tramp_gpu = 0; tramp_gpu < inst->phys_dev_count_tramp; tramp_gpu++) {
  93. ^
  94. ../../third_party/vulkan-validation-layers/src/loader/extension_manual.c:275:5: error: 'for' loop initial declarations are only allowed in C99 or C11 mode
  95. for (uint32_t new_idx = 0; new_idx < total_count; new_idx++) {
  96. ^
  97. ../../third_party/vulkan-validation-layers/src/loader/extension_manual.c:277:9: error: 'for' loop initial declarations are only allowed in C99 or C11 mode
  98. for (uint32_t old_idx = 0; old_idx < inst->phys_dev_group_count_tramp; old_idx++) {
  99. ^
  100. ../../third_party/vulkan-validation-layers/src/loader/extension_manual.c:280:17: error: 'for' loop initial declarations are only allowed in C99 or C11 mode
  101. for (uint32_t old_gpu = 0; old_gpu < inst->phys_dev_groups_tramp[old_idx]->physicalDeviceCount; old_gpu++) {
  102. ^
  103. ../../third_party/vulkan-validation-layers/src/loader/extension_manual.c:282:21: error: 'for' loop initial declarations are only allowed in C99 or C11 mode
  104. for (uint32_t new_gpu = 0; new_gpu < local_phys_dev_groups[new_idx].physicalDeviceCount; new_gpu++) {
  105. ^
  106. ../../third_party/vulkan-validation-layers/src/loader/extension_manual.c:325:13: error: 'for' loop initial declarations are only allowed in C99 or C11 mode
  107. for (uint32_t i = 0; i < total_count; i++) {
  108. ^
  109. ../../third_party/vulkan-validation-layers/src/loader/extension_manual.c:335:13: error: 'for' loop initial declarations are only allowed in C99 or C11 mode
  110. for (uint32_t i = 0; i < inst->phys_dev_group_count_tramp; i++) {
  111. ^
  112. ../../third_party/vulkan-validation-layers/src/loader/extension_manual.c:337:17: error: 'for' loop initial declarations are only allowed in C99 or C11 mode
  113. for (uint32_t j = 0; j < total_count; j++) {
  114. ^
  115. ../../third_party/vulkan-validation-layers/src/loader/extension_manual.c: In function 'setupLoaderTermPhysDevGroups':
  116. ../../third_party/vulkan-validation-layers/src/loader/extension_manual.c:378:5: error: 'for' loop initial declarations are only allowed in C99 or C11 mode
  117. for (uint32_t icd_idx = 0; NULL != icd_term; icd_term = icd_term->next, icd_idx++) {
  118. ^
  119. ../../third_party/vulkan-validation-layers/src/loader/extension_manual.c:431:5: error: 'for' loop initial declarations are only allowed in C99 or C11 mode
  120. for (uint32_t group = 0; group < total_count; group++) {
  121. ^
  122. ../../third_party/vulkan-validation-layers/src/loader/extension_manual.c:439:19: error: redefinition of 'icd_idx'
  123. for (uint32_t icd_idx = 0; NULL != icd_term; icd_term = icd_term->next, icd_idx++) {
  124. ^
  125. ../../third_party/vulkan-validation-layers/src/loader/extension_manual.c:378:19: note: previous definition of 'icd_idx' was here
  126. for (uint32_t icd_idx = 0; NULL != icd_term; icd_term = icd_term->next, icd_idx++) {
  127. ^
  128. ../../third_party/vulkan-validation-layers/src/loader/extension_manual.c:439:5: error: 'for' loop initial declarations are only allowed in C99 or C11 mode
  129. for (uint32_t icd_idx = 0; NULL != icd_term; icd_term = icd_term->next, icd_idx++) {
  130. ^
  131. ../../third_party/vulkan-validation-layers/src/loader/extension_manual.c:463:13: error: 'for' loop initial declarations are only allowed in C99 or C11 mode
  132. for (uint32_t indiv_gpu = 0; indiv_gpu < count_this_time; indiv_gpu++) {
  133. ^
  134. ../../third_party/vulkan-validation-layers/src/loader/extension_manual.c:483:19: error: redefinition of 'group'
  135. for (uint32_t group = 0; group < total_count; group++) {
  136. ^
  137. ../../third_party/vulkan-validation-layers/src/loader/extension_manual.c:431:19: note: previous definition of 'group' was here
  138. for (uint32_t group = 0; group < total_count; group++) {
  139. ^
  140. ../../third_party/vulkan-validation-layers/src/loader/extension_manual.c:483:5: error: 'for' loop initial declarations are only allowed in C99 or C11 mode
  141. for (uint32_t group = 0; group < total_count; group++) {
  142. ^
  143. ../../third_party/vulkan-validation-layers/src/loader/extension_manual.c:484:9: error: 'for' loop initial declarations are only allowed in C99 or C11 mode
  144. for (uint32_t group_gpu = 0; group_gpu < local_phys_dev_groups[group].physicalDeviceCount; group_gpu++) {
  145. ^
  146. ../../third_party/vulkan-validation-layers/src/loader/extension_manual.c:486:13: error: 'for' loop initial declarations are only allowed in C99 or C11 mode
  147. for (uint32_t term_gpu = 0; term_gpu < inst->phys_dev_count_term; term_gpu++) {
  148. ^
  149. ../../third_party/vulkan-validation-layers/src/loader/extension_manual.c:505:5: error: 'for' loop initial declarations are only allowed in C99 or C11 mode
  150. for (uint32_t new_idx = 0; new_idx < total_count; new_idx++) {
  151. ^
  152. ../../third_party/vulkan-validation-layers/src/loader/extension_manual.c:507:9: error: 'for' loop initial declarations are only allowed in C99 or C11 mode
  153. for (uint32_t old_idx = 0; old_idx < inst->phys_dev_group_count_term; old_idx++) {
  154. ^
  155. ../../third_party/vulkan-validation-layers/src/loader/extension_manual.c:510:17: error: 'for' loop initial declarations are only allowed in C99 or C11 mode
  156. for (uint32_t old_gpu = 0; old_gpu < inst->phys_dev_groups_term[old_idx]->physicalDeviceCount; old_gpu++) {
  157. ^
  158. ../../third_party/vulkan-validation-layers/src/loader/extension_manual.c:512:21: error: 'for' loop initial declarations are only allowed in C99 or C11 mode
  159. for (uint32_t new_gpu = 0; new_gpu < local_phys_dev_groups[new_idx].physicalDeviceCount; new_gpu++) {
  160. ^
  161. ../../third_party/vulkan-validation-layers/src/loader/extension_manual.c:555:13: error: 'for' loop initial declarations are only allowed in C99 or C11 mode
  162. for (uint32_t i = 0; i < total_count; i++) {
  163. ^
  164. ../../third_party/vulkan-validation-layers/src/loader/extension_manual.c:565:13: error: 'for' loop initial declarations are only allowed in C99 or C11 mode
  165. for (uint32_t i = 0; i < inst->phys_dev_group_count_term; i++) {
  166. ^
  167. ../../third_party/vulkan-validation-layers/src/loader/extension_manual.c:567:17: error: 'for' loop initial declarations are only allowed in C99 or C11 mode
  168. for (uint32_t j = 0; j < total_count; j++) {
  169. ^
  170. ../../third_party/vulkan-validation-layers/src/loader/extension_manual.c: At top level:
  171. cc1: warning: unrecognized command line option "-Wno-ignored-attributes"
  172. [5229/29213] CXX obj/third_party/angle/src/vulkan_support/vulkan_layer_utils/vk_layer_utils.o
  173. [5230/29213] CXX obj/third_party/angle/src/vulkan_support/vulkan_layer_utils/vk_layer_config.o
  174. [5231/29213] CXX obj/third_party/angle/src/vulkan_support/VkLayer_core_validation/buffer_validation.o
  175. [5232/29213] CXX obj/third_party/angle/src/vulkan_support/VkLayer_parameter_validation/parameter_validation.o
  176. [5233/29213] CXX obj/third_party/angle/src/vulkan_support/VkLayer_core_validation/core_validation.o
  177. ninja: build stopped: subcommand failed.
  178. -- Manually installing everything.
  179. install: cannot stat ‘out/Release/chrome’: No such file or directory
  180. ./chromium.SlackBuild FAILED at line 751
RAW Paste Data