Advertisement
Guest User

Console Error

a guest
Mar 5th, 2021
48
Never
Not a member of Pastebin yet? Sign Up, it unlocks many cool features!
  1.  
  2.  
  3. Executing Gradle task: build
  4. Build info: MCreator 2020.5.47520, fabric-1.16.2, 64-bit, 7959 MB, Windows 10, JVM 1.8.0_265, JAVA_HOME: C:\Program Files\Pylo\MCreator\jdk
  5. > Configure project :
  6. Fabric Loom: 0.4.33 Build(jenkins #33)
  7. :setting up loom dependencies
  8. :setting up mappings (yarn 1.16.2+build.46)
  9. Configuring compiler arguments for Java
  10. > Task :compileJava
  11. 2021-03-05 15:30:28,556 Execution worker for ':' WARN Unable to instantiate org.fusesource.jansi.WindowsAnsiOutputStream
  12. 2021-03-05 15:30:28,608 Execution worker for ':' ERROR Cannot access RandomAccessFile java.io.FileNotFoundException: logs\latest.log (Access is denied) java.io.FileNotFoundException: logs\latest.log (Access is denied)
  13. at java.io.RandomAccessFile.open0(Native Method)
  14. at java.io.RandomAccessFile.open(RandomAccessFile.java:316)
  15. at java.io.RandomAccessFile.<init>(RandomAccessFile.java:243)
  16. at java.io.RandomAccessFile.<init>(RandomAccessFile.java:124)
  17. at org.apache.logging.log4j.core.appender.rolling.RollingRandomAccessFileManager$RollingRandomAccessFileManagerFactory.createManager(RollingRandomAccessFileManager.java:180)
  18. at org.apache.logging.log4j.core.appender.rolling.RollingRandomAccessFileManager$RollingRandomAccessFileManagerFactory.createManager(RollingRandomAccessFileManager.java:156)
  19. at org.apache.logging.log4j.core.appender.AbstractManager.getManager(AbstractManager.java:112)
  20. at org.apache.logging.log4j.core.appender.OutputStreamManager.getManager(OutputStreamManager.java:114)
  21. at org.apache.logging.log4j.core.appender.rolling.RollingRandomAccessFileManager.getRollingRandomAccessFileManager(RollingRandomAccessFileManager.java:87)
  22. at org.apache.logging.log4j.core.appender.RollingRandomAccessFileAppender$Builder.build(RollingRandomAccessFileAppender.java:115)
  23. at org.apache.logging.log4j.core.appender.RollingRandomAccessFileAppender$Builder.build(RollingRandomAccessFileAppender.java:52)
  24. at org.apache.logging.log4j.core.config.plugins.util.PluginBuilder.build(PluginBuilder.java:122)
  25. at org.apache.logging.log4j.core.config.AbstractConfiguration.createPluginObject(AbstractConfiguration.java:952)
  26. at org.apache.logging.log4j.core.config.AbstractConfiguration.createConfiguration(AbstractConfiguration.java:892)
  27. at org.apache.logging.log4j.core.config.AbstractConfiguration.createConfiguration(AbstractConfiguration.java:884)
  28. at org.apache.logging.log4j.core.config.AbstractConfiguration.doConfigure(AbstractConfiguration.java:508)
  29. at org.apache.logging.log4j.core.config.AbstractConfiguration.initialize(AbstractConfiguration.java:232)
  30. at org.apache.logging.log4j.core.config.AbstractConfiguration.start(AbstractConfiguration.java:244)
  31. at org.apache.logging.log4j.core.LoggerContext.setConfiguration(LoggerContext.java:545)
  32. at org.apache.logging.log4j.core.LoggerContext.reconfigure(LoggerContext.java:617)
  33. at org.apache.logging.log4j.core.LoggerContext.reconfigure(LoggerContext.java:634)
  34. at org.apache.logging.log4j.core.LoggerContext.start(LoggerContext.java:229)
  35. at org.apache.logging.log4j.core.impl.Log4jContextFactory.getContext(Log4jContextFactory.java:242)
  36. at org.apache.logging.log4j.core.impl.Log4jContextFactory.getContext(Log4jContextFactory.java:45)
  37. at org.apache.logging.log4j.LogManager.getContext(LogManager.java:174)
  38. at org.apache.logging.log4j.LogManager.getLogger(LogManager.java:618)
  39. at org.spongepowered.asm.mixin.struct.AnnotatedMethodInfo.<clinit>(AnnotatedMethodInfo.java:43)
  40. at org.spongepowered.tools.obfuscation.MixinObfuscationProcessorInjection.getSupportedAnnotationTypes(MixinObfuscationProcessorInjection.java:54)
  41. at org.gradle.api.internal.tasks.compile.processing.DelegatingProcessor.getSupportedAnnotationTypes(DelegatingProcessor.java:47)
  42. at org.gradle.api.internal.tasks.compile.processing.NonIncrementalProcessor.getSupportedAnnotationTypes(NonIncrementalProcessor.java:33)
  43. at org.gradle.api.internal.tasks.compile.processing.DelegatingProcessor.getSupportedAnnotationTypes(DelegatingProcessor.java:47)
  44. at org.gradle.api.internal.tasks.compile.processing.TimeTrackingProcessor.access$101(TimeTrackingProcessor.java:37)
  45. at org.gradle.api.internal.tasks.compile.processing.TimeTrackingProcessor$2.create(TimeTrackingProcessor.java:68)
  46. at org.gradle.api.internal.tasks.compile.processing.TimeTrackingProcessor$2.create(TimeTrackingProcessor.java:65)
  47. at org.gradle.api.internal.tasks.compile.processing.TimeTrackingProcessor.track(TimeTrackingProcessor.java:117)
  48. at org.gradle.api.internal.tasks.compile.processing.TimeTrackingProcessor.getSupportedAnnotationTypes(TimeTrackingProcessor.java:65)
  49. at com.sun.tools.javac.processing.JavacProcessingEnvironment$ProcessorState.<init>(JavacProcessingEnvironment.java:513)
  50. at com.sun.tools.javac.processing.JavacProcessingEnvironment$DiscoveredProcessors$ProcessorStateIterator.next(JavacProcessingEnvironment.java:605)
  51. at com.sun.tools.javac.processing.JavacProcessingEnvironment.discoverAndRunProcs(JavacProcessingEnvironment.java:698)
  52. at com.sun.tools.javac.processing.JavacProcessingEnvironment.access$1800(JavacProcessingEnvironment.java:91)
  53. at com.sun.tools.javac.processing.JavacProcessingEnvironment$Round.run(JavacProcessingEnvironment.java:1043)
  54. at com.sun.tools.javac.processing.JavacProcessingEnvironment.doProcessing(JavacProcessingEnvironment.java:1184)
  55. at com.sun.tools.javac.main.JavaCompiler.processAnnotations(JavaCompiler.java:1170)
  56. at com.sun.tools.javac.main.JavaCompiler.compile(JavaCompiler.java:856)
  57. at com.sun.tools.javac.main.Main.compile(Main.java:523)
  58. at com.sun.tools.javac.api.JavacTaskImpl.doCall(JavacTaskImpl.java:129)
  59. at com.sun.tools.javac.api.JavacTaskImpl.call(JavacTaskImpl.java:138)
  60. at org.gradle.internal.compiler.java.IncrementalCompileTask.call(IncrementalCompileTask.java:74)
  61. at org.gradle.api.internal.tasks.compile.AnnotationProcessingCompileTask.call(AnnotationProcessingCompileTask.java:93)
  62. at org.gradle.api.internal.tasks.compile.ResourceCleaningCompilationTask.call(ResourceCleaningCompilationTask.java:57)
  63. at org.gradle.api.internal.tasks.compile.JdkJavaCompiler.execute(JdkJavaCompiler.java:55)
  64. at org.gradle.api.internal.tasks.compile.JdkJavaCompiler.execute(JdkJavaCompiler.java:40)
  65. at org.gradle.api.internal.tasks.compile.NormalizingJavaCompiler.delegateAndHandleErrors(NormalizingJavaCompiler.java:97)
  66. at org.gradle.api.internal.tasks.compile.NormalizingJavaCompiler.execute(NormalizingJavaCompiler.java:51)
  67. at org.gradle.api.internal.tasks.compile.NormalizingJavaCompiler.execute(NormalizingJavaCompiler.java:37)
  68. at org.gradle.api.internal.tasks.compile.AnnotationProcessorDiscoveringCompiler.execute(AnnotationProcessorDiscoveringCompiler.java:51)
  69. at org.gradle.api.internal.tasks.compile.AnnotationProcessorDiscoveringCompiler.execute(AnnotationProcessorDiscoveringCompiler.java:37)
  70. at org.gradle.api.internal.tasks.compile.ModuleApplicationNameWritingCompiler.execute(ModuleApplicationNameWritingCompiler.java:46)
  71. at org.gradle.api.internal.tasks.compile.ModuleApplicationNameWritingCompiler.execute(ModuleApplicationNameWritingCompiler.java:36)
  72. at org.gradle.api.internal.tasks.compile.CleaningJavaCompiler.execute(CleaningJavaCompiler.java:53)
  73. at org.gradle.api.internal.tasks.compile.incremental.IncrementalCompilerFactory.lambda$createRebuildAllCompiler$0(IncrementalCompilerFactory.java:98)
  74. at org.gradle.api.internal.tasks.compile.incremental.IncrementalResultStoringCompiler.execute(IncrementalResultStoringCompiler.java:60)
  75. at org.gradle.api.internal.tasks.compile.incremental.IncrementalResultStoringCompiler.execute(IncrementalResultStoringCompiler.java:44)
  76. at org.gradle.api.internal.tasks.compile.CompileJavaBuildOperationReportingCompiler$2.call(CompileJavaBuildOperationReportingCompiler.java:59)
  77. at org.gradle.api.internal.tasks.compile.CompileJavaBuildOperationReportingCompiler$2.call(CompileJavaBuildOperationReportingCompiler.java:51)
  78. at org.gradle.internal.operations.DefaultBuildOperationExecutor$CallableBuildOperationWorker.execute(DefaultBuildOperationExecutor.java:409)
  79. at org.gradle.internal.operations.DefaultBuildOperationExecutor$CallableBuildOperationWorker.execute(DefaultBuildOperationExecutor.java:399)
  80. at org.gradle.internal.operations.DefaultBuildOperationExecutor$1.execute(DefaultBuildOperationExecutor.java:157)
  81. at org.gradle.internal.operations.DefaultBuildOperationExecutor.execute(DefaultBuildOperationExecutor.java:242)
  82. at org.gradle.internal.operations.DefaultBuildOperationExecutor.execute(DefaultBuildOperationExecutor.java:150)
  83. at org.gradle.internal.operations.DefaultBuildOperationExecutor.call(DefaultBuildOperationExecutor.java:94)
  84. at org.gradle.internal.operations.DelegatingBuildOperationExecutor.call(DelegatingBuildOperationExecutor.java:36)
  85. at org.gradle.api.internal.tasks.compile.CompileJavaBuildOperationReportingCompiler.execute(CompileJavaBuildOperationReportingCompiler.java:51)
  86. at org.gradle.api.tasks.compile.JavaCompile.performCompilation(JavaCompile.java:293)
  87. at org.gradle.api.tasks.compile.JavaCompile.performIncrementalCompilation(JavaCompile.java:203)
  88. at org.gradle.api.tasks.compile.JavaCompile.compile(JavaCompile.java:183)
  89. at sun.reflect.GeneratedMethodAccessor449.invoke(Unknown Source)
  90. at sun.reflect.DelegatingMethodAccessorImpl.invoke(DelegatingMethodAccessorImpl.java:43)
  91. at java.lang.reflect.Method.invoke(Method.java:498)
  92. at org.gradle.internal.reflect.JavaMethod.invoke(JavaMethod.java:104)
  93. at org.gradle.api.internal.project.taskfactory.IncrementalInputsTaskAction.doExecute(IncrementalInputsTaskAction.java:32)
  94. at org.gradle.api.internal.project.taskfactory.StandardTaskAction.execute(StandardTaskAction.java:42)
  95. at org.gradle.api.internal.project.taskfactory.AbstractIncrementalTaskAction.execute(AbstractIncrementalTaskAction.java:25)
  96. at org.gradle.api.internal.project.taskfactory.StandardTaskAction.execute(StandardTaskAction.java:28)
  97. at org.gradle.api.internal.tasks.execution.ExecuteActionsTaskExecuter$3.run(ExecuteActionsTaskExecuter.java:569)
  98. at org.gradle.internal.operations.DefaultBuildOperationExecutor$RunnableBuildOperationWorker.execute(DefaultBuildOperationExecutor.java:395)
  99. at org.gradle.internal.operations.DefaultBuildOperationExecutor$RunnableBuildOperationWorker.execute(DefaultBuildOperationExecutor.java:387)
  100. at org.gradle.internal.operations.DefaultBuildOperationExecutor$1.execute(DefaultBuildOperationExecutor.java:157)
  101. at org.gradle.internal.operations.DefaultBuildOperationExecutor.execute(DefaultBuildOperationExecutor.java:242)
  102. at org.gradle.internal.operations.DefaultBuildOperationExecutor.execute(DefaultBuildOperationExecutor.java:150)
  103. at org.gradle.internal.operations.DefaultBuildOperationExecutor.run(DefaultBuildOperationExecutor.java:84)
  104. at org.gradle.internal.operations.DelegatingBuildOperationExecutor.run(DelegatingBuildOperationExecutor.java:31)
  105. at org.gradle.api.internal.tasks.execution.ExecuteActionsTaskExecuter.executeAction(ExecuteActionsTaskExecuter.java:554)
  106. at org.gradle.api.internal.tasks.execution.ExecuteActionsTaskExecuter.executeActions(ExecuteActionsTaskExecuter.java:537)
  107. at org.gradle.api.internal.tasks.execution.ExecuteActionsTaskExecuter.access$300(ExecuteActionsTaskExecuter.java:108)
  108. at org.gradle.api.internal.tasks.execution.ExecuteActionsTaskExecuter$TaskExecution.executeWithPreviousOutputFiles(ExecuteActionsTaskExecuter.java:278)
  109. at org.gradle.api.internal.tasks.execution.ExecuteActionsTaskExecuter$TaskExecution.execute(ExecuteActionsTaskExecuter.java:267)
  110. at org.gradle.internal.execution.steps.ExecuteStep.lambda$execute$0(ExecuteStep.java:32)
  111. at java.util.Optional.map(Optional.java:215)
  112. at org.gradle.internal.execution.steps.ExecuteStep.execute(ExecuteStep.java:32)
  113. at org.gradle.internal.execution.steps.ExecuteStep.execute(ExecuteStep.java:26)
  114. at org.gradle.internal.execution.steps.CleanupOutputsStep.execute(CleanupOutputsStep.java:67)
  115. at org.gradle.internal.execution.steps.CleanupOutputsStep.execute(CleanupOutputsStep.java:36)
  116. at org.gradle.internal.execution.steps.ResolveInputChangesStep.execute(ResolveInputChangesStep.java:49)
  117. at org.gradle.internal.execution.steps.ResolveInputChangesStep.execute(ResolveInputChangesStep.java:34)
  118. at org.gradle.internal.execution.steps.CancelExecutionStep.execute(CancelExecutionStep.java:43)
  119. at org.gradle.internal.execution.steps.TimeoutStep.executeWithoutTimeout(TimeoutStep.java:73)
  120. at org.gradle.internal.execution.steps.TimeoutStep.execute(TimeoutStep.java:54)
  121. at org.gradle.internal.execution.steps.CatchExceptionStep.execute(CatchExceptionStep.java:34)
  122. at org.gradle.internal.execution.steps.CreateOutputsStep.execute(CreateOutputsStep.java:44)
  123. at org.gradle.internal.execution.steps.SnapshotOutputsStep.execute(SnapshotOutputsStep.java:54)
  124. at org.gradle.internal.execution.steps.SnapshotOutputsStep.execute(SnapshotOutputsStep.java:38)
  125. at org.gradle.internal.execution.steps.BroadcastChangingOutputsStep.execute(BroadcastChangingOutputsStep.java:49)
  126. at org.gradle.internal.execution.steps.CacheStep.executeWithoutCache(CacheStep.java:159)
  127. at org.gradle.internal.execution.steps.CacheStep.execute(CacheStep.java:72)
  128. at org.gradle.internal.execution.steps.CacheStep.execute(CacheStep.java:43)
  129. at org.gradle.internal.execution.steps.StoreExecutionStateStep.execute(StoreExecutionStateStep.java:44)
  130. at org.gradle.internal.execution.steps.StoreExecutionStateStep.execute(StoreExecutionStateStep.java:33)
  131. at org.gradle.internal.execution.steps.RecordOutputsStep.execute(RecordOutputsStep.java:38)
  132. at org.gradle.internal.execution.steps.RecordOutputsStep.execute(RecordOutputsStep.java:24)
  133. at org.gradle.internal.execution.steps.SkipUpToDateStep.executeBecause(SkipUpToDateStep.java:92)
  134. at org.gradle.internal.execution.steps.SkipUpToDateStep.lambda$execute$0(SkipUpToDateStep.java:85)
  135. at java.util.Optional.map(Optional.java:215)
  136. at org.gradle.internal.execution.steps.SkipUpToDateStep.execute(SkipUpToDateStep.java:55)
  137. at org.gradle.internal.execution.steps.SkipUpToDateStep.execute(SkipUpToDateStep.java:39)
  138. at org.gradle.internal.execution.steps.ResolveChangesStep.execute(ResolveChangesStep.java:76)
  139. at org.gradle.internal.execution.steps.ResolveChangesStep.execute(ResolveChangesStep.java:37)
  140. at org.gradle.internal.execution.steps.legacy.MarkSnapshottingInputsFinishedStep.execute(MarkSnapshottingInputsFinishedStep.java:36)
  141. at org.gradle.internal.execution.steps.legacy.MarkSnapshottingInputsFinishedStep.execute(MarkSnapshottingInputsFinishedStep.java:26)
  142. at org.gradle.internal.execution.steps.ResolveCachingStateStep.execute(ResolveCachingStateStep.java:94)
  143. at org.gradle.internal.execution.steps.ResolveCachingStateStep.execute(ResolveCachingStateStep.java:49)
  144. at org.gradle.internal.execution.steps.CaptureStateBeforeExecutionStep.execute(CaptureStateBeforeExecutionStep.java:79)
  145. at org.gradle.internal.execution.steps.CaptureStateBeforeExecutionStep.execute(CaptureStateBeforeExecutionStep.java:53)
  146. at org.gradle.internal.execution.steps.ValidateStep.execute(ValidateStep.java:74)
  147. at org.gradle.internal.execution.steps.SkipEmptyWorkStep.lambda$execute$2(SkipEmptyWorkStep.java:78)
  148. at java.util.Optional.orElseGet(Optional.java:267)
  149. at org.gradle.internal.execution.steps.SkipEmptyWorkStep.execute(SkipEmptyWorkStep.java:78)
  150. at org.gradle.internal.execution.steps.SkipEmptyWorkStep.execute(SkipEmptyWorkStep.java:34)
  151. at org.gradle.internal.execution.steps.legacy.MarkSnapshottingInputsStartedStep.execute(MarkSnapshottingInputsStartedStep.java:39)
  152. at org.gradle.internal.execution.steps.LoadExecutionStateStep.execute(LoadExecutionStateStep.java:40)
  153. at org.gradle.internal.execution.steps.LoadExecutionStateStep.execute(LoadExecutionStateStep.java:28)
  154. at org.gradle.internal.execution.impl.DefaultWorkExecutor.execute(DefaultWorkExecutor.java:33)
  155. at org.gradle.api.internal.tasks.execution.ExecuteActionsTaskExecuter.executeIfValid(ExecuteActionsTaskExecuter.java:194)
  156. at org.gradle.api.internal.tasks.execution.ExecuteActionsTaskExecuter.execute(ExecuteActionsTaskExecuter.java:186)
  157. at org.gradle.api.internal.tasks.execution.CleanupStaleOutputsExecuter.execute(CleanupStaleOutputsExecuter.java:114)
  158. at org.gradle.api.internal.tasks.execution.FinalizePropertiesTaskExecuter.execute(FinalizePropertiesTaskExecuter.java:46)
  159. at org.gradle.api.internal.tasks.execution.ResolveTaskExecutionModeExecuter.execute(ResolveTaskExecutionModeExecuter.java:62)
  160. at org.gradle.api.internal.tasks.execution.SkipTaskWithNoActionsExecuter.execute(SkipTaskWithNoActionsExecuter.java:57)
  161. at org.gradle.api.internal.tasks.execution.SkipOnlyIfTaskExecuter.execute(SkipOnlyIfTaskExecuter.java:56)
  162. at org.gradle.api.internal.tasks.execution.CatchExceptionTaskExecuter.execute(CatchExceptionTaskExecuter.java:36)
  163. at org.gradle.api.internal.tasks.execution.EventFiringTaskExecuter$1.executeTask(EventFiringTaskExecuter.java:77)
  164. at org.gradle.api.internal.tasks.execution.EventFiringTaskExecuter$1.call(EventFiringTaskExecuter.java:55)
  165. at org.gradle.api.internal.tasks.execution.EventFiringTaskExecuter$1.call(EventFiringTaskExecuter.java:52)
  166. at org.gradle.internal.operations.DefaultBuildOperationExecutor$CallableBuildOperationWorker.execute(DefaultBuildOperationExecutor.java:409)
  167. at org.gradle.internal.operations.DefaultBuildOperationExecutor$CallableBuildOperationWorker.execute(DefaultBuildOperationExecutor.java:399)
  168. at org.gradle.internal.operations.DefaultBuildOperationExecutor$1.execute(DefaultBuildOperationExecutor.java:157)
  169. at org.gradle.internal.operations.DefaultBuildOperationExecutor.execute(DefaultBuildOperationExecutor.java:242)
  170. at org.gradle.internal.operations.DefaultBuildOperationExecutor.execute(DefaultBuildOperationExecutor.java:150)
  171. at org.gradle.internal.operations.DefaultBuildOperationExecutor.call(DefaultBuildOperationExecutor.java:94)
  172. at org.gradle.internal.operations.DelegatingBuildOperationExecutor.call(DelegatingBuildOperationExecutor.java:36)
  173. at org.gradle.api.internal.tasks.execution.EventFiringTaskExecuter.execute(EventFiringTaskExecuter.java:52)
  174. at org.gradle.execution.plan.LocalTaskNodeExecutor.execute(LocalTaskNodeExecutor.java:41)
  175. at org.gradle.execution.taskgraph.DefaultTaskExecutionGraph$InvokeNodeExecutorsAction.execute(DefaultTaskExecutionGraph.java:356)
  176. at org.gradle.execution.taskgraph.DefaultTaskExecutionGraph$InvokeNodeExecutorsAction.execute(DefaultTaskExecutionGraph.java:343)
  177. at org.gradle.execution.taskgraph.DefaultTaskExecutionGraph$BuildOperationAwareExecutionAction.execute(DefaultTaskExecutionGraph.java:336)
  178. at org.gradle.execution.taskgraph.DefaultTaskExecutionGraph$BuildOperationAwareExecutionAction.execute(DefaultTaskExecutionGraph.java:322)
  179. at org.gradle.execution.plan.DefaultPlanExecutor$ExecutorWorker.lambda$run$0(DefaultPlanExecutor.java:127)
  180. at org.gradle.execution.plan.DefaultPlanExecutor$ExecutorWorker.execute(DefaultPlanExecutor.java:191)
  181. at org.gradle.execution.plan.DefaultPlanExecutor$ExecutorWorker.executeNextNode(DefaultPlanExecutor.java:182)
  182. at org.gradle.execution.plan.DefaultPlanExecutor$ExecutorWorker.run(DefaultPlanExecutor.java:124)
  183. at org.gradle.internal.concurrent.ExecutorPolicy$CatchAndRecordFailures.onExecute(ExecutorPolicy.java:64)
  184. at org.gradle.internal.concurrent.ManagedExecutorImpl$1.run(ManagedExecutorImpl.java:48)
  185. at java.util.concurrent.ThreadPoolExecutor.runWorker(ThreadPoolExecutor.java:1149)
  186. at java.util.concurrent.ThreadPoolExecutor$Worker.run(ThreadPoolExecutor.java:624)
  187. at org.gradle.internal.concurrent.ThreadFactoryImpl$ManagedThreadRunnable.run(ThreadFactoryImpl.java:56)
  188. at java.lang.Thread.run(Thread.java:748)
  189. 2021-03-05 15:30:28,617 Execution worker for ':' ERROR Unable to inject fields into builder class for plugin type class org.apache.logging.log4j.core.appender.RollingRandomAccessFileAppender, element RollingRandomAccessFile. java.lang.IllegalStateException: ManagerFactory [org.apache.logging.log4j.core.appender.rolling.RollingRandomAccessFileManager$RollingRandomAccessFileManagerFactory@426ad38d] unable to create manager for [logs/latest.log] with data [org.apache.logging.log4j.core.appender.rolling.RollingRandomAccessFileManager$FactoryData@2aa008a]
  190. at org.apache.logging.log4j.core.appender.AbstractManager.getManager(AbstractManager.java:114)
  191. at org.apache.logging.log4j.core.appender.OutputStreamManager.getManager(OutputStreamManager.java:114)
  192. at org.apache.logging.log4j.core.appender.rolling.RollingRandomAccessFileManager.getRollingRandomAccessFileManager(RollingRandomAccessFileManager.java:87)
  193. at org.apache.logging.log4j.core.appender.RollingRandomAccessFileAppender$Builder.build(RollingRandomAccessFileAppender.java:115)
  194. at org.apache.logging.log4j.core.appender.RollingRandomAccessFileAppender$Builder.build(RollingRandomAccessFileAppender.java:52)
  195. at org.apache.logging.log4j.core.config.plugins.util.PluginBuilder.build(PluginBuilder.java:122)
  196. at org.apache.logging.log4j.core.config.AbstractConfiguration.createPluginObject(AbstractConfiguration.java:952)
  197. at org.apache.logging.log4j.core.config.AbstractConfiguration.createConfiguration(AbstractConfiguration.java:892)
  198. at org.apache.logging.log4j.core.config.AbstractConfiguration.createConfiguration(AbstractConfiguration.java:884)
  199. at org.apache.logging.log4j.core.config.AbstractConfiguration.doConfigure(AbstractConfiguration.java:508)
  200. at org.apache.logging.log4j.core.config.AbstractConfiguration.initialize(AbstractConfiguration.java:232)
  201. at org.apache.logging.log4j.core.config.AbstractConfiguration.start(AbstractConfiguration.java:244)
  202. at org.apache.logging.log4j.core.LoggerContext.setConfiguration(LoggerContext.java:545)
  203. at org.apache.logging.log4j.core.LoggerContext.reconfigure(LoggerContext.java:617)
  204. at org.apache.logging.log4j.core.LoggerContext.reconfigure(LoggerContext.java:634)
  205. at org.apache.logging.log4j.core.LoggerContext.start(LoggerContext.java:229)
  206. at org.apache.logging.log4j.core.impl.Log4jContextFactory.getContext(Log4jContextFactory.java:242)
  207. at org.apache.logging.log4j.core.impl.Log4jContextFactory.getContext(Log4jContextFactory.java:45)
  208. at org.apache.logging.log4j.LogManager.getContext(LogManager.java:174)
  209. at org.apache.logging.log4j.LogManager.getLogger(LogManager.java:618)
  210. at org.spongepowered.asm.mixin.struct.AnnotatedMethodInfo.<clinit>(AnnotatedMethodInfo.java:43)
  211. at org.spongepowered.tools.obfuscation.MixinObfuscationProcessorInjection.getSupportedAnnotationTypes(MixinObfuscationProcessorInjection.java:54)
  212. at org.gradle.api.internal.tasks.compile.processing.DelegatingProcessor.getSupportedAnnotationTypes(DelegatingProcessor.java:47)
  213. at org.gradle.api.internal.tasks.compile.processing.NonIncrementalProcessor.getSupportedAnnotationTypes(NonIncrementalProcessor.java:33)
  214. at org.gradle.api.internal.tasks.compile.processing.DelegatingProcessor.getSupportedAnnotationTypes(DelegatingProcessor.java:47)
  215. at org.gradle.api.internal.tasks.compile.processing.TimeTrackingProcessor.access$101(TimeTrackingProcessor.java:37)
  216. at org.gradle.api.internal.tasks.compile.processing.TimeTrackingProcessor$2.create(TimeTrackingProcessor.java:68)
  217. at org.gradle.api.internal.tasks.compile.processing.TimeTrackingProcessor$2.create(TimeTrackingProcessor.java:65)
  218. at org.gradle.api.internal.tasks.compile.processing.TimeTrackingProcessor.track(TimeTrackingProcessor.java:117)
  219. at org.gradle.api.internal.tasks.compile.processing.TimeTrackingProcessor.getSupportedAnnotationTypes(TimeTrackingProcessor.java:65)
  220. at com.sun.tools.javac.processing.JavacProcessingEnvironment$ProcessorState.<init>(JavacProcessingEnvironment.java:513)
  221. at com.sun.tools.javac.processing.JavacProcessingEnvironment$DiscoveredProcessors$ProcessorStateIterator.next(JavacProcessingEnvironment.java:605)
  222. at com.sun.tools.javac.processing.JavacProcessingEnvironment.discoverAndRunProcs(JavacProcessingEnvironment.java:698)
  223. at com.sun.tools.javac.processing.JavacProcessingEnvironment.access$1800(JavacProcessingEnvironment.java:91)
  224. at com.sun.tools.javac.processing.JavacProcessingEnvironment$Round.run(JavacProcessingEnvironment.java:1043)
  225. at com.sun.tools.javac.processing.JavacProcessingEnvironment.doProcessing(JavacProcessingEnvironment.java:1184)
  226. at com.sun.tools.javac.main.JavaCompiler.processAnnotations(JavaCompiler.java:1170)
  227. at com.sun.tools.javac.main.JavaCompiler.compile(JavaCompiler.java:856)
  228. at com.sun.tools.javac.main.Main.compile(Main.java:523)
  229. at com.sun.tools.javac.api.JavacTaskImpl.doCall(JavacTaskImpl.java:129)
  230. at com.sun.tools.javac.api.JavacTaskImpl.call(JavacTaskImpl.java:138)
  231. at org.gradle.internal.compiler.java.IncrementalCompileTask.call(IncrementalCompileTask.java:74)
  232. at org.gradle.api.internal.tasks.compile.AnnotationProcessingCompileTask.call(AnnotationProcessingCompileTask.java:93)
  233. at org.gradle.api.internal.tasks.compile.ResourceCleaningCompilationTask.call(ResourceCleaningCompilationTask.java:57)
  234. at org.gradle.api.internal.tasks.compile.JdkJavaCompiler.execute(JdkJavaCompiler.java:55)
  235. at org.gradle.api.internal.tasks.compile.JdkJavaCompiler.execute(JdkJavaCompiler.java:40)
  236. at org.gradle.api.internal.tasks.compile.NormalizingJavaCompiler.delegateAndHandleErrors(NormalizingJavaCompiler.java:97)
  237. at org.gradle.api.internal.tasks.compile.NormalizingJavaCompiler.execute(NormalizingJavaCompiler.java:51)
  238. at org.gradle.api.internal.tasks.compile.NormalizingJavaCompiler.execute(NormalizingJavaCompiler.java:37)
  239. at org.gradle.api.internal.tasks.compile.AnnotationProcessorDiscoveringCompiler.execute(AnnotationProcessorDiscoveringCompiler.java:51)
  240. at org.gradle.api.internal.tasks.compile.AnnotationProcessorDiscoveringCompiler.execute(AnnotationProcessorDiscoveringCompiler.java:37)
  241. at org.gradle.api.internal.tasks.compile.ModuleApplicationNameWritingCompiler.execute(ModuleApplicationNameWritingCompiler.java:46)
  242. at org.gradle.api.internal.tasks.compile.ModuleApplicationNameWritingCompiler.execute(ModuleApplicationNameWritingCompiler.java:36)
  243. at org.gradle.api.internal.tasks.compile.CleaningJavaCompiler.execute(CleaningJavaCompiler.java:53)
  244. at org.gradle.api.internal.tasks.compile.incremental.IncrementalCompilerFactory.lambda$createRebuildAllCompiler$0(IncrementalCompilerFactory.java:98)
  245. at org.gradle.api.internal.tasks.compile.incremental.IncrementalResultStoringCompiler.execute(IncrementalResultStoringCompiler.java:60)
  246. at org.gradle.api.internal.tasks.compile.incremental.IncrementalResultStoringCompiler.execute(IncrementalResultStoringCompiler.java:44)
  247. at org.gradle.api.internal.tasks.compile.CompileJavaBuildOperationReportingCompiler$2.call(CompileJavaBuildOperationReportingCompiler.java:59)
  248. at org.gradle.api.internal.tasks.compile.CompileJavaBuildOperationReportingCompiler$2.call(CompileJavaBuildOperationReportingCompiler.java:51)
  249. at org.gradle.internal.operations.DefaultBuildOperationExecutor$CallableBuildOperationWorker.execute(DefaultBuildOperationExecutor.java:409)
  250. at org.gradle.internal.operations.DefaultBuildOperationExecutor$CallableBuildOperationWorker.execute(DefaultBuildOperationExecutor.java:399)
  251. at org.gradle.internal.operations.DefaultBuildOperationExecutor$1.execute(DefaultBuildOperationExecutor.java:157)
  252. at org.gradle.internal.operations.DefaultBuildOperationExecutor.execute(DefaultBuildOperationExecutor.java:242)
  253. at org.gradle.internal.operations.DefaultBuildOperationExecutor.execute(DefaultBuildOperationExecutor.java:150)
  254. at org.gradle.internal.operations.DefaultBuildOperationExecutor.call(DefaultBuildOperationExecutor.java:94)
  255. at org.gradle.internal.operations.DelegatingBuildOperationExecutor.call(DelegatingBuildOperationExecutor.java:36)
  256. at org.gradle.api.internal.tasks.compile.CompileJavaBuildOperationReportingCompiler.execute(CompileJavaBuildOperationReportingCompiler.java:51)
  257. at org.gradle.api.tasks.compile.JavaCompile.performCompilation(JavaCompile.java:293)
  258. at org.gradle.api.tasks.compile.JavaCompile.performIncrementalCompilation(JavaCompile.java:203)
  259. at org.gradle.api.tasks.compile.JavaCompile.compile(JavaCompile.java:183)
  260. at sun.reflect.GeneratedMethodAccessor449.invoke(Unknown Source)
  261. at sun.reflect.DelegatingMethodAccessorImpl.invoke(DelegatingMethodAccessorImpl.java:43)
  262. at java.lang.reflect.Method.invoke(Method.java:498)
  263. at org.gradle.internal.reflect.JavaMethod.invoke(JavaMethod.java:104)
  264. at org.gradle.api.internal.project.taskfactory.IncrementalInputsTaskAction.doExecute(IncrementalInputsTaskAction.java:32)
  265. at org.gradle.api.internal.project.taskfactory.StandardTaskAction.execute(StandardTaskAction.java:42)
  266. at org.gradle.api.internal.project.taskfactory.AbstractIncrementalTaskAction.execute(AbstractIncrementalTaskAction.java:25)
  267. at org.gradle.api.internal.project.taskfactory.StandardTaskAction.execute(StandardTaskAction.java:28)
  268. at org.gradle.api.internal.tasks.execution.ExecuteActionsTaskExecuter$3.run(ExecuteActionsTaskExecuter.java:569)
  269. at org.gradle.internal.operations.DefaultBuildOperationExecutor$RunnableBuildOperationWorker.execute(DefaultBuildOperationExecutor.java:395)
  270. at org.gradle.internal.operations.DefaultBuildOperationExecutor$RunnableBuildOperationWorker.execute(DefaultBuildOperationExecutor.java:387)
  271. at org.gradle.internal.operations.DefaultBuildOperationExecutor$1.execute(DefaultBuildOperationExecutor.java:157)
  272. at org.gradle.internal.operations.DefaultBuildOperationExecutor.execute(DefaultBuildOperationExecutor.java:242)
  273. at org.gradle.internal.operations.DefaultBuildOperationExecutor.execute(DefaultBuildOperationExecutor.java:150)
  274. at org.gradle.internal.operations.DefaultBuildOperationExecutor.run(DefaultBuildOperationExecutor.java:84)
  275. at org.gradle.internal.operations.DelegatingBuildOperationExecutor.run(DelegatingBuildOperationExecutor.java:31)
  276. at org.gradle.api.internal.tasks.execution.ExecuteActionsTaskExecuter.executeAction(ExecuteActionsTaskExecuter.java:554)
  277. at org.gradle.api.internal.tasks.execution.ExecuteActionsTaskExecuter.executeActions(ExecuteActionsTaskExecuter.java:537)
  278. at org.gradle.api.internal.tasks.execution.ExecuteActionsTaskExecuter.access$300(ExecuteActionsTaskExecuter.java:108)
  279. at org.gradle.api.internal.tasks.execution.ExecuteActionsTaskExecuter$TaskExecution.executeWithPreviousOutputFiles(ExecuteActionsTaskExecuter.java:278)
  280. at org.gradle.api.internal.tasks.execution.ExecuteActionsTaskExecuter$TaskExecution.execute(ExecuteActionsTaskExecuter.java:267)
  281. at org.gradle.internal.execution.steps.ExecuteStep.lambda$execute$0(ExecuteStep.java:32)
  282. at java.util.Optional.map(Optional.java:215)
  283. at org.gradle.internal.execution.steps.ExecuteStep.execute(ExecuteStep.java:32)
  284. at org.gradle.internal.execution.steps.ExecuteStep.execute(ExecuteStep.java:26)
  285. at org.gradle.internal.execution.steps.CleanupOutputsStep.execute(CleanupOutputsStep.java:67)
  286. at org.gradle.internal.execution.steps.CleanupOutputsStep.execute(CleanupOutputsStep.java:36)
  287. at org.gradle.internal.execution.steps.ResolveInputChangesStep.execute(ResolveInputChangesStep.java:49)
  288. at org.gradle.internal.execution.steps.ResolveInputChangesStep.execute(ResolveInputChangesStep.java:34)
  289. at org.gradle.internal.execution.steps.CancelExecutionStep.execute(CancelExecutionStep.java:43)
  290. at org.gradle.internal.execution.steps.TimeoutStep.executeWithoutTimeout(TimeoutStep.java:73)
  291. at org.gradle.internal.execution.steps.TimeoutStep.execute(TimeoutStep.java:54)
  292. at org.gradle.internal.execution.steps.CatchExceptionStep.execute(CatchExceptionStep.java:34)
  293. at org.gradle.internal.execution.steps.CreateOutputsStep.execute(CreateOutputsStep.java:44)
  294. at org.gradle.internal.execution.steps.SnapshotOutputsStep.execute(SnapshotOutputsStep.java:54)
  295. at org.gradle.internal.execution.steps.SnapshotOutputsStep.execute(SnapshotOutputsStep.java:38)
  296. at org.gradle.internal.execution.steps.BroadcastChangingOutputsStep.execute(BroadcastChangingOutputsStep.java:49)
  297. at org.gradle.internal.execution.steps.CacheStep.executeWithoutCache(CacheStep.java:159)
  298. at org.gradle.internal.execution.steps.CacheStep.execute(CacheStep.java:72)
  299. at org.gradle.internal.execution.steps.CacheStep.execute(CacheStep.java:43)
  300. at org.gradle.internal.execution.steps.StoreExecutionStateStep.execute(StoreExecutionStateStep.java:44)
  301. at org.gradle.internal.execution.steps.StoreExecutionStateStep.execute(StoreExecutionStateStep.java:33)
  302. at org.gradle.internal.execution.steps.RecordOutputsStep.execute(RecordOutputsStep.java:38)
  303. at org.gradle.internal.execution.steps.RecordOutputsStep.execute(RecordOutputsStep.java:24)
  304. at org.gradle.internal.execution.steps.SkipUpToDateStep.executeBecause(SkipUpToDateStep.java:92)
  305. at org.gradle.internal.execution.steps.SkipUpToDateStep.lambda$execute$0(SkipUpToDateStep.java:85)
  306. at java.util.Optional.map(Optional.java:215)
  307. at org.gradle.internal.execution.steps.SkipUpToDateStep.execute(SkipUpToDateStep.java:55)
  308. at org.gradle.internal.execution.steps.SkipUpToDateStep.execute(SkipUpToDateStep.java:39)
  309. at org.gradle.internal.execution.steps.ResolveChangesStep.execute(ResolveChangesStep.java:76)
  310. at org.gradle.internal.execution.steps.ResolveChangesStep.execute(ResolveChangesStep.java:37)
  311. at org.gradle.internal.execution.steps.legacy.MarkSnapshottingInputsFinishedStep.execute(MarkSnapshottingInputsFinishedStep.java:36)
  312. at org.gradle.internal.execution.steps.legacy.MarkSnapshottingInputsFinishedStep.execute(MarkSnapshottingInputsFinishedStep.java:26)
  313. at org.gradle.internal.execution.steps.ResolveCachingStateStep.execute(ResolveCachingStateStep.java:94)
  314. at org.gradle.internal.execution.steps.ResolveCachingStateStep.execute(ResolveCachingStateStep.java:49)
  315. at org.gradle.internal.execution.steps.CaptureStateBeforeExecutionStep.execute(CaptureStateBeforeExecutionStep.java:79)
  316. at org.gradle.internal.execution.steps.CaptureStateBeforeExecutionStep.execute(CaptureStateBeforeExecutionStep.java:53)
  317. at org.gradle.internal.execution.steps.ValidateStep.execute(ValidateStep.java:74)
  318. at org.gradle.internal.execution.steps.SkipEmptyWorkStep.lambda$execute$2(SkipEmptyWorkStep.java:78)
  319. at java.util.Optional.orElseGet(Optional.java:267)
  320. at org.gradle.internal.execution.steps.SkipEmptyWorkStep.execute(SkipEmptyWorkStep.java:78)
  321. at org.gradle.internal.execution.steps.SkipEmptyWorkStep.execute(SkipEmptyWorkStep.java:34)
  322. at org.gradle.internal.execution.steps.legacy.MarkSnapshottingInputsStartedStep.execute(MarkSnapshottingInputsStartedStep.java:39)
  323. at org.gradle.internal.execution.steps.LoadExecutionStateStep.execute(LoadExecutionStateStep.java:40)
  324. at org.gradle.internal.execution.steps.LoadExecutionStateStep.execute(LoadExecutionStateStep.java:28)
  325. at org.gradle.internal.execution.impl.DefaultWorkExecutor.execute(DefaultWorkExecutor.java:33)
  326. at org.gradle.api.internal.tasks.execution.ExecuteActionsTaskExecuter.executeIfValid(ExecuteActionsTaskExecuter.java:194)
  327. at org.gradle.api.internal.tasks.execution.ExecuteActionsTaskExecuter.execute(ExecuteActionsTaskExecuter.java:186)
  328. at org.gradle.api.internal.tasks.execution.CleanupStaleOutputsExecuter.execute(CleanupStaleOutputsExecuter.java:114)
  329. at org.gradle.api.internal.tasks.execution.FinalizePropertiesTaskExecuter.execute(FinalizePropertiesTaskExecuter.java:46)
  330. at org.gradle.api.internal.tasks.execution.ResolveTaskExecutionModeExecuter.execute(ResolveTaskExecutionModeExecuter.java:62)
  331. at org.gradle.api.internal.tasks.execution.SkipTaskWithNoActionsExecuter.execute(SkipTaskWithNoActionsExecuter.java:57)
  332. at org.gradle.api.internal.tasks.execution.SkipOnlyIfTaskExecuter.execute(SkipOnlyIfTaskExecuter.java:56)
  333. at org.gradle.api.internal.tasks.execution.CatchExceptionTaskExecuter.execute(CatchExceptionTaskExecuter.java:36)
  334. at org.gradle.api.internal.tasks.execution.EventFiringTaskExecuter$1.executeTask(EventFiringTaskExecuter.java:77)
  335. at org.gradle.api.internal.tasks.execution.EventFiringTaskExecuter$1.call(EventFiringTaskExecuter.java:55)
  336. at org.gradle.api.internal.tasks.execution.EventFiringTaskExecuter$1.call(EventFiringTaskExecuter.java:52)
  337. at org.gradle.internal.operations.DefaultBuildOperationExecutor$CallableBuildOperationWorker.execute(DefaultBuildOperationExecutor.java:409)
  338. at org.gradle.internal.operations.DefaultBuildOperationExecutor$CallableBuildOperationWorker.execute(DefaultBuildOperationExecutor.java:399)
  339. at org.gradle.internal.operations.DefaultBuildOperationExecutor$1.execute(DefaultBuildOperationExecutor.java:157)
  340. at org.gradle.internal.operations.DefaultBuildOperationExecutor.execute(DefaultBuildOperationExecutor.java:242)
  341. at org.gradle.internal.operations.DefaultBuildOperationExecutor.execute(DefaultBuildOperationExecutor.java:150)
  342. at org.gradle.internal.operations.DefaultBuildOperationExecutor.call(DefaultBuildOperationExecutor.java:94)
  343. at org.gradle.internal.operations.DelegatingBuildOperationExecutor.call(DelegatingBuildOperationExecutor.java:36)
  344. at org.gradle.api.internal.tasks.execution.EventFiringTaskExecuter.execute(EventFiringTaskExecuter.java:52)
  345. at org.gradle.execution.plan.LocalTaskNodeExecutor.execute(LocalTaskNodeExecutor.java:41)
  346. at org.gradle.execution.taskgraph.DefaultTaskExecutionGraph$InvokeNodeExecutorsAction.execute(DefaultTaskExecutionGraph.java:356)
  347. at org.gradle.execution.taskgraph.DefaultTaskExecutionGraph$InvokeNodeExecutorsAction.execute(DefaultTaskExecutionGraph.java:343)
  348. at org.gradle.execution.taskgraph.DefaultTaskExecutionGraph$BuildOperationAwareExecutionAction.execute(DefaultTaskExecutionGraph.java:336)
  349. at org.gradle.execution.taskgraph.DefaultTaskExecutionGraph$BuildOperationAwareExecutionAction.execute(DefaultTaskExecutionGraph.java:322)
  350. at org.gradle.execution.plan.DefaultPlanExecutor$ExecutorWorker.lambda$run$0(DefaultPlanExecutor.java:127)
  351. at org.gradle.execution.plan.DefaultPlanExecutor$ExecutorWorker.execute(DefaultPlanExecutor.java:191)
  352. at org.gradle.execution.plan.DefaultPlanExecutor$ExecutorWorker.executeNextNode(DefaultPlanExecutor.java:182)
  353. at org.gradle.execution.plan.DefaultPlanExecutor$ExecutorWorker.run(DefaultPlanExecutor.java:124)
  354. at org.gradle.internal.concurrent.ExecutorPolicy$CatchAndRecordFailures.onExecute(ExecutorPolicy.java:64)
  355. at org.gradle.internal.concurrent.ManagedExecutorImpl$1.run(ManagedExecutorImpl.java:48)
  356. at java.util.concurrent.ThreadPoolExecutor.runWorker(ThreadPoolExecutor.java:1149)
  357. at java.util.concurrent.ThreadPoolExecutor$Worker.run(ThreadPoolExecutor.java:624)
  358. at org.gradle.internal.concurrent.ThreadFactoryImpl$ManagedThreadRunnable.run(ThreadFactoryImpl.java:56)
  359. at java.lang.Thread.run(Thread.java:748)
  360. 2021-03-05 15:30:28,624 Execution worker for ':' ERROR Unable to invoke factory method in class class org.apache.logging.log4j.core.appender.RollingRandomAccessFileAppender for element RollingRandomAccessFile. java.lang.IllegalStateException: No factory method found for class org.apache.logging.log4j.core.appender.RollingRandomAccessFileAppender
  361. at org.apache.logging.log4j.core.config.plugins.util.PluginBuilder.findFactoryMethod(PluginBuilder.java:224)
  362. at org.apache.logging.log4j.core.config.plugins.util.PluginBuilder.build(PluginBuilder.java:130)
  363. at org.apache.logging.log4j.core.config.AbstractConfiguration.createPluginObject(AbstractConfiguration.java:952)
  364. at org.apache.logging.log4j.core.config.AbstractConfiguration.createConfiguration(AbstractConfiguration.java:892)
  365. at org.apache.logging.log4j.core.config.AbstractConfiguration.createConfiguration(AbstractConfiguration.java:884)
  366. at org.apache.logging.log4j.core.config.AbstractConfiguration.doConfigure(AbstractConfiguration.java:508)
  367. at org.apache.logging.log4j.core.config.AbstractConfiguration.initialize(AbstractConfiguration.java:232)
  368. at org.apache.logging.log4j.core.config.AbstractConfiguration.start(AbstractConfiguration.java:244)
  369. at org.apache.logging.log4j.core.LoggerContext.setConfiguration(LoggerContext.java:545)
  370. at org.apache.logging.log4j.core.LoggerContext.reconfigure(LoggerContext.java:617)
  371. at org.apache.logging.log4j.core.LoggerContext.reconfigure(LoggerContext.java:634)
  372. at org.apache.logging.log4j.core.LoggerContext.start(LoggerContext.java:229)
  373. at org.apache.logging.log4j.core.impl.Log4jContextFactory.getContext(Log4jContextFactory.java:242)
  374. at org.apache.logging.log4j.core.impl.Log4jContextFactory.getContext(Log4jContextFactory.java:45)
  375. at org.apache.logging.log4j.LogManager.getContext(LogManager.java:174)
  376. at org.apache.logging.log4j.LogManager.getLogger(LogManager.java:618)
  377. at org.spongepowered.asm.mixin.struct.AnnotatedMethodInfo.<clinit>(AnnotatedMethodInfo.java:43)
  378. at org.spongepowered.tools.obfuscation.MixinObfuscationProcessorInjection.getSupportedAnnotationTypes(MixinObfuscationProcessorInjection.java:54)
  379. at org.gradle.api.internal.tasks.compile.processing.DelegatingProcessor.getSupportedAnnotationTypes(DelegatingProcessor.java:47)
  380. at org.gradle.api.internal.tasks.compile.processing.NonIncrementalProcessor.getSupportedAnnotationTypes(NonIncrementalProcessor.java:33)
  381. at org.gradle.api.internal.tasks.compile.processing.DelegatingProcessor.getSupportedAnnotationTypes(DelegatingProcessor.java:47)
  382. at org.gradle.api.internal.tasks.compile.processing.TimeTrackingProcessor.access$101(TimeTrackingProcessor.java:37)
  383. at org.gradle.api.internal.tasks.compile.processing.TimeTrackingProcessor$2.create(TimeTrackingProcessor.java:68)
  384. at org.gradle.api.internal.tasks.compile.processing.TimeTrackingProcessor$2.create(TimeTrackingProcessor.java:65)
  385. at org.gradle.api.internal.tasks.compile.processing.TimeTrackingProcessor.track(TimeTrackingProcessor.java:117)
  386. at org.gradle.api.internal.tasks.compile.processing.TimeTrackingProcessor.getSupportedAnnotationTypes(TimeTrackingProcessor.java:65)
  387. at com.sun.tools.javac.processing.JavacProcessingEnvironment$ProcessorState.<init>(JavacProcessingEnvironment.java:513)
  388. at com.sun.tools.javac.processing.JavacProcessingEnvironment$DiscoveredProcessors$ProcessorStateIterator.next(JavacProcessingEnvironment.java:605)
  389. at com.sun.tools.javac.processing.JavacProcessingEnvironment.discoverAndRunProcs(JavacProcessingEnvironment.java:698)
  390. at com.sun.tools.javac.processing.JavacProcessingEnvironment.access$1800(JavacProcessingEnvironment.java:91)
  391. at com.sun.tools.javac.processing.JavacProcessingEnvironment$Round.run(JavacProcessingEnvironment.java:1043)
  392. at com.sun.tools.javac.processing.JavacProcessingEnvironment.doProcessing(JavacProcessingEnvironment.java:1184)
  393. at com.sun.tools.javac.main.JavaCompiler.processAnnotations(JavaCompiler.java:1170)
  394. at com.sun.tools.javac.main.JavaCompiler.compile(JavaCompiler.java:856)
  395. at com.sun.tools.javac.main.Main.compile(Main.java:523)
  396. at com.sun.tools.javac.api.JavacTaskImpl.doCall(JavacTaskImpl.java:129)
  397. at com.sun.tools.javac.api.JavacTaskImpl.call(JavacTaskImpl.java:138)
  398. at org.gradle.internal.compiler.java.IncrementalCompileTask.call(IncrementalCompileTask.java:74)
  399. at org.gradle.api.internal.tasks.compile.AnnotationProcessingCompileTask.call(AnnotationProcessingCompileTask.java:93)
  400. at org.gradle.api.internal.tasks.compile.ResourceCleaningCompilationTask.call(ResourceCleaningCompilationTask.java:57)
  401. at org.gradle.api.internal.tasks.compile.JdkJavaCompiler.execute(JdkJavaCompiler.java:55)
  402. at org.gradle.api.internal.tasks.compile.JdkJavaCompiler.execute(JdkJavaCompiler.java:40)
  403. at org.gradle.api.internal.tasks.compile.NormalizingJavaCompiler.delegateAndHandleErrors(NormalizingJavaCompiler.java:97)
  404. at org.gradle.api.internal.tasks.compile.NormalizingJavaCompiler.execute(NormalizingJavaCompiler.java:51)
  405. at org.gradle.api.internal.tasks.compile.NormalizingJavaCompiler.execute(NormalizingJavaCompiler.java:37)
  406. at org.gradle.api.internal.tasks.compile.AnnotationProcessorDiscoveringCompiler.execute(AnnotationProcessorDiscoveringCompiler.java:51)
  407. at org.gradle.api.internal.tasks.compile.AnnotationProcessorDiscoveringCompiler.execute(AnnotationProcessorDiscoveringCompiler.java:37)
  408. at org.gradle.api.internal.tasks.compile.ModuleApplicationNameWritingCompiler.execute(ModuleApplicationNameWritingCompiler.java:46)
  409. at org.gradle.api.internal.tasks.compile.ModuleApplicationNameWritingCompiler.execute(ModuleApplicationNameWritingCompiler.java:36)
  410. at org.gradle.api.internal.tasks.compile.CleaningJavaCompiler.execute(CleaningJavaCompiler.java:53)
  411. at org.gradle.api.internal.tasks.compile.incremental.IncrementalCompilerFactory.lambda$createRebuildAllCompiler$0(IncrementalCompilerFactory.java:98)
  412. at org.gradle.api.internal.tasks.compile.incremental.IncrementalResultStoringCompiler.execute(IncrementalResultStoringCompiler.java:60)
  413. at org.gradle.api.internal.tasks.compile.incremental.IncrementalResultStoringCompiler.execute(IncrementalResultStoringCompiler.java:44)
  414. at org.gradle.api.internal.tasks.compile.CompileJavaBuildOperationReportingCompiler$2.call(CompileJavaBuildOperationReportingCompiler.java:59)
  415. at org.gradle.api.internal.tasks.compile.CompileJavaBuildOperationReportingCompiler$2.call(CompileJavaBuildOperationReportingCompiler.java:51)
  416. at org.gradle.internal.operations.DefaultBuildOperationExecutor$CallableBuildOperationWorker.execute(DefaultBuildOperationExecutor.java:409)
  417. at org.gradle.internal.operations.DefaultBuildOperationExecutor$CallableBuildOperationWorker.execute(DefaultBuildOperationExecutor.java:399)
  418. at org.gradle.internal.operations.DefaultBuildOperationExecutor$1.execute(DefaultBuildOperationExecutor.java:157)
  419. at org.gradle.internal.operations.DefaultBuildOperationExecutor.execute(DefaultBuildOperationExecutor.java:242)
  420. at org.gradle.internal.operations.DefaultBuildOperationExecutor.execute(DefaultBuildOperationExecutor.java:150)
  421. at org.gradle.internal.operations.DefaultBuildOperationExecutor.call(DefaultBuildOperationExecutor.java:94)
  422. at org.gradle.internal.operations.DelegatingBuildOperationExecutor.call(DelegatingBuildOperationExecutor.java:36)
  423. at org.gradle.api.internal.tasks.compile.CompileJavaBuildOperationReportingCompiler.execute(CompileJavaBuildOperationReportingCompiler.java:51)
  424. at org.gradle.api.tasks.compile.JavaCompile.performCompilation(JavaCompile.java:293)
  425. at org.gradle.api.tasks.compile.JavaCompile.performIncrementalCompilation(JavaCompile.java:203)
  426. at org.gradle.api.tasks.compile.JavaCompile.compile(JavaCompile.java:183)
  427. at sun.reflect.GeneratedMethodAccessor449.invoke(Unknown Source)
  428. at sun.reflect.DelegatingMethodAccessorImpl.invoke(DelegatingMethodAccessorImpl.java:43)
  429. at java.lang.reflect.Method.invoke(Method.java:498)
  430. at org.gradle.internal.reflect.JavaMethod.invoke(JavaMethod.java:104)
  431. at org.gradle.api.internal.project.taskfactory.IncrementalInputsTaskAction.doExecute(IncrementalInputsTaskAction.java:32)
  432. at org.gradle.api.internal.project.taskfactory.StandardTaskAction.execute(StandardTaskAction.java:42)
  433. at org.gradle.api.internal.project.taskfactory.AbstractIncrementalTaskAction.execute(AbstractIncrementalTaskAction.java:25)
  434. at org.gradle.api.internal.project.taskfactory.StandardTaskAction.execute(StandardTaskAction.java:28)
  435. at org.gradle.api.internal.tasks.execution.ExecuteActionsTaskExecuter$3.run(ExecuteActionsTaskExecuter.java:569)
  436. at org.gradle.internal.operations.DefaultBuildOperationExecutor$RunnableBuildOperationWorker.execute(DefaultBuildOperationExecutor.java:395)
  437. at org.gradle.internal.operations.DefaultBuildOperationExecutor$RunnableBuildOperationWorker.execute(DefaultBuildOperationExecutor.java:387)
  438. at org.gradle.internal.operations.DefaultBuildOperationExecutor$1.execute(DefaultBuildOperationExecutor.java:157)
  439. at org.gradle.internal.operations.DefaultBuildOperationExecutor.execute(DefaultBuildOperationExecutor.java:242)
  440. at org.gradle.internal.operations.DefaultBuildOperationExecutor.execute(DefaultBuildOperationExecutor.java:150)
  441. at org.gradle.internal.operations.DefaultBuildOperationExecutor.run(DefaultBuildOperationExecutor.java:84)
  442. at org.gradle.internal.operations.DelegatingBuildOperationExecutor.run(DelegatingBuildOperationExecutor.java:31)
  443. at org.gradle.api.internal.tasks.execution.ExecuteActionsTaskExecuter.executeAction(ExecuteActionsTaskExecuter.java:554)
  444. at org.gradle.api.internal.tasks.execution.ExecuteActionsTaskExecuter.executeActions(ExecuteActionsTaskExecuter.java:537)
  445. at org.gradle.api.internal.tasks.execution.ExecuteActionsTaskExecuter.access$300(ExecuteActionsTaskExecuter.java:108)
  446. at org.gradle.api.internal.tasks.execution.ExecuteActionsTaskExecuter$TaskExecution.executeWithPreviousOutputFiles(ExecuteActionsTaskExecuter.java:278)
  447. at org.gradle.api.internal.tasks.execution.ExecuteActionsTaskExecuter$TaskExecution.execute(ExecuteActionsTaskExecuter.java:267)
  448. at org.gradle.internal.execution.steps.ExecuteStep.lambda$execute$0(ExecuteStep.java:32)
  449. at java.util.Optional.map(Optional.java:215)
  450. at org.gradle.internal.execution.steps.ExecuteStep.execute(ExecuteStep.java:32)
  451. at org.gradle.internal.execution.steps.ExecuteStep.execute(ExecuteStep.java:26)
  452. at org.gradle.internal.execution.steps.CleanupOutputsStep.execute(CleanupOutputsStep.java:67)
  453. at org.gradle.internal.execution.steps.CleanupOutputsStep.execute(CleanupOutputsStep.java:36)
  454. at org.gradle.internal.execution.steps.ResolveInputChangesStep.execute(ResolveInputChangesStep.java:49)
  455. at org.gradle.internal.execution.steps.ResolveInputChangesStep.execute(ResolveInputChangesStep.java:34)
  456. at org.gradle.internal.execution.steps.CancelExecutionStep.execute(CancelExecutionStep.java:43)
  457. at org.gradle.internal.execution.steps.TimeoutStep.executeWithoutTimeout(TimeoutStep.java:73)
  458. at org.gradle.internal.execution.steps.TimeoutStep.execute(TimeoutStep.java:54)
  459. at org.gradle.internal.execution.steps.CatchExceptionStep.execute(CatchExceptionStep.java:34)
  460. at org.gradle.internal.execution.steps.CreateOutputsStep.execute(CreateOutputsStep.java:44)
  461. at org.gradle.internal.execution.steps.SnapshotOutputsStep.execute(SnapshotOutputsStep.java:54)
  462. at org.gradle.internal.execution.steps.SnapshotOutputsStep.execute(SnapshotOutputsStep.java:38)
  463. at org.gradle.internal.execution.steps.BroadcastChangingOutputsStep.execute(BroadcastChangingOutputsStep.java:49)
  464. at org.gradle.internal.execution.steps.CacheStep.executeWithoutCache(CacheStep.java:159)
  465. at org.gradle.internal.execution.steps.CacheStep.execute(CacheStep.java:72)
  466. at org.gradle.internal.execution.steps.CacheStep.execute(CacheStep.java:43)
  467. at org.gradle.internal.execution.steps.StoreExecutionStateStep.execute(StoreExecutionStateStep.java:44)
  468. at org.gradle.internal.execution.steps.StoreExecutionStateStep.execute(StoreExecutionStateStep.java:33)
  469. at org.gradle.internal.execution.steps.RecordOutputsStep.execute(RecordOutputsStep.java:38)
  470. at org.gradle.internal.execution.steps.RecordOutputsStep.execute(RecordOutputsStep.java:24)
  471. at org.gradle.internal.execution.steps.SkipUpToDateStep.executeBecause(SkipUpToDateStep.java:92)
  472. at org.gradle.internal.execution.steps.SkipUpToDateStep.lambda$execute$0(SkipUpToDateStep.java:85)
  473. at java.util.Optional.map(Optional.java:215)
  474. at org.gradle.internal.execution.steps.SkipUpToDateStep.execute(SkipUpToDateStep.java:55)
  475. at org.gradle.internal.execution.steps.SkipUpToDateStep.execute(SkipUpToDateStep.java:39)
  476. at org.gradle.internal.execution.steps.ResolveChangesStep.execute(ResolveChangesStep.java:76)
  477. at org.gradle.internal.execution.steps.ResolveChangesStep.execute(ResolveChangesStep.java:37)
  478. at org.gradle.internal.execution.steps.legacy.MarkSnapshottingInputsFinishedStep.execute(MarkSnapshottingInputsFinishedStep.java:36)
  479. at org.gradle.internal.execution.steps.legacy.MarkSnapshottingInputsFinishedStep.execute(MarkSnapshottingInputsFinishedStep.java:26)
  480. at org.gradle.internal.execution.steps.ResolveCachingStateStep.execute(ResolveCachingStateStep.java:94)
  481. at org.gradle.internal.execution.steps.ResolveCachingStateStep.execute(ResolveCachingStateStep.java:49)
  482. at org.gradle.internal.execution.steps.CaptureStateBeforeExecutionStep.execute(CaptureStateBeforeExecutionStep.java:79)
  483. at org.gradle.internal.execution.steps.CaptureStateBeforeExecutionStep.execute(CaptureStateBeforeExecutionStep.java:53)
  484. at org.gradle.internal.execution.steps.ValidateStep.execute(ValidateStep.java:74)
  485. at org.gradle.internal.execution.steps.SkipEmptyWorkStep.lambda$execute$2(SkipEmptyWorkStep.java:78)
  486. at java.util.Optional.orElseGet(Optional.java:267)
  487. at org.gradle.internal.execution.steps.SkipEmptyWorkStep.execute(SkipEmptyWorkStep.java:78)
  488. at org.gradle.internal.execution.steps.SkipEmptyWorkStep.execute(SkipEmptyWorkStep.java:34)
  489. at org.gradle.internal.execution.steps.legacy.MarkSnapshottingInputsStartedStep.execute(MarkSnapshottingInputsStartedStep.java:39)
  490. at org.gradle.internal.execution.steps.LoadExecutionStateStep.execute(LoadExecutionStateStep.java:40)
  491. at org.gradle.internal.execution.steps.LoadExecutionStateStep.execute(LoadExecutionStateStep.java:28)
  492. at org.gradle.internal.execution.impl.DefaultWorkExecutor.execute(DefaultWorkExecutor.java:33)
  493. at org.gradle.api.internal.tasks.execution.ExecuteActionsTaskExecuter.executeIfValid(ExecuteActionsTaskExecuter.java:194)
  494. at org.gradle.api.internal.tasks.execution.ExecuteActionsTaskExecuter.execute(ExecuteActionsTaskExecuter.java:186)
  495. at org.gradle.api.internal.tasks.execution.CleanupStaleOutputsExecuter.execute(CleanupStaleOutputsExecuter.java:114)
  496. at org.gradle.api.internal.tasks.execution.FinalizePropertiesTaskExecuter.execute(FinalizePropertiesTaskExecuter.java:46)
  497. at org.gradle.api.internal.tasks.execution.ResolveTaskExecutionModeExecuter.execute(ResolveTaskExecutionModeExecuter.java:62)
  498. at org.gradle.api.internal.tasks.execution.SkipTaskWithNoActionsExecuter.execute(SkipTaskWithNoActionsExecuter.java:57)
  499. at org.gradle.api.internal.tasks.execution.SkipOnlyIfTaskExecuter.execute(SkipOnlyIfTaskExecuter.java:56)
  500. at org.gradle.api.internal.tasks.execution.CatchExceptionTaskExecuter.execute(CatchExceptionTaskExecuter.java:36)
  501. at org.gradle.api.internal.tasks.execution.EventFiringTaskExecuter$1.executeTask(EventFiringTaskExecuter.java:77)
  502. at org.gradle.api.internal.tasks.execution.EventFiringTaskExecuter$1.call(EventFiringTaskExecuter.java:55)
  503. at org.gradle.api.internal.tasks.execution.EventFiringTaskExecuter$1.call(EventFiringTaskExecuter.java:52)
  504. at org.gradle.internal.operations.DefaultBuildOperationExecutor$CallableBuildOperationWorker.execute(DefaultBuildOperationExecutor.java:409)
  505. at org.gradle.internal.operations.DefaultBuildOperationExecutor$CallableBuildOperationWorker.execute(DefaultBuildOperationExecutor.java:399)
  506. at org.gradle.internal.operations.DefaultBuildOperationExecutor$1.execute(DefaultBuildOperationExecutor.java:157)
  507. at org.gradle.internal.operations.DefaultBuildOperationExecutor.execute(DefaultBuildOperationExecutor.java:242)
  508. at org.gradle.internal.operations.DefaultBuildOperationExecutor.execute(DefaultBuildOperationExecutor.java:150)
  509. at org.gradle.internal.operations.DefaultBuildOperationExecutor.call(DefaultBuildOperationExecutor.java:94)
  510. at org.gradle.internal.operations.DelegatingBuildOperationExecutor.call(DelegatingBuildOperationExecutor.java:36)
  511. at org.gradle.api.internal.tasks.execution.EventFiringTaskExecuter.execute(EventFiringTaskExecuter.java:52)
  512. at org.gradle.execution.plan.LocalTaskNodeExecutor.execute(LocalTaskNodeExecutor.java:41)
  513. at org.gradle.execution.taskgraph.DefaultTaskExecutionGraph$InvokeNodeExecutorsAction.execute(DefaultTaskExecutionGraph.java:356)
  514. at org.gradle.execution.taskgraph.DefaultTaskExecutionGraph$InvokeNodeExecutorsAction.execute(DefaultTaskExecutionGraph.java:343)
  515. at org.gradle.execution.taskgraph.DefaultTaskExecutionGraph$BuildOperationAwareExecutionAction.execute(DefaultTaskExecutionGraph.java:336)
  516. at org.gradle.execution.taskgraph.DefaultTaskExecutionGraph$BuildOperationAwareExecutionAction.execute(DefaultTaskExecutionGraph.java:322)
  517. at org.gradle.execution.plan.DefaultPlanExecutor$ExecutorWorker.lambda$run$0(DefaultPlanExecutor.java:127)
  518. at org.gradle.execution.plan.DefaultPlanExecutor$ExecutorWorker.execute(DefaultPlanExecutor.java:191)
  519. at org.gradle.execution.plan.DefaultPlanExecutor$ExecutorWorker.executeNextNode(DefaultPlanExecutor.java:182)
  520. at org.gradle.execution.plan.DefaultPlanExecutor$ExecutorWorker.run(DefaultPlanExecutor.java:124)
  521. at org.gradle.internal.concurrent.ExecutorPolicy$CatchAndRecordFailures.onExecute(ExecutorPolicy.java:64)
  522. at org.gradle.internal.concurrent.ManagedExecutorImpl$1.run(ManagedExecutorImpl.java:48)
  523. at java.util.concurrent.ThreadPoolExecutor.runWorker(ThreadPoolExecutor.java:1149)
  524. at java.util.concurrent.ThreadPoolExecutor$Worker.run(ThreadPoolExecutor.java:624)
  525. at org.gradle.internal.concurrent.ThreadFactoryImpl$ManagedThreadRunnable.run(ThreadFactoryImpl.java:56)
  526. at java.lang.Thread.run(Thread.java:748)
  527. 2021-03-05 15:30:28,637 Execution worker for ':' ERROR Null object returned for RollingRandomAccessFile in Appenders.
  528. 2021-03-05 15:30:28,667 Execution worker for ':' ERROR Unable to locate appender "File" for logger config "root"
  529. Note: SpongePowered MIXIN Annotation Processor Version=0.8.1
  530. Note: ObfuscationServiceFabric supports type: "official:intermediary"
  531. Note: ObfuscationServiceFabric supports type: "official:named"
  532. Note: ObfuscationServiceFabric supports type: "intermediary:official"
  533. Note: ObfuscationServiceFabric supports type: "intermediary:named"
  534. Note: ObfuscationServiceFabric supports type: "named:official"
  535. Note: ObfuscationServiceFabric supports type: "named:intermediary"
  536. Note: ObfuscationServiceMCP supports type: "searge"
  537. Note: ObfuscationServiceMCP supports type: "notch"
  538. C:\Users\kd_ra\MCreatorWorkspaces\mob_armour\src\main\java\net\mcreator\mobarmour\MobArmourMod.java:44: error: cannot find symbol
  539. public static final Item TurtPick_TOOL = Registry.register(Registry.ITEM, id("turt_pick"), TurtPickTool.INSTANCE);
  540. ^
  541. symbol: variable TurtPickTool
  542. location: class MobArmourMod
  543. 1 error
  544. > Task :compileJava FAILED
  545. FAILURE: Build failed with an exception.
  546. * What went wrong:
  547. Execution failed for task ':compileJava'.
  548. > Compilation failed; see the compiler error output for details.
  549. * Try:
  550. Run with --stacktrace option to get the stack trace. Run with --info or --debug option to get more log output. Run with --scan to get full insights.
  551. * Get more help at https://help.gradle.org
  552. BUILD FAILED in 4s
  553. 1 actionable task: 1 executed
  554. BUILD FAILED
  555. Task completed in 14083 milliseconds
  556.  
Advertisement
RAW Paste Data Copied
Advertisement