Guest User

3.6.9

a guest
Dec 11th, 2019
60
Never
Not a member of Pastebin yet? Sign Up, it unlocks many cool features!
  1. == CPython 3.6.9 (default, Dec 11 2019, 05:39:25) [GCC 4.2.1 Compatible Apple LLVM 11.0.0 (clang-1100.0.33.16)]
  2. == Darwin-19.2.0-x86_64-i386-64bit little-endian
  3. == cwd: /private/var/folders/_v/9r245bv51z77v4_khb_j55y40000gn/T/test_python_83388
  4. == CPU count: 4
  5. == encodings: locale=UTF-8, FS=utf-8
  6. Run tests sequentially
  7. 0:00:00 load avg: 5.46 [ 1/407] test_grammar
  8. 0:00:00 load avg: 5.46 [ 2/407] test_opcodes
  9. 0:00:00 load avg: 5.46 [ 3/407] test_dict
  10. 0:00:00 load avg: 5.46 [ 4/407] test_builtin
  11. 0:00:00 load avg: 5.46 [ 5/407] test_exceptions
  12. 0:00:01 load avg: 5.46 [ 6/407] test_types
  13. 0:00:01 load avg: 5.46 [ 7/407] test_unittest
  14. 0:00:02 load avg: 5.34 [ 8/407] test_doctest
  15. 0:00:04 load avg: 5.34 [ 9/407] test_doctest2
  16. 0:00:04 load avg: 5.34 [ 10/407] test_support
  17. 0:00:08 load avg: 5.32 [ 11/407] test___all__
  18. 0:00:09 load avg: 5.32 [ 12/407] test___future__
  19. 0:00:09 load avg: 5.32 [ 13/407] test__locale
  20. 0:00:10 load avg: 5.32 [ 14/407] test__opcode
  21. 0:00:10 load avg: 5.32 [ 15/407] test__osx_support
  22. 0:00:10 load avg: 5.32 [ 16/407] test_abc
  23. 0:00:10 load avg: 5.32 [ 17/407] test_abstract_numbers
  24. 0:00:10 load avg: 5.32 [ 18/407] test_aifc
  25. 0:00:10 load avg: 5.32 [ 19/407] test_argparse
  26. 0:00:13 load avg: 5.21 [ 20/407] test_array
  27. 0:00:15 load avg: 5.21 [ 21/407] test_asdl_parser
  28. test_asdl_parser skipped -- test irrelevant for an installed Python
  29. 0:00:15 load avg: 5.21 [ 22/407] test_ast -- test_asdl_parser skipped
  30. 0:00:17 load avg: 5.21 [ 23/407] test_asyncgen
  31. 0:00:18 load avg: 4.87 [ 24/407] test_asynchat
  32. 0:00:19 load avg: 4.87 [ 25/407] test_asyncio
  33. 0:01:20 load avg: 7.50 [ 26/407] test_asyncore -- test_asyncio passed in 1 min 693 ms
  34. 0:01:22 load avg: 7.50 [ 27/407] test_atexit
  35. 0:01:22 load avg: 7.50 [ 28/407] test_audioop
  36. 0:01:23 load avg: 7.50 [ 29/407] test_augassign
  37. 0:01:23 load avg: 7.50 [ 30/407] test_base64
  38. 0:01:23 load avg: 7.38 [ 31/407] test_baseexception
  39. 0:01:23 load avg: 7.38 [ 32/407] test_bdb
  40. 0:01:23 load avg: 7.38 [ 33/407] test_bigaddrspace
  41. 0:01:24 load avg: 7.38 [ 34/407] test_bigmem
  42. 0:01:24 load avg: 7.38 [ 35/407] test_binascii
  43. 0:01:24 load avg: 7.38 [ 36/407] test_binhex
  44. 0:01:24 load avg: 7.38 [ 37/407] test_binop
  45. 0:01:24 load avg: 7.38 [ 38/407] test_bisect
  46. 0:01:24 load avg: 7.38 [ 39/407] test_bool
  47. 0:01:25 load avg: 7.38 [ 40/407] test_buffer
  48. 0:01:32 load avg: 7.03 [ 41/407] test_bufio
  49. 0:01:34 load avg: 7.03 [ 42/407] test_bytes
  50. 0:01:35 load avg: 7.03 [ 43/407] test_bz2
  51. 0:01:40 load avg: 6.70 [ 44/407] test_calendar
  52. 0:01:42 load avg: 6.70 [ 45/407] test_call
  53. 0:01:42 load avg: 6.70 [ 46/407] test_capi
  54. 0:01:46 load avg: 7.77 [ 47/407] test_cgi
  55. 0:01:46 load avg: 7.77 [ 48/407] test_cgitb
  56. 0:01:47 load avg: 7.77 [ 49/407] test_charmapcodec
  57. 0:01:47 load avg: 7.77 [ 50/407] test_class
  58. 0:01:47 load avg: 7.77 [ 51/407] test_cmath
  59. 0:01:47 load avg: 7.77 [ 52/407] test_cmd
  60. 0:01:47 load avg: 7.77 [ 53/407] test_cmd_line
  61. 0:01:50 load avg: 7.55 [ 54/407] test_cmd_line_script
  62. 0:01:54 load avg: 7.18 [ 55/407] test_code
  63. 0:01:54 load avg: 7.18 [ 56/407] test_code_module
  64. 0:01:54 load avg: 7.18 [ 57/407] test_codeccallbacks
  65. 0:01:54 load avg: 7.18 [ 58/407] test_codecencodings_cn
  66. 0:01:55 load avg: 7.18 [ 59/407] test_codecencodings_hk
  67. 0:01:55 load avg: 7.18 [ 60/407] test_codecencodings_iso2022
  68. 0:01:56 load avg: 7.18 [ 61/407] test_codecencodings_jp
  69. 0:01:56 load avg: 7.18 [ 62/407] test_codecencodings_kr
  70. 0:01:56 load avg: 7.18 [ 63/407] test_codecencodings_tw
  71. 0:01:57 load avg: 7.18 [ 64/407] test_codecmaps_cn
  72. 0:01:57 load avg: 7.18 [ 65/407] test_codecmaps_hk
  73. 0:01:57 load avg: 7.18 [ 66/407] test_codecmaps_jp
  74. 0:01:57 load avg: 7.18 [ 67/407] test_codecmaps_kr
  75. 0:01:57 load avg: 7.18 [ 68/407] test_codecmaps_tw
  76. 0:01:57 load avg: 7.18 [ 69/407] test_codecs
  77. 0:01:58 load avg: 6.85 [ 70/407] test_codeop
  78. 0:01:58 load avg: 6.85 [ 71/407] test_collections
  79. 0:01:59 load avg: 6.85 [ 72/407] test_colorsys
  80. 0:01:59 load avg: 6.85 [ 73/407] test_compare
  81. 0:01:59 load avg: 6.85 [ 74/407] test_compile
  82. 0:01:59 load avg: 6.85 [ 75/407] test_compileall
  83. 0:02:03 load avg: 6.85 [ 76/407] test_complex
  84. 0:02:03 load avg: 6.62 [ 77/407] test_concurrent_futures
  85. 0:03:07 load avg: 3.98 [ 78/407] test_configparser -- test_concurrent_futures passed in 1 min 4 sec
  86. 0:03:08 load avg: 3.98 [ 79/407] test_contains
  87. 0:03:08 load avg: 3.98 [ 80/407] test_contextlib
  88. 0:03:08 load avg: 3.98 [ 81/407] test_copy
  89. 0:03:08 load avg: 3.98 [ 82/407] test_copyreg
  90. 0:03:08 load avg: 3.98 [ 83/407] test_coroutines
  91. 0:03:09 load avg: 3.90 [ 84/407] test_cprofile
  92. 0:03:09 load avg: 3.90 [ 85/407] test_crashers
  93. 0:03:09 load avg: 3.90 [ 86/407] test_crypt
  94. 0:03:09 load avg: 3.90 [ 87/407] test_csv
  95. 0:03:10 load avg: 3.90 [ 88/407] test_ctypes
  96. 0:03:11 load avg: 3.90 [ 89/407] test_curses
  97. test_curses skipped -- Use of the 'curses' resource not enabled
  98. 0:03:11 load avg: 3.90 [ 90/407] test_datetime -- test_curses skipped (resource denied)
  99. 0:03:16 load avg: 3.98 [ 91/407] test_dbm
  100. 0:03:16 load avg: 3.98 [ 92/407] test_dbm_dumb
  101. 0:03:16 load avg: 3.98 [ 93/407] test_dbm_gnu
  102. test_dbm_gnu skipped -- No module named '_gdbm'
  103. 0:03:16 load avg: 3.98 [ 94/407] test_dbm_ndbm -- test_dbm_gnu skipped
  104. 0:03:16 load avg: 3.98 [ 95/407] test_decimal
  105. 0:03:21 load avg: 4.07 [ 96/407] test_decorators
  106. 0:03:21 load avg: 4.07 [ 97/407] test_defaultdict
  107. 0:03:21 load avg: 4.07 [ 98/407] test_deque
  108. 0:03:24 load avg: 4.06 [ 99/407] test_descr
  109. 0:03:26 load avg: 4.06 [100/407] test_descrtut
  110. 0:03:26 load avg: 4.06 [101/407] test_devpoll
  111. test_devpoll skipped -- test works only on Solaris OS family
  112. 0:03:26 load avg: 4.06 [102/407] test_dict_version -- test_devpoll skipped
  113. 0:03:26 load avg: 4.06 [103/407] test_dictcomps
  114. 0:03:26 load avg: 4.06 [104/407] test_dictviews
  115. 0:03:26 load avg: 4.06 [105/407] test_difflib
  116. 0:03:27 load avg: 4.06 [106/407] test_dis
  117. 0:03:27 load avg: 4.06 [107/407] test_distutils
  118. 0:03:30 load avg: 3.90 [108/407] test_docxmlrpc
  119. 0:03:32 load avg: 3.90 [109/407] test_dtrace
  120. 0:03:32 load avg: 3.90 [110/407] test_dummy_thread -- test_dtrace run no tests
  121. 0:03:32 load avg: 3.90 [111/407] test_dummy_threading
  122. 0:03:32 load avg: 3.90 [112/407] test_dynamic
  123. 0:03:33 load avg: 3.90 [113/407] test_dynamicclassattribute
  124. 0:03:33 load avg: 3.90 [114/407] test_eintr
  125. 0:03:39 load avg: 3.82 [115/407] test_email
  126. 0:03:46 load avg: 4.02 [116/407] test_ensurepip
  127. 0:03:46 load avg: 4.02 [117/407] test_enum
  128. 0:03:46 load avg: 4.02 [118/407] test_enumerate
  129. 0:03:47 load avg: 4.02 [119/407] test_eof
  130. 0:03:47 load avg: 4.02 [120/407] test_epoll
  131. test_epoll skipped -- test works only on Linux 2.6
  132. 0:03:47 load avg: 4.02 [121/407] test_errno -- test_epoll skipped
  133. 0:03:47 load avg: 4.02 [122/407] test_exception_hierarchy
  134. 0:03:47 load avg: 4.02 [123/407] test_exception_variations
  135. 0:03:48 load avg: 4.02 [124/407] test_extcall
  136. 0:03:48 load avg: 4.02 [125/407] test_faulthandler
  137. 0:04:08 load avg: 3.98 [126/407] test_fcntl
  138. 0:04:08 load avg: 3.98 [127/407] test_file
  139. 0:04:09 load avg: 3.98 [128/407] test_file_eintr
  140. 0:04:11 load avg: 4.30 [129/407] test_filecmp
  141. 0:04:11 load avg: 4.30 [130/407] test_fileinput
  142. 0:04:11 load avg: 4.30 [131/407] test_fileio
  143. 0:04:12 load avg: 4.30 [132/407] test_finalization
  144. 0:04:15 load avg: 4.83 [133/407] test_float
  145. 0:04:15 load avg: 4.83 [134/407] test_flufl
  146. 0:04:16 load avg: 4.83 [135/407] test_fnmatch
  147. 0:04:16 load avg: 4.83 [136/407] test_fork1
  148. 0:04:22 load avg: 4.85 [137/407] test_format
  149. 0:04:22 load avg: 4.85 [138/407] test_fractions
  150. 0:04:22 load avg: 4.85 [139/407] test_frame
  151. 0:04:23 load avg: 4.85 [140/407] test_fstring
  152. 0:04:24 load avg: 4.85 [141/407] test_ftplib
  153. 0:04:27 load avg: 4.86 [142/407] test_funcattrs
  154. 0:04:27 load avg: 4.86 [143/407] test_functools
  155. 0:04:27 load avg: 4.86 [144/407] test_future
  156. 0:04:28 load avg: 4.86 [145/407] test_future3
  157. 0:04:28 load avg: 4.86 [146/407] test_future4
  158. 0:04:28 load avg: 4.86 [147/407] test_future5 -- test_future4 run no tests
  159. 0:04:28 load avg: 4.86 [148/407] test_gc
  160. 0:04:34 load avg: 4.95 [149/407] test_gdb
  161. test_gdb skipped -- Couldn't find gdb on the path
  162. 0:04:34 load avg: 5.27 [150/407] test_generator_stop -- test_gdb skipped
  163. 0:04:35 load avg: 5.27 [151/407] test_generators
  164. 0:04:36 load avg: 5.27 [152/407] test_genericpath
  165. 0:04:36 load avg: 5.27 [153/407] test_genexps
  166. 0:04:36 load avg: 5.27 [154/407] test_getargs2
  167. 0:04:37 load avg: 5.27 [155/407] test_getopt
  168. 0:04:37 load avg: 5.27 [156/407] test_getpass
  169. 0:04:37 load avg: 5.27 [157/407] test_gettext
  170. 0:04:38 load avg: 5.27 [158/407] test_glob
  171. 0:04:38 load avg: 5.27 [159/407] test_global
  172. 0:04:39 load avg: 5.27 [160/407] test_grp
  173. 0:04:39 load avg: 5.27 [161/407] test_gzip
  174. 0:04:40 load avg: 5.65 [162/407] test_hash
  175. 0:04:42 load avg: 5.65 [163/407] test_hashlib
  176. 0:04:52 load avg: 6.18 [164/407] test_heapq
  177. 0:04:54 load avg: 6.18 [165/407] test_hmac
  178. 0:04:54 load avg: 10.97 [166/407] test_html
  179. 0:04:55 load avg: 10.97 [167/407] test_htmlparser
  180. 0:04:55 load avg: 10.97 [168/407] test_http_cookiejar
  181. 0:04:56 load avg: 10.97 [169/407] test_http_cookies
  182. 0:04:57 load avg: 10.97 [170/407] test_httplib
  183. ----------------------------------------
  184. Exception happened during processing of request from ('127.0.0.1', 57358)
  185. Traceback (most recent call last):
  186. File "/Users/<username>/.pyenv/versions/3.6.9/lib/python3.6/socketserver.py", line 320, in _handle_request_noblock
  187. self.process_request(request, client_address)
  188. File "/Users/<username>/.pyenv/versions/3.6.9/lib/python3.6/socketserver.py", line 351, in process_request
  189. self.finish_request(request, client_address)
  190. File "/Users/<username>/.pyenv/versions/3.6.9/lib/python3.6/socketserver.py", line 364, in finish_request
  191. self.RequestHandlerClass(request, client_address, self)
  192. File "/Users/<username>/.pyenv/versions/3.6.9/lib/python3.6/socketserver.py", line 724, in __init__
  193. self.handle()
  194. File "/Users/<username>/.pyenv/versions/3.6.9/lib/python3.6/http/server.py", line 418, in handle
  195. self.handle_one_request()
  196. File "/Users/<username>/.pyenv/versions/3.6.9/lib/python3.6/http/server.py", line 386, in handle_one_request
  197. self.raw_requestline = self.rfile.readline(65537)
  198. File "/Users/<username>/.pyenv/versions/3.6.9/lib/python3.6/socket.py", line 586, in readinto
  199. return self._sock.recv_into(b)
  200. File "/Users/<username>/.pyenv/versions/3.6.9/lib/python3.6/ssl.py", line 1012, in recv_into
  201. return self.read(nbytes, buffer)
  202. File "/Users/<username>/.pyenv/versions/3.6.9/lib/python3.6/ssl.py", line 874, in read
  203. return self._sslobj.read(len, buffer)
  204. File "/Users/<username>/.pyenv/versions/3.6.9/lib/python3.6/ssl.py", line 631, in read
  205. v = self._sslobj.read(len, buffer)
  206. ConnectionResetError: [Errno 54] Connection reset by peer
  207. ----------------------------------------
  208. ----------------------------------------
  209. Exception happened during processing of request from ('127.0.0.1', 57360)
  210. Traceback (most recent call last):
  211. File "/Users/<username>/.pyenv/versions/3.6.9/lib/python3.6/socketserver.py", line 320, in _handle_request_noblock
  212. self.process_request(request, client_address)
  213. File "/Users/<username>/.pyenv/versions/3.6.9/lib/python3.6/socketserver.py", line 351, in process_request
  214. self.finish_request(request, client_address)
  215. File "/Users/<username>/.pyenv/versions/3.6.9/lib/python3.6/socketserver.py", line 364, in finish_request
  216. self.RequestHandlerClass(request, client_address, self)
  217. File "/Users/<username>/.pyenv/versions/3.6.9/lib/python3.6/socketserver.py", line 724, in __init__
  218. self.handle()
  219. File "/Users/<username>/.pyenv/versions/3.6.9/lib/python3.6/http/server.py", line 418, in handle
  220. self.handle_one_request()
  221. File "/Users/<username>/.pyenv/versions/3.6.9/lib/python3.6/http/server.py", line 386, in handle_one_request
  222. self.raw_requestline = self.rfile.readline(65537)
  223. File "/Users/<username>/.pyenv/versions/3.6.9/lib/python3.6/socket.py", line 586, in readinto
  224. return self._sock.recv_into(b)
  225. File "/Users/<username>/.pyenv/versions/3.6.9/lib/python3.6/ssl.py", line 1012, in recv_into
  226. return self.read(nbytes, buffer)
  227. File "/Users/<username>/.pyenv/versions/3.6.9/lib/python3.6/ssl.py", line 874, in read
  228. return self._sslobj.read(len, buffer)
  229. File "/Users/<username>/.pyenv/versions/3.6.9/lib/python3.6/ssl.py", line 631, in read
  230. v = self._sslobj.read(len, buffer)
  231. ConnectionResetError: [Errno 54] Connection reset by peer
  232. ----------------------------------------
  233. 0:04:58 load avg: 10.97 [171/407] test_httpservers
  234. 0:05:03 load avg: 12.57 [172/407] test_idle
  235. test_idle skipped -- No module named '_tkinter'
  236. 0:05:03 load avg: 12.57 [173/407] test_imaplib -- test_idle skipped
  237. ----------------------------------------
  238. Exception happened during processing of request from ('127.0.0.1', 57525)
  239. Traceback (most recent call last):
  240. File "/Users/<username>/.pyenv/versions/3.6.9/lib/python3.6/socketserver.py", line 320, in _handle_request_noblock
  241. self.process_request(request, client_address)
  242. File "/Users/<username>/.pyenv/versions/3.6.9/lib/python3.6/socketserver.py", line 351, in process_request
  243. self.finish_request(request, client_address)
  244. File "/Users/<username>/.pyenv/versions/3.6.9/lib/python3.6/socketserver.py", line 364, in finish_request
  245. self.RequestHandlerClass(request, client_address, self)
  246. File "/Users/<username>/.pyenv/versions/3.6.9/lib/python3.6/socketserver.py", line 724, in __init__
  247. self.handle()
  248. File "/Users/<username>/.pyenv/versions/3.6.9/lib/python3.6/test/test_imaplib.py", line 136, in handle
  249. self._send_textline('* OK IMAP4rev1')
  250. File "/Users/<username>/.pyenv/versions/3.6.9/lib/python3.6/test/test_imaplib.py", line 129, in _send_textline
  251. self._send_line(message.encode('ASCII'))
  252. File "/Users/<username>/.pyenv/versions/3.6.9/lib/python3.6/test/test_imaplib.py", line 126, in _send_line
  253. self._send(message + b'\r\n')
  254. File "/Users/<username>/.pyenv/versions/3.6.9/lib/python3.6/test/test_imaplib.py", line 123, in _send
  255. self.wfile.write(message)
  256. File "/Users/<username>/.pyenv/versions/3.6.9/lib/python3.6/socketserver.py", line 803, in write
  257. self._sock.sendall(b)
  258. File "/Users/<username>/.pyenv/versions/3.6.9/lib/python3.6/ssl.py", line 975, in sendall
  259. v = self.send(byte_view[count:])
  260. File "/Users/<username>/.pyenv/versions/3.6.9/lib/python3.6/ssl.py", line 944, in send
  261. return self._sslobj.write(data)
  262. File "/Users/<username>/.pyenv/versions/3.6.9/lib/python3.6/ssl.py", line 642, in write
  263. return self._sslobj.write(data)
  264. BrokenPipeError: [Errno 32] Broken pipe
  265. ----------------------------------------
  266. Exception in thread <class 'test.test_imaplib.SecureTCPServer'> serving:
  267. Traceback (most recent call last):
  268. File "/Users/<username>/.pyenv/versions/3.6.9/lib/python3.6/threading.py", line 916, in _bootstrap_inner
  269. self.run()
  270. File "/Users/<username>/.pyenv/versions/3.6.9/lib/python3.6/threading.py", line 864, in run
  271. self._target(*self._args, **self._kwargs)
  272. File "/Users/<username>/.pyenv/versions/3.6.9/lib/python3.6/socketserver.py", line 241, in serve_forever
  273. self._handle_request_noblock()
  274. File "/Users/<username>/.pyenv/versions/3.6.9/lib/python3.6/socketserver.py", line 322, in _handle_request_noblock
  275. self.handle_error(request, client_address)
  276. File "/Users/<username>/.pyenv/versions/3.6.9/lib/python3.6/socketserver.py", line 320, in _handle_request_noblock
  277. self.process_request(request, client_address)
  278. File "/Users/<username>/.pyenv/versions/3.6.9/lib/python3.6/socketserver.py", line 351, in process_request
  279. self.finish_request(request, client_address)
  280. File "/Users/<username>/.pyenv/versions/3.6.9/lib/python3.6/socketserver.py", line 364, in finish_request
  281. self.RequestHandlerClass(request, client_address, self)
  282. File "/Users/<username>/.pyenv/versions/3.6.9/lib/python3.6/socketserver.py", line 724, in __init__
  283. self.handle()
  284. File "/Users/<username>/.pyenv/versions/3.6.9/lib/python3.6/test/test_imaplib.py", line 136, in handle
  285. self._send_textline('* OK IMAP4rev1')
  286. File "/Users/<username>/.pyenv/versions/3.6.9/lib/python3.6/test/test_imaplib.py", line 129, in _send_textline
  287. self._send_line(message.encode('ASCII'))
  288. File "/Users/<username>/.pyenv/versions/3.6.9/lib/python3.6/test/test_imaplib.py", line 126, in _send_line
  289. self._send(message + b'\r\n')
  290. File "/Users/<username>/.pyenv/versions/3.6.9/lib/python3.6/test/test_imaplib.py", line 123, in _send
  291. self.wfile.write(message)
  292. File "/Users/<username>/.pyenv/versions/3.6.9/lib/python3.6/socketserver.py", line 803, in write
  293. self._sock.sendall(b)
  294. File "/Users/<username>/.pyenv/versions/3.6.9/lib/python3.6/ssl.py", line 975, in sendall
  295. v = self.send(byte_view[count:])
  296. File "/Users/<username>/.pyenv/versions/3.6.9/lib/python3.6/ssl.py", line 944, in send
  297. return self._sslobj.write(data)
  298. File "/Users/<username>/.pyenv/versions/3.6.9/lib/python3.6/ssl.py", line 642, in write
  299. return self._sslobj.write(data)
  300. BrokenPipeError: [Errno 32] Broken pipe
  301.  
  302. 0:05:07 load avg: 12.37 [174/407] test_imghdr
  303. 0:05:07 load avg: 12.37 [175/407] test_imp
  304. 0:05:08 load avg: 12.37 [176/407] test_import
  305. 0:05:09 load avg: 12.37 [177/407] test_importlib
  306. 0:05:13 load avg: 12.02 [178/407] test_index
  307. 0:05:14 load avg: 12.02 [179/407] test_inspect
  308. 0:05:15 load avg: 12.18 [180/407] test_int
  309. 0:05:15 load avg: 12.18 [181/407] test_int_literal
  310. 0:05:16 load avg: 12.18 [182/407] test_io
  311. python(83388,0x1149e5dc0) malloc: can't allocate region
  312. *** mach_vm_map(size=9223372036854775808) failed (error code=3)
  313. python(83388,0x1149e5dc0) malloc: *** set a breakpoint in malloc_error_break to debug
  314. python(83388,0x1149e5dc0) malloc: can't allocate region
  315. *** mach_vm_map(size=9223372036854775808) failed (error code=3)
  316. python(83388,0x1149e5dc0) malloc: *** set a breakpoint in malloc_error_break to debug
  317. python(83388,0x1149e5dc0) malloc: can't allocate region
  318. *** mach_vm_map(size=9223372036854775808) failed (error code=3)
  319. python(83388,0x1149e5dc0) malloc: *** set a breakpoint in malloc_error_break to debug
  320. 0:06:09 load avg: 9.01 [183/407] test_ioctl -- test_io passed in 53 sec 447 ms
  321. 0:06:09 load avg: 9.01 [184/407] test_ipaddress
  322. 0:06:10 load avg: 8.77 [185/407] test_isinstance
  323. 0:06:10 load avg: 8.77 [186/407] test_iter
  324. 0:06:11 load avg: 8.77 [187/407] test_iterlen
  325. 0:06:12 load avg: 8.77 [188/407] test_itertools
  326. 0:06:23 load avg: 7.89 [189/407] test_json
  327. 0:06:26 load avg: 8.06 [190/407] test_keyword
  328. 0:06:27 load avg: 8.06 [191/407] test_keywordonlyarg
  329. 0:06:27 load avg: 8.06 [192/407] test_kqueue
  330. 0:06:27 load avg: 8.06 [193/407] test_largefile
  331. 0:06:27 load avg: 8.06 [194/407] test_lib2to3 -- test_largefile run no tests
  332. 0:06:44 load avg: 7.63 [195/407] test_linecache
  333. 0:06:44 load avg: 7.63 [196/407] test_list
  334. 0:06:45 load avg: 7.90 [197/407] test_listcomps
  335. 0:06:46 load avg: 7.90 [198/407] test_locale
  336. 0:06:46 load avg: 7.90 [199/407] test_logging
  337. 0:07:06 load avg: 7.42 [200/407] test_long
  338. 0:07:08 load avg: 7.42 [201/407] test_longexp
  339. 0:07:09 load avg: 7.42 [202/407] test_lzma
  340. 0:07:13 load avg: 7.06 [203/407] test_macpath
  341. 0:07:14 load avg: 7.06 [204/407] test_macurl2path
  342. 0:07:14 load avg: 7.06 [205/407] test_mailbox
  343. 0:07:16 load avg: 6.74 [206/407] test_mailcap
  344. 0:07:16 load avg: 6.74 [207/407] test_marshal
  345. 0:07:17 load avg: 6.74 [208/407] test_math
  346. 0:07:18 load avg: 6.74 [209/407] test_memoryio
  347. 0:07:19 load avg: 6.74 [210/407] test_memoryview
  348. 0:07:21 load avg: 6.52 [211/407] test_metaclass
  349. 0:07:21 load avg: 6.52 [212/407] test_mimetypes
  350. 0:07:21 load avg: 6.52 [213/407] test_minidom
  351. 0:07:21 load avg: 6.52 [214/407] test_mmap
  352. 0:07:23 load avg: 6.52 [215/407] test_module
  353. 0:07:24 load avg: 6.52 [216/407] test_modulefinder
  354. 0:07:24 load avg: 6.52 [217/407] test_msilib
  355. test_msilib skipped -- No module named 'msilib'
  356. 0:07:25 load avg: 6.24 [218/407] test_multibytecodec -- test_msilib skipped
  357. 0:07:26 load avg: 6.24 [219/407] test_multiprocessing_fork
  358. test_multiprocessing_fork skipped -- test may crash on macOS (bpo-33725)
  359. 0:07:26 load avg: 6.24 [220/407] test_multiprocessing_forkserver -- test_multiprocessing_fork skipped
  360. 0:08:39 load avg: 4.96 [221/407] test_multiprocessing_main_handling -- test_multiprocessing_forkserver passed in 1 min 13 sec
  361. 0:08:51 load avg: 5.66 [222/407] test_multiprocessing_spawn
  362. 0:10:25 load avg: 3.77 [223/407] test_netrc -- test_multiprocessing_spawn passed in 1 min 33 sec
  363. 0:10:25 load avg: 3.77 [224/407] test_nis
  364. 0:10:25 load avg: 3.77 [225/407] test_nntplib
  365. 0:10:26 load avg: 3.77 [226/407] test_normalization
  366. 0:10:26 load avg: 3.77 [227/407] test_ntpath
  367. 0:10:26 load avg: 3.77 [228/407] test_numeric_tower
  368. 0:10:26 load avg: 3.55 [229/407] test_openpty
  369. 0:10:27 load avg: 3.55 [230/407] test_operator
  370. 0:10:27 load avg: 3.55 [231/407] test_optparse
  371. 0:10:27 load avg: 3.55 [232/407] test_ordered_dict
  372. 0:10:30 load avg: 3.55 [233/407] test_os
  373. 0:10:33 load avg: 3.50 [234/407] test_ossaudiodev
  374. test_ossaudiodev skipped -- Use of the 'audio' resource not enabled
  375. 0:10:33 load avg: 3.50 [235/407] test_osx_env -- test_ossaudiodev skipped (resource denied)
  376. 0:10:34 load avg: 3.50 [236/407] test_parser
  377. 0:10:34 load avg: 3.50 [237/407] test_pathlib
  378. 0:10:35 load avg: 3.50 [238/407] test_pdb
  379. 0:10:35 load avg: 3.50 [239/407] test_peepholer
  380. 0:10:36 load avg: 3.50 [240/407] test_pickle
  381. 0:10:41 load avg: 3.46 [241/407] test_pickletools
  382. 0:10:42 load avg: 3.27 [242/407] test_pipes
  383. 0:10:42 load avg: 3.27 [243/407] test_pkg
  384. 0:10:42 load avg: 3.27 [244/407] test_pkgimport
  385. 0:10:42 load avg: 3.27 [245/407] test_pkgutil
  386. 0:10:43 load avg: 3.27 [246/407] test_platform
  387. 0:10:43 load avg: 3.27 [247/407] test_plistlib
  388. 0:10:43 load avg: 3.27 [248/407] test_poll
  389. 0:10:55 load avg: 3.15 [249/407] test_popen
  390. 0:10:55 load avg: 3.15 [250/407] test_poplib
  391. 0:10:58 load avg: 3.14 [251/407] test_posix
  392. 0:10:59 load avg: 3.14 [252/407] test_posixpath
  393. 0:10:59 load avg: 3.14 [253/407] test_pow
  394. 0:10:59 load avg: 3.14 [254/407] test_pprint
  395. 0:11:00 load avg: 3.14 [255/407] test_print
  396. 0:11:00 load avg: 3.14 [256/407] test_profile
  397. 0:11:00 load avg: 3.14 [257/407] test_property
  398. 0:11:01 load avg: 3.14 [258/407] test_pstats
  399. 0:11:01 load avg: 3.14 [259/407] test_pty
  400. 0:11:01 load avg: 3.14 [260/407] test_pulldom
  401. 0:11:02 load avg: 3.14 [261/407] test_pwd
  402. 0:11:02 load avg: 3.69 [262/407] test_py_compile
  403. test test_py_compile failed -- Traceback (most recent call last):
  404. File "/Users/<username>/.pyenv/versions/3.6.9/lib/python3.6/test/test_py_compile.py", line 74, in test_relative_path
  405. os.path.relpath(self.pyc_path))
  406. File "/Users/<username>/.pyenv/versions/3.6.9/lib/python3.6/py_compile.py", line 136, in compile
  407. os.makedirs(dirname)
  408. File "/Users/<username>/.pyenv/versions/3.6.9/lib/python3.6/os.py", line 220, in makedirs
  409. mkdir(name, mode)
  410. FileNotFoundError: [Errno 2] No such file or directory: '../../../../../../../var/folders/_v/9r245bv51z77v4_khb_j55y40000gn/T/tmp3vupq4va'
  411.  
  412. 0:11:03 load avg: 3.69 [263/407/1] test_pyclbr -- test_py_compile failed
  413. 0:11:05 load avg: 3.69 [264/407/1] test_pydoc
  414. 0:11:09 load avg: 3.47 [265/407/1] test_pyexpat
  415. 0:11:09 load avg: 3.47 [266/407/1] test_queue
  416. 0:11:13 load avg: 3.35 [267/407/1] test_quopri
  417. 0:11:13 load avg: 3.35 [268/407/1] test_raise
  418. 0:11:13 load avg: 3.35 [269/407/1] test_random
  419. 0:11:14 load avg: 3.35 [270/407/1] test_range
  420. 0:11:15 load avg: 3.35 [271/407/1] test_re
  421. 0:11:16 load avg: 3.35 [272/407/1] test_readline
  422. 0:11:17 load avg: 3.35 [273/407/1] test_regrtest
  423. 0:11:25 load avg: 3.31 [274/407/1] test_repl
  424. 0:11:26 load avg: 3.31 [275/407/1] test_reprlib
  425. 0:11:26 load avg: 3.31 [276/407/1] test_resource
  426. 0:11:26 load avg: 3.31 [277/407/1] test_richcmp
  427. 0:11:26 load avg: 3.31 [278/407/1] test_rlcompleter
  428. 0:11:27 load avg: 3.31 [279/407/1] test_robotparser
  429. 0:11:27 load avg: 3.31 [280/407/1] test_runpy
  430. 0:11:28 load avg: 3.92 [281/407/1] test_sax
  431. 0:11:29 load avg: 3.92 [282/407/1] test_sched
  432. 0:11:29 load avg: 3.92 [283/407/1] test_scope
  433. 0:11:30 load avg: 3.92 [284/407/1] test_script_helper
  434. 0:11:30 load avg: 3.92 [285/407/1] test_secrets
  435. 0:11:30 load avg: 3.92 [286/407/1] test_select
  436. 0:11:42 load avg: 3.62 [287/407/1] test_selectors
  437. 0:11:56 load avg: 3.12 [288/407/1] test_set
  438. 0:11:58 load avg: 3.43 [289/407/1] test_setcomps
  439. 0:11:58 load avg: 3.43 [290/407/1] test_shelve
  440. 0:11:59 load avg: 3.43 [291/407/1] test_shlex
  441. 0:11:59 load avg: 3.43 [292/407/1] test_shutil
  442. 0:12:00 load avg: 3.43 [293/407/1] test_signal
  443. 0:12:19 load avg: 3.31 [294/407/1] test_site
  444. 0:12:20 load avg: 3.31 [295/407/1] test_slice
  445. 0:12:20 load avg: 3.31 [296/407/1] test_smtpd
  446. 0:12:20 load avg: 3.31 [297/407/1] test_smtplib
  447. 0:12:21 load avg: 3.31 [298/407/1] test_smtpnet
  448. test_smtpnet skipped -- Use of the 'network' resource not enabled
  449. 0:12:22 load avg: 3.31 [299/407/1] test_sndhdr -- test_smtpnet skipped (resource denied)
  450. 0:12:22 load avg: 3.31 [300/407/1] test_socket
  451. /Users/<username>/.pyenv/versions/3.6.9/lib/python3.6/test/test_socket.py:1990: RuntimeWarning: received malformed or improperly-truncated ancillary data
  452. result = sock.recvmsg(bufsize, *args)
  453. /Users/<username>/.pyenv/versions/3.6.9/lib/python3.6/test/test_socket.py:2081: RuntimeWarning: received malformed or improperly-truncated ancillary data
  454. result = sock.recvmsg_into([buf], *args)
  455. 0:12:46 load avg: 3.25 [301/407/1] test_socketserver
  456. test_socketserver skipped -- Use of the 'network' resource not enabled
  457. 0:12:47 load avg: 3.25 [302/407/1] test_sort -- test_socketserver skipped (resource denied)
  458. 0:12:47 load avg: 3.25 [303/407/1] test_source_encoding
  459. 0:12:48 load avg: 3.25 [304/407/1] test_spwd
  460. test_spwd skipped -- No module named 'spwd'
  461. 0:12:48 load avg: 3.31 [305/407/1] test_sqlite -- test_spwd skipped
  462. 0:12:49 load avg: 3.31 [306/407/1] test_ssl
  463. 0:13:18 load avg: 2.89 [307/407/1] test_startfile
  464. test_startfile skipped -- object <module 'os' from '/Users/<username>/.pyenv/versions/3.6.9/lib/python3.6/os.py'> has no attribute 'startfile'
  465. 0:13:18 load avg: 2.89 [308/407/1] test_stat -- test_startfile skipped
  466. 0:13:18 load avg: 3.54 [309/407/1] test_statistics
  467. 0:13:19 load avg: 3.54 [310/407/1] test_strftime
  468. 0:13:20 load avg: 3.54 [311/407/1] test_string
  469. 0:13:20 load avg: 3.54 [312/407/1] test_string_literals
  470. 0:13:20 load avg: 3.54 [313/407/1] test_stringprep
  471. 0:13:20 load avg: 3.54 [314/407/1] test_strptime
  472. 0:13:21 load avg: 3.54 [315/407/1] test_strtod
  473. 0:13:22 load avg: 3.54 [316/407/1] test_struct
  474. 0:13:23 load avg: 4.78 [317/407/1] test_structmembers
  475. 0:13:23 load avg: 4.78 [318/407/1] test_structseq
  476. 0:13:24 load avg: 4.78 [319/407/1] test_subclassinit
  477. 0:13:24 load avg: 4.78 [320/407/1] test_subprocess
  478. 0:14:07 load avg: 4.12 [321/407/1] test_sunau -- test_subprocess passed in 42 sec 306 ms
  479. 0:14:07 load avg: 4.12 [322/407/1] test_sundry
  480. 0:14:07 load avg: 4.12 [323/407/1] test_super
  481. 0:14:07 load avg: 4.12 [324/407/1] test_symbol
  482. 0:14:08 load avg: 4.12 [325/407/1] test_symtable
  483. 0:14:08 load avg: 4.12 [326/407/1] test_syntax
  484. 0:14:08 load avg: 4.12 [327/407/1] test_sys
  485. 0:14:10 load avg: 3.95 [328/407/1] test_sys_setprofile
  486. 0:14:10 load avg: 3.95 [329/407/1] test_sys_settrace
  487. 0:14:10 load avg: 3.95 [330/407/1] test_sysconfig
  488. 0:14:11 load avg: 3.95 [331/407/1] test_syslog
  489. 0:14:11 load avg: 3.95 [332/407/1] test_tarfile
  490. 0:14:19 load avg: 3.88 [333/407/1] test_tcl
  491. test_tcl skipped -- No module named '_tkinter'
  492. 0:14:20 load avg: 3.88 [334/407/1] test_telnetlib -- test_tcl skipped
  493. 0:14:20 load avg: 3.88 [335/407/1] test_tempfile
  494. 0:14:21 load avg: 3.88 [336/407/1] test_textwrap
  495. 0:14:21 load avg: 3.88 [337/407/1] test_thread
  496. 0:14:22 load avg: 3.88 [338/407/1] test_threaded_import
  497. 0:14:24 load avg: 3.88 [339/407/1] test_threadedtempfile
  498. 0:14:24 load avg: 3.89 [340/407/1] test_threading
  499. 0:14:35 load avg: 3.53 [341/407/1] test_threading_local
  500. 0:14:36 load avg: 3.53 [342/407/1] test_threadsignals
  501. 0:14:39 load avg: 3.48 [343/407/1] test_time
  502. 0:14:41 load avg: 3.48 [344/407/1] test_timeit
  503. 0:14:41 load avg: 3.48 [345/407/1] test_timeout
  504. test_timeout skipped -- Use of the 'network' resource not enabled
  505. 0:14:41 load avg: 3.48 [346/407/1] test_tix -- test_timeout skipped (resource denied)
  506. test_tix skipped -- No module named '_tkinter'
  507. 0:14:42 load avg: 3.48 [347/407/1] test_tk -- test_tix skipped
  508. test_tk skipped -- No module named '_tkinter'
  509. 0:14:42 load avg: 3.48 [348/407/1] test_tokenize -- test_tk skipped
  510. 0:14:43 load avg: 3.48 [349/407/1] test_tools
  511. 0:14:43 load avg: 3.48 [350/407/1] test_trace
  512. 0:14:48 load avg: 3.36 [351/407/1] test_traceback
  513. 0:14:49 load avg: 3.36 [352/407/1] test_tracemalloc
  514. 0:14:50 load avg: 3.25 [353/407/1] test_ttk_guionly
  515. test_ttk_guionly skipped -- No module named '_tkinter'
  516. 0:14:51 load avg: 3.25 [354/407/1] test_ttk_textonly -- test_ttk_guionly skipped
  517. test_ttk_textonly skipped -- No module named '_tkinter'
  518. 0:14:51 load avg: 3.25 [355/407/1] test_tuple -- test_ttk_textonly skipped
  519. 0:15:00 load avg: 3.45 [356/407/1] test_turtle
  520. test_turtle skipped -- No module named '_tkinter'
  521. 0:15:01 load avg: 3.45 [357/407/1] test_typechecks -- test_turtle skipped
  522. 0:15:01 load avg: 3.45 [358/407/1] test_typing
  523. 0:15:01 load avg: 3.45 [359/407/1] test_ucn
  524. 0:15:02 load avg: 3.45 [360/407/1] test_unary
  525. 0:15:02 load avg: 3.45 [361/407/1] test_unicode
  526. 0:15:04 load avg: 3.49 [362/407/1] test_unicode_file
  527. 0:15:04 load avg: 3.49 [363/407/1] test_unicode_file_functions
  528. 0:15:05 load avg: 3.49 [364/407/1] test_unicode_identifiers
  529. 0:15:05 load avg: 3.49 [365/407/1] test_unicodedata
  530. 0:15:08 load avg: 3.49 [366/407/1] test_univnewlines
  531. 0:15:08 load avg: 3.49 [367/407/1] test_unpack
  532. 0:15:09 load avg: 3.49 [368/407/1] test_unpack_ex
  533. 0:15:09 load avg: 3.49 [369/407/1] test_urllib
  534. 0:15:10 load avg: 3.37 [370/407/1] test_urllib2
  535. 0:15:10 load avg: 3.37 [371/407/1] test_urllib2_localnet
  536. ----------------------------------------
  537. Exception happened during processing of request from ('127.0.0.1', 61933)
  538. Traceback (most recent call last):
  539. File "/Users/<username>/.pyenv/versions/3.6.9/lib/python3.6/socketserver.py", line 320, in _handle_request_noblock
  540. self.process_request(request, client_address)
  541. File "/Users/<username>/.pyenv/versions/3.6.9/lib/python3.6/socketserver.py", line 351, in process_request
  542. self.finish_request(request, client_address)
  543. File "/Users/<username>/.pyenv/versions/3.6.9/lib/python3.6/socketserver.py", line 364, in finish_request
  544. self.RequestHandlerClass(request, client_address, self)
  545. File "/Users/<username>/.pyenv/versions/3.6.9/lib/python3.6/socketserver.py", line 724, in __init__
  546. self.handle()
  547. File "/Users/<username>/.pyenv/versions/3.6.9/lib/python3.6/http/server.py", line 418, in handle
  548. self.handle_one_request()
  549. File "/Users/<username>/.pyenv/versions/3.6.9/lib/python3.6/http/server.py", line 386, in handle_one_request
  550. self.raw_requestline = self.rfile.readline(65537)
  551. File "/Users/<username>/.pyenv/versions/3.6.9/lib/python3.6/socket.py", line 586, in readinto
  552. return self._sock.recv_into(b)
  553. File "/Users/<username>/.pyenv/versions/3.6.9/lib/python3.6/ssl.py", line 1012, in recv_into
  554. return self.read(nbytes, buffer)
  555. File "/Users/<username>/.pyenv/versions/3.6.9/lib/python3.6/ssl.py", line 874, in read
  556. return self._sslobj.read(len, buffer)
  557. File "/Users/<username>/.pyenv/versions/3.6.9/lib/python3.6/ssl.py", line 631, in read
  558. v = self._sslobj.read(len, buffer)
  559. ConnectionResetError: [Errno 54] Connection reset by peer
  560. ----------------------------------------
  561. 0:15:12 load avg: 3.37 [372/407/1] test_urllib2net
  562. test_urllib2net skipped -- Use of the 'network' resource not enabled
  563. 0:15:12 load avg: 3.37 [373/407/1] test_urllib_response -- test_urllib2net skipped (resource denied)
  564. 0:15:13 load avg: 3.37 [374/407/1] test_urllibnet
  565. test_urllibnet skipped -- Use of the 'network' resource not enabled
  566. 0:15:13 load avg: 3.37 [375/407/1] test_urlparse -- test_urllibnet skipped (resource denied)
  567. 0:15:14 load avg: 3.26 [376/407/1] test_userdict
  568. 0:15:14 load avg: 3.26 [377/407/1] test_userlist
  569. 0:15:15 load avg: 3.26 [378/407/1] test_userstring
  570. 0:15:16 load avg: 3.26 [379/407/1] test_utf8source
  571. 0:15:16 load avg: 3.26 [380/407/1] test_uu
  572. 0:15:16 load avg: 3.26 [381/407/1] test_uuid
  573. 0:15:17 load avg: 3.26 [382/407/1] test_venv
  574. 0:15:29 load avg: 3.58 [383/407/1] test_wait3
  575. 0:15:35 load avg: 3.41 [384/407/1] test_wait4
  576. 0:15:41 load avg: 3.29 [385/407/1] test_warnings
  577. 0:15:42 load avg: 3.29 [386/407/1] test_wave
  578. 0:15:42 load avg: 3.29 [387/407/1] test_weakref
  579. 0:15:55 load avg: 3.47 [388/407/1] test_weakset
  580. 0:15:56 load avg: 3.47 [389/407/1] test_webbrowser
  581. 0:15:56 load avg: 3.47 [390/407/1] test_winconsoleio
  582. test_winconsoleio skipped -- test only relevant on win32
  583. 0:15:57 load avg: 3.47 [391/407/1] test_winreg -- test_winconsoleio skipped
  584. test_winreg skipped -- No module named 'winreg'
  585. 0:15:57 load avg: 3.47 [392/407/1] test_winsound -- test_winreg skipped
  586. test_winsound skipped -- Use of the 'audio' resource not enabled
  587. 0:15:58 load avg: 3.47 [393/407/1] test_with -- test_winsound skipped (resource denied)
  588. 0:15:58 load avg: 3.47 [394/407/1] test_wsgiref
  589. 0:15:59 load avg: 3.47 [395/407/1] test_xdrlib
  590. 0:15:59 load avg: 3.47 [396/407/1] test_xml_dom_minicompat
  591. 0:15:59 load avg: 3.47 [397/407/1] test_xml_etree
  592. 0:16:01 load avg: 3.75 [398/407/1] test_xml_etree_c
  593. 0:16:03 load avg: 3.75 [399/407/1] test_xmlrpc
  594. 0:16:06 load avg: 4.17 [400/407/1] test_xmlrpc_net
  595. test_xmlrpc_net skipped -- Use of the 'network' resource not enabled
  596. 0:16:07 load avg: 4.17 [401/407/1] test_yield_from -- test_xmlrpc_net skipped (resource denied)
  597. 0:16:07 load avg: 4.17 [402/407/1] test_zipapp
  598. 0:16:07 load avg: 4.17 [403/407/1] test_zipfile
  599. 0:16:18 load avg: 4.36 [404/407/1] test_zipfile64
  600. test_zipfile64 skipped -- test requires loads of disk-space bytes and a long time to run
  601. 0:16:18 load avg: 4.36 [405/407/1] test_zipimport -- test_zipfile64 skipped (resource denied)
  602. 0:16:19 load avg: 4.36 [406/407/1] test_zipimport_support
  603. 0:16:20 load avg: 4.34 [407/407/1] test_zlib
  604.  
  605. == Tests result: FAILURE ==
  606.  
  607. 375 tests OK.
  608.  
  609. 1 test failed:
  610. test_py_compile
  611.  
  612. 28 tests skipped:
  613. test_asdl_parser test_curses test_dbm_gnu test_devpoll test_epoll
  614. test_gdb test_idle test_msilib test_multiprocessing_fork
  615. test_ossaudiodev test_smtpnet test_socketserver test_spwd
  616. test_startfile test_tcl test_timeout test_tix test_tk
  617. test_ttk_guionly test_ttk_textonly test_turtle test_urllib2net
  618. test_urllibnet test_winconsoleio test_winreg test_winsound
  619. test_xmlrpc_net test_zipfile64
  620.  
  621. 3 tests run no tests:
  622. test_dtrace test_future4 test_largefile
  623.  
  624. Total duration: 16 min 21 sec
  625. Tests result: FAILURE
RAW Paste Data