Guest User

Untitled

a guest
Sep 15th, 2023
190
0
Never
Not a member of Pastebin yet? Sign Up, it unlocks many cool features!
text 4.51 KB | None | 0 0
  1. ../src/core/helper/csv-reader.cc: In member function ‘bool ns3::CsvReader::GetValueAs(std::string, signed char&) const’:
  2. ../src/core/helper/csv-reader.cc:182:26: error: ‘numeric_limits’ is not a member of ‘std’
  3. 182 | if (tempOutput >= std::numeric_limits<byte_type>::min ()
  4. | ^~~~~~~~~~~~~~
  5. ../src/core/helper/csv-reader.cc:182:50: error: expected primary-expression before ‘>’ token
  6. 182 | if (tempOutput >= std::numeric_limits<byte_type>::min ()
  7. | ^
  8. ../src/core/helper/csv-reader.cc:182:53: error: ‘::min’ has not been declared; did you mean ‘std::min’?
  9. 182 | if (tempOutput >= std::numeric_limits<byte_type>::min ()
  10. | ^~~
  11. | std::min
  12. In file included from /usr/include/c++/11/algorithm:62,
  13. from ../src/core/helper/csv-reader.cc:25:
  14. /usr/include/c++/11/bits/stl_algo.h:3455:5: note: ‘std::min’ declared here
  15. 3455 | min(initializer_list<_Tp> __l, _Compare __comp)
  16. | ^~~
  17. ../src/core/helper/csv-reader.cc:183:29: error: ‘numeric_limits’ is not a member of ‘std’
  18. 183 | || tempOutput <= std::numeric_limits<byte_type>::max () )
  19. | ^~~~~~~~~~~~~~
  20. ../src/core/helper/csv-reader.cc:183:53: error: expected primary-expression before ‘>’ token
  21. 183 | || tempOutput <= std::numeric_limits<byte_type>::max () )
  22. | ^
  23. ../src/core/helper/csv-reader.cc:183:56: error: ‘::max’ has not been declared; did you mean ‘std::max’?
  24. 183 | || tempOutput <= std::numeric_limits<byte_type>::max () )
  25. | ^~~
  26. | std::max
  27. In file included from /usr/include/c++/11/algorithm:62,
  28. from ../src/core/helper/csv-reader.cc:25:
  29. /usr/include/c++/11/bits/stl_algo.h:3467:5: note: ‘std::max’ declared here
  30. 3467 | max(initializer_list<_Tp> __l, _Compare __comp)
  31. | ^~~
  32. ../src/core/helper/csv-reader.cc: In member function ‘bool ns3::CsvReader::GetValueAs(std::string, unsigned char&) const’:
  33. ../src/core/helper/csv-reader.cc:253:26: error: ‘numeric_limits’ is not a member of ‘std’
  34. 253 | if (tempOutput >= std::numeric_limits<byte_type>::min ()
  35. | ^~~~~~~~~~~~~~
  36. ../src/core/helper/csv-reader.cc:253:50: error: expected primary-expression before ‘>’ token
  37. 253 | if (tempOutput >= std::numeric_limits<byte_type>::min ()
  38. | ^
  39. ../src/core/helper/csv-reader.cc:253:53: error: ‘::min’ has not been declared; did you mean ‘std::min’?
  40. 253 | if (tempOutput >= std::numeric_limits<byte_type>::min ()
  41. | ^~~
  42. | std::min
  43. In file included from /usr/include/c++/11/algorithm:62,
  44. from ../src/core/helper/csv-reader.cc:25:
  45. /usr/include/c++/11/bits/stl_algo.h:3455:5: note: ‘std::min’ declared here
  46. 3455 | min(initializer_list<_Tp> __l, _Compare __comp)
  47. | ^~~
  48. ../src/core/helper/csv-reader.cc:254:29: error: ‘numeric_limits’ is not a member of ‘std’
  49. 254 | || tempOutput <= std::numeric_limits<byte_type>::max () )
  50. | ^~~~~~~~~~~~~~
  51. ../src/core/helper/csv-reader.cc:254:53: error: expected primary-expression before ‘>’ token
  52. 254 | || tempOutput <= std::numeric_limits<byte_type>::max () )
  53. | ^
  54. ../src/core/helper/csv-reader.cc:254:56: error: ‘::max’ has not been declared; did you mean ‘std::max’?
  55. 254 | || tempOutput <= std::numeric_limits<byte_type>::max () )
  56. | ^~~
  57. | std::max
  58. In file included from /usr/include/c++/11/algorithm:62,
  59. from ../src/core/helper/csv-reader.cc:25:
  60. /usr/include/c++/11/bits/stl_algo.h:3467:5: note: ‘std::max’ declared here
  61. 3467 | max(initializer_list<_Tp> __l, _Compare __comp)
  62. | ^~~
  63.  
  64. Waf: Leaving directory `/home/cyber/ns-allinone-3.33/ns-3.33/build'
  65. Build failed
  66. -> task in 'ns3-core' failed with exit status 1 (run with -v to display more information)
Advertisement
Add Comment
Please, Sign In to add comment