Guest User

Untitled

a guest
Nov 19th, 2018
113
Never
Not a member of Pastebin yet? Sign Up, it unlocks many cool features!
  1. ============================================
  2. PLATFORM_VERSION_CODENAME=REL
  3. PLATFORM_VERSION=7.1.2
  4. TARGET_PRODUCT=kvim2
  5. TARGET_BUILD_VARIANT=userdebug
  6. TARGET_BUILD_TYPE=release
  7. TARGET_BUILD_APPS=
  8. TARGET_ARCH=arm64
  9. TARGET_ARCH_VARIANT=armv8-a
  10. TARGET_CPU_VARIANT=generic
  11. TARGET_2ND_ARCH=arm
  12. TARGET_2ND_ARCH_VARIANT=armv7-a-neon
  13. TARGET_2ND_CPU_VARIANT=cortex-a9
  14. HOST_ARCH=x86_64
  15. HOST_2ND_ARCH=x86
  16. HOST_OS=linux
  17. HOST_OS_EXTRA=Linux-4.4.0-105-generic-x86_64-with-Ubuntu-16.04-xenial
  18. HOST_CROSS_OS=windows
  19. HOST_CROSS_ARCH=x86
  20. HOST_CROSS_2ND_ARCH=x86_64
  21. HOST_BUILD_TYPE=release
  22. BUILD_ID=NHG47L
  23. OUT_DIR=out
  24. ============================================
  25. Running kati to generate build-kvim2.ninja...
  26. device/khadas/kvim2/preinstall/Android.mk was modified, regenerating...
  27. ============================================
  28. PLATFORM_VERSION_CODENAME=REL
  29. PLATFORM_VERSION=7.1.2
  30. TARGET_PRODUCT=kvim2
  31. TARGET_BUILD_VARIANT=userdebug
  32. TARGET_BUILD_TYPE=release
  33. TARGET_BUILD_APPS=
  34. TARGET_ARCH=arm64
  35. TARGET_ARCH_VARIANT=armv8-a
  36. TARGET_CPU_VARIANT=generic
  37. TARGET_2ND_ARCH=arm
  38. TARGET_2ND_ARCH_VARIANT=armv7-a-neon
  39. TARGET_2ND_CPU_VARIANT=cortex-a9
  40. HOST_ARCH=x86_64
  41. HOST_2ND_ARCH=x86
  42. HOST_OS=linux
  43. HOST_OS_EXTRA=Linux-4.4.0-105-generic-x86_64-with-Ubuntu-16.04-xenial
  44. HOST_CROSS_OS=windows
  45. HOST_CROSS_ARCH=x86
  46. HOST_CROSS_2ND_ARCH=x86_64
  47. HOST_BUILD_TYPE=release
  48. BUILD_ID=NHG47L
  49. OUT_DIR=out
  50. ============================================
  51. FindEmulator: find: File system loop detected; `./uboot/build/source' is part of the same file system loop as `./uboot'.
  52. FindEmulator: find: File system loop detected; `./uboot/build/source' is part of the same file system loop as `./uboot'.
  53. including ./abi/cpp/Android.mk ...
  54. including ./art/Android.mk ...
  55. including ./bionic/Android.mk ...
  56. including ./bootable/recovery/Android.mk ...
  57. including ./build/libs/host/Android.mk ...
  58. including ./build/target/board/Android.mk ...
  59. including ./build/target/product/security/Android.mk ...
  60. including ./build/tools/Android.mk ...
  61. including ./common/tools/gator/daemon/Android.mk ...
  62. including ./cts/Android.mk ...
  63. FindEmulator: find: `cts/apps/CtsVerifier/src/android': No such file or directory
  64. FindEmulator: find: `cts/hostsidetests/os/test-apps/HostLinkVerificationApp/src': No such file or directory
  65. FindEmulator: find: `cts/libs/commonutil/src': No such file or directory
  66. FindEmulator: cd: cts/tests/libcore/ojluni/resources: No such file or directory
  67. FindEmulator: find: `cts/libs/commonutil/src': No such file or directory
  68. including ./dalvik/Android.mk ...
  69. including ./developers/samples/android/security/FingerprintDialog/Application/src/main/Android.mk ...
  70. including ./development/apps/BluetoothDebug/Android.mk ...
  71. including ./development/apps/BuildWidget/Android.mk ...
  72. including ./development/apps/CustomLocale/Android.mk ...
  73. including ./development/apps/Development/Android.mk ...
  74. including ./development/apps/DevelopmentSettings/Android.mk ...
  75. including ./development/apps/Fallback/Android.mk ...
  76. including ./development/apps/GestureBuilder/Android.mk ...
  77. including ./development/apps/NinePatchLab/Android.mk ...
  78. including ./development/apps/OBJViewer/Android.mk ...
  79. including ./development/apps/SdkSetup/Android.mk ...
  80. including ./development/apps/SettingInjectorSample/Android.mk ...
  81. including ./development/apps/WidgetPreview/Android.mk ...
  82. including ./development/apps/launchperf/Android.mk ...
  83. including ./development/build/Android.mk ...
  84. including ./development/cmds/monkey/Android.mk ...
  85. including ./development/host/windows/prebuilt/usb/Android.mk ...
  86. including ./development/ndk/Android.mk ...
  87. including ./development/perftests/panorama/Android.mk ...
  88. including ./development/samples/AccelerometerPlay/Android.mk ...
  89. including ./development/samples/AliasActivity/Android.mk ...
  90. including ./development/samples/AndroidBeamDemo/Android.mk ...
  91. including ./development/samples/ApiDemos/Android.mk ...
  92. including ./development/samples/AppNavigation/Android.mk ...
  93. including ./development/samples/BackupRestore/Android.mk ...
  94. including ./development/samples/BasicGLSurfaceView/Android.mk ...
  95. including ./development/samples/BluetoothChat/Android.mk ...
  96. including ./development/samples/BluetoothHDP/Android.mk ...
  97. including ./development/samples/BrokenKeyDerivation/Android.mk ...
  98. including ./development/samples/BusinessCard/Android.mk ...
  99. including ./development/samples/Compass/Android.mk ...
  100. including ./development/samples/ContactManager/Android.mk ...
  101. including ./development/samples/CubeLiveWallpaper/Android.mk ...
  102. including ./development/samples/FixedGridLayout/Android.mk ...
  103. including ./development/samples/HeavyWeight/Android.mk ...
  104. including ./development/samples/HelloActivity/Android.mk ...
  105. including ./development/samples/HelloEffects/Android.mk ...
  106. including ./development/samples/Home/Android.mk ...
  107. including ./development/samples/HoneycombGallery/Android.mk ...
  108. including ./development/samples/JetBoy/Android.mk ...
  109. including ./development/samples/KeyChainDemo/Android.mk ...
  110. including ./development/samples/LceDemo/Android.mk ...
  111. including ./development/samples/LunarLander/Android.mk ...
  112. including ./development/samples/MultiResolution/Android.mk ...
  113. including ./development/samples/MultiWindow/Android.mk ...
  114. including ./development/samples/MySampleRss/Android.mk ...
  115. including ./development/samples/NotePad/Android.mk ...
  116. including ./development/samples/Obb/Android.mk ...
  117. including ./development/samples/RSSReader/Android.mk ...
  118. including ./development/samples/RandomMusicPlayer/Android.mk ...
  119. including ./development/samples/ReceiveShareDemo/Android.mk ...
  120. including ./development/samples/RenderScript/Android.mk ...
  121. including ./development/samples/SampleSyncAdapter/Android.mk ...
  122. including ./development/samples/SearchableDictionary/Android.mk ...
  123. including ./development/samples/ShortcutDemo/Android.mk ...
  124. including ./development/samples/ShortcutSample/Android.mk ...
  125. including ./development/samples/SimpleJNI/Android.mk ...
  126. including ./development/samples/SipDemo/Android.mk ...
  127. including ./development/samples/SkeletonApp/Android.mk ...
  128. including ./development/samples/Snake/Android.mk ...
  129. including ./development/samples/SoftKeyboard/Android.mk ...
  130. including ./development/samples/SpellChecker/Android.mk ...
  131. including ./development/samples/StackWidget/Android.mk ...
  132. including ./development/samples/ToyVpn/Android.mk ...
  133. including ./development/samples/TtsEngine/Android.mk ...
  134. including ./development/samples/USB/Android.mk ...
  135. including ./development/samples/UiAutomator/Android.mk ...
  136. including ./development/samples/Vault/Android.mk ...
  137. including ./development/samples/VoiceRecognitionService/Android.mk ...
  138. including ./development/samples/VoicemailProviderDemo/Android.mk ...
  139. including ./development/samples/WeatherListWidget/Android.mk ...
  140. including ./development/samples/WiFiDirectDemo/Android.mk ...
  141. including ./development/samples/WiFiDirectServiceDiscovery/Android.mk ...
  142. including ./development/samples/Wiktionary/Android.mk ...
  143. including ./development/samples/WiktionarySimple/Android.mk ...
  144. including ./development/samples/XmlAdapters/Android.mk ...
  145. including ./development/samples/training/NsdChat/Android.mk ...
  146. including ./development/testrunner/Android.mk ...
  147. including ./development/tools/apkcheck/Android.mk ...
  148. including ./development/tools/emulator/test-apps/SmokeTests/Android.mk ...
  149. including ./development/tools/etc1tool/Android.mk ...
  150. including ./development/tools/hosttestlib/Android.mk ...
  151. including ./development/tools/idegen/Android.mk ...
  152. including ./development/tools/line_endings/Android.mk ...
  153. including ./development/tools/mkstubs/Android.mk ...
  154. including ./development/tools/rmtypedefs/Android.mk ...
  155. including ./development/tools/yuv420sp2rgb/Android.mk ...
  156. including ./development/tutorials/MoarRam/Android.mk ...
  157. including ./development/tutorials/NotepadCodeLab/Notepadv1/Android.mk ...
  158. including ./development/tutorials/NotepadCodeLab/Notepadv1Solution/Android.mk ...
  159. including ./development/tutorials/NotepadCodeLab/Notepadv2/Android.mk ...
  160. including ./development/tutorials/NotepadCodeLab/Notepadv2Solution/Android.mk ...
  161. including ./development/tutorials/NotepadCodeLab/Notepadv3/Android.mk ...
  162. including ./development/tutorials/NotepadCodeLab/Notepadv3Solution/Android.mk ...
  163. including ./development/tutorials/ReverseDebug/Android.mk ...
  164. including ./device/khadas/common/Android.mk ...
  165. including ./device/khadas/kvim/Android.mk ...
  166. including ./device/khadas/kvim2/Android.mk ...
  167. including ./device/khadas/kvim2l/Android.mk ...
  168. including ./docs/source.android.com/Android.mk ...
  169. including ./external/aac/Android.mk ...
  170. including ./external/android-clat/Android.mk ...
  171. including ./external/androidplot/Android.mk ...
  172. including ./external/ant-glob/Android.mk ...
  173. including ./external/antlr/Android.mk ...
  174. including ./external/apache-commons-math/Android.mk ...
  175. including ./external/apache-harmony/Android.mk ...
  176. including ./external/apache-http/Android.mk ...
  177. including ./external/apache-xml/Android.mk ...
  178. including ./external/archive-patcher/Android.mk ...
  179. including ./external/avahi/Android.mk ...
  180. including ./external/bison/Android.mk ...
  181. including ./external/blktrace/Android.mk ...
  182. including ./external/boringssl/Android.mk ...
  183. including ./external/bouncycastle/Android.mk ...
  184. including ./external/bsdiff/Android.mk ...
  185. including ./external/bzip2/Android.mk ...
  186. including ./external/c-ares/Android.mk ...
  187. including ./external/caliper/Android.mk ...
  188. including ./external/cblas/Android.mk ...
  189. including ./external/ceres-solver/Android.mk ...
  190. including ./external/chromium-libpac/Android.mk ...
  191. including ./external/chromium-webview/Android.mk ...
  192. including ./external/clang/Android.mk ...
  193. including ./external/compiler-rt/Android.mk ...
  194. including ./external/conscrypt/Android.mk ...
  195. including ./external/crcalc/Android.mk ...
  196. including ./external/curl/Android.mk ...
  197. including ./external/dagger2/Android.mk ...
  198. including ./external/dbus-binding-generator/Android.mk ...
  199. including ./external/dbus/Android.mk ...
  200. including ./external/deqp/Android.mk ...
  201. build/core/binary.mk:1192: external/deqp/Android.mk: libdeqp: Unused source files: \
  202. build/core/binary.mk:1192: external/deqp/Android.mk: libdeqp: Unused source files: \
  203. including ./external/dexmaker/Android.mk ...
  204. including ./external/dhcpcd-6.8.2/Android.mk ...
  205. including ./external/dng_sdk/Android.mk ...
  206. including ./external/dnsmasq/Android.mk ...
  207. including ./external/doclava/Android.mk ...
  208. including ./external/drm_gralloc/Android.mk ...
  209. including ./external/drm_hwcomposer/Android.mk ...
  210. including ./external/droiddriver/Android.mk ...
  211. including ./external/e2fsprogs/Android.mk ...
  212. including ./external/easymock/Android.mk ...
  213. including ./external/eclipse-windowbuilder/propertysheet/Android.mk ...
  214. including ./external/eigen/Android.mk ...
  215. including ./external/elfutils/Android.mk ...
  216. including ./external/emma/Android.mk ...
  217. including ./external/expat/Android.mk ...
  218. including ./external/eyes-free/Android.mk ...
  219. including ./external/f2fs-tools/Android.mk ...
  220. including ./external/fdlibm/Android.mk ...
  221. including ./external/fec/Android.mk ...
  222. including ./external/fio/Android.mk ...
  223. including ./external/flac/Android.mk ...
  224. including ./external/freetype/Android.mk ...
  225. including ./external/fsck_msdos/Android.mk ...
  226. including ./external/gemmlowp/Android.mk ...
  227. including ./external/giflib/Android.mk ...
  228. including ./external/glide/Android.mk ...
  229. including ./external/gmock/Android.mk ...
  230. including ./external/google-benchmark/Android.mk ...
  231. including ./external/google-breakpad/Android.mk ...
  232. including ./external/google-fonts/carrois-gothic-sc/Android.mk ...
  233. including ./external/google-fonts/coming-soon/Android.mk ...
  234. including ./external/google-fonts/cutive-mono/Android.mk ...
  235. including ./external/google-fonts/dancing-script/Android.mk ...
  236. including ./external/google-tv-pairing-protocol/Android.mk ...
  237. including ./external/gptfdisk/Android.mk ...
  238. including ./external/gtest/Android.mk ...
  239. including ./external/guava/Android.mk ...
  240. including ./external/guice/Android.mk ...
  241. including ./external/hamcrest/Android.mk ...
  242. including ./external/harfbuzz_ng/Android.mk ...
  243. including ./external/hyphenation-patterns/Android.mk ...
  244. including ./external/i2c-tools/Android.mk ...
  245. including ./external/icu/Android.mk ...
  246. including ./external/iproute2/Android.mk ...
  247. including ./external/ipsec-tools/Android.mk ...
  248. including ./external/iptables/Android.mk ...
  249. including ./external/iputils/Android.mk ...
  250. including ./external/iw/Android.mk ...
  251. including ./external/jacoco/Android.mk ...
  252. including ./external/jarjar/Android.mk ...
  253. including ./external/javasqlite/Android.mk ...
  254. including ./external/javassist/Android.mk ...
  255. including ./external/jcommander/Android.mk ...
  256. including ./external/jdiff/Android.mk ...
  257. including ./external/jemalloc/Android.mk ...
  258. including ./external/jetty/Android.mk ...
  259. including ./external/jhead/Android.mk ...
  260. including ./external/jmdns/Android.mk ...
  261. including ./external/jsilver/Android.mk ...
  262. including ./external/jsmn/Android.mk ...
  263. including ./external/jsoncpp/Android.mk ...
  264. including ./external/jsr305/Android.mk ...
  265. including ./external/jsr330/Android.mk ...
  266. including ./external/junit/Android.mk ...
  267. including ./external/ksoap2/Android.mk ...
  268. including ./external/libavc/Android.mk ...
  269. including ./external/libbrillo/Android.mk ...
  270. including ./external/libcap-ng/Android.mk ...
  271. including ./external/libcap/Android.mk ...
  272. including ./external/libchrome/Android.mk ...
  273. including ./external/libcxx/Android.mk ...
  274. including ./external/libcxxabi/Android.mk ...
  275. including ./external/libdaemon/Android.mk ...
  276. including ./external/libdivsufsort/Android.mk ...
  277. including ./external/libdrm/Android.mk ...
  278. including ./external/libedit/Android.mk ...
  279. including ./external/libevent/Android.mk ...
  280. including ./external/libexif/Android.mk ...
  281. including ./external/libgsm/Android.mk ...
  282. including ./external/libhevc/Android.mk ...
  283. including ./external/libjpeg-turbo/Android.mk ...
  284. including ./external/liblzf/Android.mk ...
  285. including ./external/libmicrohttpd/Android.mk ...
  286. including ./external/libmpeg2/Android.mk ...
  287. including ./external/libnfc-nci/Android.mk ...
  288. including ./external/libnfc-nxp/Android.mk ...
  289. including ./external/libnl/Android.mk ...
  290. including ./external/libogg/Android.mk ...
  291. including ./external/libopus/Android.mk ...
  292. including ./external/libpcap/Android.mk ...
  293. including ./external/libphonenumber/Android.mk ...
  294. including ./external/libpng/Android.mk ...
  295. including ./external/libselinux/Android.mk ...
  296. including ./external/libunwind/Android.mk ...
  297. including ./external/libunwind_llvm/Android.mk ...
  298. including ./external/libusb/Android.mk ...
  299. including ./external/libutf/Android.mk ...
  300. including ./external/libvncserver/Android.mk ...
  301. including ./external/libvorbis/Android.mk ...
  302. including ./external/libvpx/Android.mk ...
  303. including ./external/libvterm/Android.mk ...
  304. including ./external/libweave/Android.mk ...
  305. including ./external/libxml2/Android.mk ...
  306. including ./external/libyuv/Android.mk ...
  307. including ./external/littlemock/Android.mk ...
  308. including ./external/llvm/Android.mk ...
  309. including ./external/ltrace/Android.mk ...
  310. including ./external/lz4/Android.mk ...
  311. including ./external/lzma/C/Android.mk ...
  312. including ./external/lzma/Java/Tukaani/Android.mk ...
  313. including ./external/lzma/xz-embedded/Android.mk ...
  314. including ./external/markdown/Android.mk ...
  315. including ./external/mdnsresponder/Android.mk ...
  316. including ./external/mesa3d/Android.mk ...
  317. including ./external/messageformat/Android.mk ...
  318. including ./external/minijail/Android.mk ...
  319. including ./external/mksh/Android.mk ...
  320. including ./external/mmc-utils/Android.mk ...
  321. including ./external/mockito/Android.mk ...
  322. including ./external/mockwebserver/Android.mk ...
  323. including ./external/modp_b64/Android.mk ...
  324. including ./external/mp4parser/Android.mk ...
  325. including ./external/mtpd/Android.mk ...
  326. including ./external/nanohttpd/Android.mk ...
  327. including ./external/nanopb-c/Android.mk ...
  328. including ./external/netcat/Android.mk ...
  329. including ./external/netperf/Android.mk ...
  330. including ./external/neven/Android.mk ...
  331. including ./external/nfacct/Android.mk ...
  332. including ./external/nist-pkits/Android.mk ...
  333. including ./external/noto-fonts/Android.mk ...
  334. including ./external/oauth/core/src/main/java/Android.mk ...
  335. including ./external/objenesis/Android.mk ...
  336. including ./external/okhttp/Android.mk ...
  337. including ./external/opencv/Android.mk ...
  338. including ./external/opencv3/Android.mk ...
  339. including ./external/owasp/sanitizer/Android.mk ...
  340. including ./external/parameter-framework/Android.mk ...
  341. including ./external/pcre/Android.mk ...
  342. including ./external/pdfium/core/Android.mk ...
  343. including ./external/pdfium/fpdfsdk/Android.mk ...
  344. including ./external/pdfium/third_party/Android.mk ...
  345. build/core/binary.mk:1192: external/pdfium/third_party/pdfiumbigint.mk: libpdfiumbigint: Unused source files: bigint/BigInteger.cc bigint/BigIntegerUtils.cc bigint/BigUnsigned.cc bigint/BigUnsignedInABase.cc
  346. build/core/binary.mk:1192: external/pdfium/third_party/pdfiumbigint.mk: libpdfiumbigint: Unused source files: bigint/BigInteger.cc bigint/BigIntegerUtils.cc bigint/BigUnsigned.cc bigint/BigUnsignedInABase.cc
  347. including ./external/piex/Android.mk ...
  348. including ./external/ppp/pppd/Android.mk ...
  349. including ./external/proguard/Android.mk ...
  350. including ./external/protobuf/Android.mk ...
  351. including ./external/regex-re2/Android.mk ...
  352. including ./external/replicaisland/Android.mk ...
  353. including ./external/rmi4utils/Android.mk ...
  354. including ./external/robolectric/v1/Android.mk ...
  355. including ./external/roboto-fonts/Android.mk ...
  356. including ./external/rootdev/Android.mk ...
  357. including ./external/safe-iop/Android.mk ...
  358. including ./external/scrypt/Android.mk ...
  359. including ./external/selinux/Android.mk ...
  360. including ./external/sfntly/Android.mk ...
  361. including ./external/shflags/Android.mk ...
  362. including ./external/skia/Android.mk ...
  363. including ./external/sl4a/Android.mk ...
  364. including ./external/smali/baksmali/Android.mk ...
  365. including ./external/smali/deodexerant/Android.mk ...
  366. including ./external/smali/dexlib2/Android.mk ...
  367. including ./external/smali/smali/Android.mk ...
  368. including ./external/snakeyaml/Android.mk ...
  369. including ./external/sonic/Android.mk ...
  370. including ./external/sonivox/Android.mk ...
  371. including ./external/speex/Android.mk ...
  372. ./external/speex/Android.mk:56: TODOArm64: enable neon in libspeex
  373. including ./external/sqlite/android/Android.mk ...
  374. including ./external/sqlite/dist/Android.mk ...
  375. including ./external/squashfs-tools/Android.mk ...
  376. including ./external/srtp/Android.mk ...
  377. including ./external/strace/Android.mk ...
  378. including ./external/svox/Android.mk ...
  379. including ./external/tagsoup/Android.mk ...
  380. including ./external/tcpdump/Android.mk ...
  381. including ./external/testng/Android.mk ...
  382. including ./external/tinyalsa/Android.mk ...
  383. including ./external/tinycompress/Android.mk ...
  384. including ./external/tinyxml/Android.mk ...
  385. including ./external/tinyxml2/Android.mk ...
  386. including ./external/tlsdate/Android.mk ...
  387. including ./external/toybox/Android.mk ...
  388. including ./external/tpm2/Android.mk ...
  389. including ./external/tremolo/Android.mk ...
  390. including ./external/v8/Android.mk ...
  391. including ./external/valgrind/Android.mk ...
  392. including ./external/vboot_reference/Android.mk ...
  393. including ./external/vixl/Android.mk ...
  394. including ./external/vogar/Android.mk ...
  395. including ./external/vulkan-validation-layers/Android.mk ...
  396. including ./external/webp/Android.mk ...
  397. including ./external/webrtc/Android.mk ...
  398. including ./external/wpa_supplicant_8/Android.mk ...
  399. including ./external/xmlrpcpp/Android.mk ...
  400. including ./external/xmp_toolkit/Android.mk ...
  401. including ./external/zlib/Android.mk ...
  402. including ./external/zopfli/Android.mk ...
  403. including ./external/zxing/Android.mk ...
  404. including ./frameworks/av/amlogic/Android.mk ...
  405. including ./frameworks/av/camera/Android.mk ...
  406. including ./frameworks/av/cmds/screenrecord/Android.mk ...
  407. including ./frameworks/av/cmds/stagefright/Android.mk ...
  408. including ./frameworks/av/drm/common/Android.mk ...
  409. including ./frameworks/av/drm/drmserver/Android.mk ...
  410. including ./frameworks/av/drm/libdrmframework/Android.mk ...
  411. including ./frameworks/av/drm/libmediadrm/Android.mk ...
  412. including ./frameworks/av/drm/mediadrm/plugins/clearkey/Android.mk ...
  413. including ./frameworks/av/drm/mediadrm/plugins/mock/Android.mk ...
  414. including ./frameworks/av/media/audioserver/Android.mk ...
  415. including ./frameworks/av/media/common_time/Android.mk ...
  416. including ./frameworks/av/media/img_utils/Android.mk ...
  417. including ./frameworks/av/media/libcpustats/Android.mk ...
  418. including ./frameworks/av/media/libeffects/downmix/Android.mk ...
  419. including ./frameworks/av/media/libeffects/factory/Android.mk ...
  420. including ./frameworks/av/media/libeffects/loudness/Android.mk ...
  421. including ./frameworks/av/media/libeffects/lvm/lib/Android.mk ...
  422. including ./frameworks/av/media/libeffects/lvm/wrapper/Android.mk ...
  423. including ./frameworks/av/media/libeffects/preprocessing/Android.mk ...
  424. including ./frameworks/av/media/libeffects/proxy/Android.mk ...
  425. including ./frameworks/av/media/libeffects/visualizer/Android.mk ...
  426. including ./frameworks/av/media/libmedia/Android.mk ...
  427. including ./frameworks/av/media/libmediaplayerservice/Android.mk ...
  428. including ./frameworks/av/media/libnbaio/Android.mk ...
  429. including ./frameworks/av/media/libstagefright/Android.mk ...
  430. including ./frameworks/av/media/mediaserver/Android.mk ...
  431. including ./frameworks/av/media/mtp/Android.mk ...
  432. including ./frameworks/av/media/ndk/Android.mk ...
  433. including ./frameworks/av/media/utils/Android.mk ...
  434. including ./frameworks/av/radio/Android.mk ...
  435. including ./frameworks/av/services/audioflinger/Android.mk ...
  436. including ./frameworks/av/services/audiopolicy/Android.mk ...
  437. including ./frameworks/av/services/camera/libcameraservice/Android.mk ...
  438. including ./frameworks/av/services/mediacodec/Android.mk ...
  439. including ./frameworks/av/services/mediadrm/Android.mk ...
  440. including ./frameworks/av/services/mediaextractor/Android.mk ...
  441. including ./frameworks/av/services/medialog/Android.mk ...
  442. including ./frameworks/av/services/mediaresourcemanager/Android.mk ...
  443. including ./frameworks/av/services/radio/Android.mk ...
  444. including ./frameworks/av/services/soundtrigger/Android.mk ...
  445. including ./frameworks/av/soundtrigger/Android.mk ...
  446. including ./frameworks/av/tools/resampler_tools/Android.mk ...
  447. including ./frameworks/base/Android.mk ...
  448. build/core/package_internal.mk:166: Empty argument supplied to find-subdir-assets
  449. including ./frameworks/compile/libbcc/Android.mk ...
  450. including ./frameworks/compile/mclinker/Android.mk ...
  451. including ./frameworks/compile/slang/Android.mk ...
  452. including ./frameworks/data-binding/Android.mk ...
  453. including ./frameworks/ex/camera2/Android.mk ...
  454. including ./frameworks/ex/common/Android.mk ...
  455. including ./frameworks/ex/framesequence/Android.mk ...
  456. including ./frameworks/minikin/app/Android.mk ...
  457. including ./frameworks/minikin/libs/minikin/Android.mk ...
  458. including ./frameworks/minikin/sample/Android.mk ...
  459. including ./frameworks/minikin/tests/Android.mk ...
  460. including ./frameworks/ml/Android.mk ...
  461. including ./frameworks/multidex/Android.mk ...
  462. including ./frameworks/native/cmds/atrace/Android.mk ...
  463. including ./frameworks/native/cmds/bugreport/Android.mk ...
  464. including ./frameworks/native/cmds/bugreportz/Android.mk ...
  465. including ./frameworks/native/cmds/cmd/Android.mk ...
  466. including ./frameworks/native/cmds/dumpstate/Android.mk ...
  467. including ./frameworks/native/cmds/dumpsys/Android.mk ...
  468. including ./frameworks/native/cmds/flatland/Android.mk ...
  469. including ./frameworks/native/cmds/installd/Android.mk ...
  470. including ./frameworks/native/cmds/ip-up-vpn/Android.mk ...
  471. including ./frameworks/native/cmds/rawbu/Android.mk ...
  472. including ./frameworks/native/cmds/service/Android.mk ...
  473. including ./frameworks/native/cmds/servicemanager/Android.mk ...
  474. including ./frameworks/native/libs/binder/Android.mk ...
  475. including ./frameworks/native/libs/diskusage/Android.mk ...
  476. including ./frameworks/native/libs/gui/Android.mk ...
  477. including ./frameworks/native/libs/input/Android.mk ...
  478. including ./frameworks/native/libs/ui/Android.mk ...
  479. including ./frameworks/native/opengl/libagl/Android.mk ...
  480. including ./frameworks/native/opengl/libs/Android.mk ...
  481. including ./frameworks/native/opengl/tests/Android.mk ...
  482. including ./frameworks/native/services/batteryservice/Android.mk ...
  483. including ./frameworks/native/services/inputflinger/Android.mk ...
  484. including ./frameworks/native/services/powermanager/Android.mk ...
  485. including ./frameworks/native/services/sensorservice/Android.mk ...
  486. including ./frameworks/native/services/surfaceflinger/Android.mk ...
  487. including ./frameworks/native/vulkan/Android.mk ...
  488. including ./frameworks/opt/bitmap/Android.mk ...
  489. including ./frameworks/opt/bluetooth/Android.mk ...
  490. FindEmulator: find: `frameworks/opt/bluetooth/src/android/bluetooth/client/pbap': No such file or directory
  491. including ./frameworks/opt/calendar/Android.mk ...
  492. including ./frameworks/opt/chips/Android.mk ...
  493. including ./frameworks/opt/colorpicker/Android.mk ...
  494. including ./frameworks/opt/datetimepicker/Android.mk ...
  495. including ./frameworks/opt/inputmethodcommon/Android.mk ...
  496. including ./frameworks/opt/net/ethernet/Android.mk ...
  497. including ./frameworks/opt/net/ims/Android.mk ...
  498. including ./frameworks/opt/net/voip/Android.mk ...
  499. including ./frameworks/opt/net/wifi/service/Android.mk ...
  500. including ./frameworks/opt/net/wifi/tests/Android.mk ...
  501. find: ‘out/target/common/obj/SHARED_LIBRARIES/libwifi-hal-mock_intermediates’: No such file or directory
  502. including ./frameworks/opt/photoviewer/Android.mk ...
  503. including ./frameworks/opt/setupwizard/library/Android.mk ...
  504. including ./frameworks/opt/setupwizard/navigationbar/Android.mk ...
  505. including ./frameworks/opt/telephony/Android.mk ...
  506. including ./frameworks/opt/timezonepicker/Android.mk ...
  507. including ./frameworks/opt/vcard/Android.mk ...
  508. including ./frameworks/rs/Android.mk ...
  509. including ./frameworks/support/Android.mk ...
  510. FindEmulator: find: `frameworks/support/design/dummy': No such file or directory
  511. build/core/package_internal.mk:166: Empty argument supplied to find-subdir-assets
  512. FindEmulator: find: `frameworks/support/transition/dummy': No such file or directory
  513. FindEmulator: find: `frameworks/support/v17/leanback/dummy': No such file or directory
  514. FindEmulator: find: `frameworks/support/v17/preference-leanback/dummy': No such file or directory
  515. including ./frameworks/volley/Android.mk ...
  516. including ./frameworks/webview/Android.mk ...
  517. including ./frameworks/wilhelm/src/Android.mk ...
  518. including ./frameworks/wilhelm/tests/Android.mk ...
  519. including ./hardware/amlogic/LibAudio/Android.mk ...
  520. including ./hardware/amlogic/audio/Android.mk ...
  521. including ./hardware/amlogic/audio_dia_remote/Android.mk ...
  522. including ./hardware/amlogic/camera/Android.mk ...
  523. ************************************************************
  524. pdk or not:
  525. target board: gxm
  526. git version: "7501b9bbfd1fd7238d0a524a467be80547abfb78"
  527. uncomment: 0 files
  528. last changed: "Date: Mon Aug 21 15:35:53 2017 +0800"
  529. build time: " Mon Nov 19 20:06:13 HKT 2018"
  530. builder name: " d00268009"
  531. branch name: "* (no branch)"
  532. build mode: userdebug
  533. host name: "SIA1000125839"
  534. host IP: "10.180.54.216"
  535. path: "/home/d00268009/opensource/other/vim2-android/hardware/amlogic/camera/v3/fake-pipeline2/tests"
  536. ************************************************************
  537. including ./hardware/amlogic/consumerir/Android.mk ...
  538. including ./hardware/amlogic/gralloc/Android.mk ...
  539. GRALLOC_FB_SWAP_RED_BLUE1 is 0
  540. MALI_AFBC_GRALLOC is 1
  541. including ./hardware/amlogic/hdmi_cec/Android.mk ...
  542. including ./hardware/amlogic/hwcomposer/Android.mk ...
  543. including ./hardware/amlogic/keymaster/Android.mk ...
  544. including ./hardware/amlogic/libbt/Android.mk ...
  545. including ./hardware/amlogic/lights/Android.mk ...
  546. including ./hardware/amlogic/media/Android.mk ...
  547. including ./hardware/amlogic/memtrack/Android.mk ...
  548. including ./hardware/amlogic/power/Android.mk ...
  549. including ./hardware/amlogic/screen_source/Android.mk ...
  550. including ./hardware/amlogic/sensors/Android.mk ...
  551. including ./hardware/amlogic/tv_input/Android.mk ...
  552. including ./hardware/amlogic/usbctrl/Android.mk ...
  553. including ./hardware/amlogic/wifi/bcm_ampak/Android.mk ...
  554. including ./hardware/amlogic/wifi/dongle_info/Android.mk ...
  555. including ./hardware/amlogic/wifi/icomm/Android.mk ...
  556. including ./hardware/amlogic/wifi/mediatek/Android.mk ...
  557. including ./hardware/amlogic/wifi/multi_wifi/Android.mk ...
  558. including ./hardware/amlogic/wifi/qcom/Android.mk ...
  559. including ./hardware/amlogic/wifi/realtek/Android.mk ...
  560. including ./hardware/arm/gpu/lib/Android.mk ...
  561. Android.mk GPU_DRV_VERSION is r16p0
  562. build/core/binary.mk:1192: hardware/arm/gpu/lib/Android.mk: libGLES_mali: Unused source files: t82x_ion/libGLES_mali_default_8a_32-n-r16p0.so
  563. build/core/binary.mk:1192: hardware/arm/gpu/lib/Android.mk: libGLES_mali: Unused source files: t82x_ion/libGLES_mali_default_8a_32-n-r16p0.so
  564. including ./hardware/broadcom/wlan/bcmdhd/Android.mk ...
  565. including ./hardware/bsp/intel/peripheral/bluetooth/bcm43340/Android.mk ...
  566. including ./hardware/bsp/intel/peripheral/displays/Grove_LCD_RGB/Android.mk ...
  567. including ./hardware/bsp/intel/peripheral/displays/SparkFun_OLED/Android.mk ...
  568. including ./hardware/bsp/intel/peripheral/examples/mraa/gpio_output/Android.mk ...
  569. including ./hardware/bsp/intel/peripheral/libmraa/Android.mk ...
  570. including ./hardware/bsp/intel/peripheral/libupm/Android.mk ...
  571. including ./hardware/bsp/intel/peripheral/wifi/bcm43340/Android.mk ...
  572. including ./hardware/bsp/intel/soc/common/bootctrl/Android.mk ...
  573. including ./hardware/bsp/intel/soc/common/tools/Android.mk ...
  574. including ./hardware/google/apf/Android.mk ...
  575. including ./hardware/libhardware/Android.mk ...
  576. including ./hardware/libhardware_legacy/Android.mk ...
  577. including ./hardware/marvell/bt/Android.mk ...
  578. including ./hardware/mtk/bluetooth/libdriver/Android.mk ...
  579. including ./hardware/qcom/bootctrl/Android.mk ...
  580. including ./hardware/qcom/bt/qca_series/Android.mk ...
  581. including ./hardware/qcom/camera/Android.mk ...
  582. including ./hardware/realtek/bluetooth/Android.mk ...
  583. including ./hardware/ril/libril/Android.mk ...
  584. including ./hardware/ril/librilutils/Android.mk ...
  585. including ./hardware/ril/reference-ril/Android.mk ...
  586. including ./hardware/ril/rild/Android.mk ...
  587. including ./hardware/wifi/qualcomm/drivers/qca6174/AIO/drivers/qcacld-new/Android.mk ...
  588. including ./hardware/wifi/qualcomm/drivers/qca9377/AIO/drivers/qcacld-new/Android.mk ...
  589. including ./hardware/wifi/qualcomm/drivers/qca9379/AIO/drivers/qcacld-new/Android.mk ...
  590. including ./libcore/Android.mk ...
  591. including ./libnativehelper/Android.mk ...
  592. including ./ndk/Android.mk ...
  593. including ./packages/apps/BasicSmsReceiver/Android.mk ...
  594. including ./packages/apps/Bluetooth/Android.mk ...
  595. AndroidMainfest.xml is overlay by device/khadas/kvim2/overlay/packages/apps/Bluetooth/AndroidManifest.xml
  596. including ./packages/apps/Browser2/Android.mk ...
  597. including ./packages/apps/Calculator/Android.mk ...
  598. including ./packages/apps/Calendar/Android.mk ...
  599. including ./packages/apps/Camera2/Android.mk ...
  600. including ./packages/apps/CarrierConfig/Android.mk ...
  601. including ./packages/apps/CellBroadcastReceiver/Android.mk ...
  602. including ./packages/apps/CertInstaller/Android.mk ...
  603. including ./packages/apps/Contacts/Android.mk ...
  604. including ./packages/apps/DeskClock/Android.mk ...
  605. including ./packages/apps/DevCamera/Android.mk ...
  606. including ./packages/apps/Dialer/Android.mk ...
  607. FindEmulator: find: `packages/apps/Dialer/InCallUI/src-N': No such file or directory
  608. FindEmulator: find: `packages/apps/ContactsCommon/src-N': No such file or directory
  609. FindEmulator: find: `packages/apps/PhoneCommon/src-N': No such file or directory
  610. including ./packages/apps/Email/Android.mk ...
  611. including ./packages/apps/EmergencyInfo/Android.mk ...
  612. including ./packages/apps/ExactCalculator/Android.mk ...
  613. including ./packages/apps/Gallery/Android.mk ...
  614. including ./packages/apps/Gallery2/Android.mk ...
  615. including ./packages/apps/HTMLViewer/Android.mk ...
  616. including ./packages/apps/KeyChain/Android.mk ...
  617. including ./packages/apps/Launcher2/Android.mk ...
  618. AndroidMainfest.xml is overlay by device/khadas/kvim2/overlay/packages/apps/Launcher2/AndroidManifest.xml
  619. including ./packages/apps/Launcher3/Android.mk ...
  620. including ./packages/apps/LegacyCamera/Android.mk ...
  621. including ./packages/apps/ManagedProvisioning/Android.mk ...
  622. including ./packages/apps/Messaging/Android.mk ...
  623. including ./packages/apps/Music/Android.mk ...
  624. including ./packages/apps/MusicFX/Android.mk ...
  625. including ./packages/apps/Nfc/Android.mk ...
  626. including ./packages/apps/OneTimeInitializer/Android.mk ...
  627. including ./packages/apps/PackageInstaller/Android.mk ...
  628. including ./packages/apps/PhoneCommon/Android.mk ...
  629. including ./packages/apps/Protips/Android.mk ...
  630. including ./packages/apps/Provision/Android.mk ...
  631. AndroidMainfest.xml is overlay by device/khadas/kvim2/overlay/packages/apps/Provision/AndroidManifest.xml
  632. including ./packages/apps/QuickSearchBox/Android.mk ...
  633. including ./packages/apps/Settings/Android.mk ...
  634. AndroidMainfest.xml is overlay by device/khadas/kvim2/overlay/packages/apps/Settings/AndroidManifest.xml
  635. including ./packages/apps/SoundRecorder/Android.mk ...
  636. including ./packages/apps/SpareParts/Android.mk ...
  637. including ./packages/apps/SpeechRecorder/Android.mk ...
  638. including ./packages/apps/Stk/Android.mk ...
  639. including ./packages/apps/TV/Android.mk ...
  640. including ./packages/apps/Tag/Android.mk ...
  641. including ./packages/apps/Terminal/Android.mk ...
  642. including ./packages/apps/Test/connectivity/sl4n/Android.mk ...
  643. including ./packages/apps/TvSettings/QuickSettings/Android.mk ...
  644. including ./packages/apps/TvSettings/Settings/Android.mk ...
  645. AndroidMainfest.xml is overlay by device/khadas/kvim2/overlay/packages/apps/TvSettings/Settings/AndroidManifest.xml
  646. including ./packages/apps/UnifiedEmail/Android.mk ...
  647. including ./packages/experimental/Android.mk ...
  648. including ./packages/inputmethods/LatinIME/Android.mk ...
  649. including ./packages/inputmethods/OpenWnn/Android.mk ...
  650. including ./packages/providers/BlockedNumberProvider/Android.mk ...
  651. including ./packages/providers/BookmarkProvider/Android.mk ...
  652. including ./packages/providers/CalendarProvider/Android.mk ...
  653. including ./packages/providers/CallLogProvider/Android.mk ...
  654. including ./packages/providers/ContactsProvider/Android.mk ...
  655. including ./packages/providers/DownloadProvider/Android.mk ...
  656. including ./packages/providers/MediaProvider/Android.mk ...
  657. including ./packages/providers/PartnerBookmarksProvider/Android.mk ...
  658. including ./packages/providers/TelephonyProvider/Android.mk ...
  659. including ./packages/providers/TvProvider/Android.mk ...
  660. including ./packages/providers/UserDictionaryProvider/Android.mk ...
  661. including ./packages/screensavers/Basic/Android.mk ...
  662. including ./packages/screensavers/PhotoTable/Android.mk ...
  663. including ./packages/screensavers/WebView/Android.mk ...
  664. including ./packages/services/Car/Android.mk ...
  665. FindEmulator: find: `packages/services/Car/car-support-lib/dummy': No such file or directory
  666. including ./packages/services/Mms/Android.mk ...
  667. including ./packages/services/Telecomm/Android.mk ...
  668. including ./packages/services/Telephony/Android.mk ...
  669. including ./packages/wallpapers/LivePicker/Android.mk ...
  670. including ./pdk/apps/HelloPDK/Android.mk ...
  671. including ./pdk/apps/TestingCamera/Android.mk ...
  672. including ./pdk/apps/TestingCamera2/Android.mk ...
  673. including ./platform_testing/libraries/annotations/Android.mk ...
  674. including ./platform_testing/libraries/aupt-lib/Android.mk ...
  675. including ./platform_testing/libraries/base-app-helpers/Android.mk ...
  676. including ./platform_testing/libraries/launcher-helper/Android.mk ...
  677. including ./platform_testing/libraries/power-helper/Android.mk ...
  678. including ./platform_testing/libraries/timeresult-helper/Android.mk ...
  679. including ./platform_testing/scripts/perf-setup/Android.mk ...
  680. including ./platform_testing/tests/functional/applinktests/Android.mk ...
  681. including ./platform_testing/tests/functional/appsmoke/Android.mk ...
  682. including ./platform_testing/tests/functional/downloadapp/Android.mk ...
  683. including ./platform_testing/tests/functional/notificationtests/Android.mk ...
  684. including ./platform_testing/tests/functional/otatests/Android.mk ...
  685. including ./platform_testing/tests/functional/overviewtests/Android.mk ...
  686. including ./platform_testing/tests/functional/permission/Android.mk ...
  687. including ./platform_testing/tests/functional/testapks/applinktestapp/Android.mk ...
  688. including ./platform_testing/tests/functional/testapks/permissiontestappmv1/Android.mk ...
  689. including ./platform_testing/tests/jank/UbSystemUiJankTests/Android.mk ...
  690. including ./platform_testing/tests/jank/androidtvjanktests/Android.mk ...
  691. including ./platform_testing/tests/jank/dialer/Android.mk ...
  692. including ./platform_testing/tests/jank/jankmicrobenchmark/Android.mk ...
  693. including ./platform_testing/tests/jank/notificationsgenerator_wear/Android.mk ...
  694. including ./platform_testing/tests/jank/sysapp_wear/Android.mk ...
  695. including ./platform_testing/tests/jank/touch_latency_wear/Android.mk ...
  696. including ./platform_testing/tests/jank/uibench/Android.mk ...
  697. including ./platform_testing/tests/jank/uibench_wear/Android.mk ...
  698. including ./platform_testing/tests/jank/webview/Android.mk ...
  699. including ./platform_testing/tests/perf/PerfTransitionTest/Android.mk ...
  700. including ./platform_testing/tests/perf/PerformanceAppTest/Android.mk ...
  701. including ./platform_testing/tests/perf/PerformanceLaunch/Android.mk ...
  702. including ./platform_testing/tests/perf/PowerPerfTest/Android.mk ...
  703. including ./platform_testing/utils/crashcollector/Android.mk ...
  704. including ./platform_testing/utils/dpad/Android.mk ...
  705. including ./platform_testing/utils/permissions/Android.mk ...
  706. including ./platform_testing/utils/wifistrengthscanner/Android.mk ...
  707. including ./prebuilts/clang/host/linux-x86/Android.mk ...
  708. including ./prebuilts/misc/Android.mk ...
  709. including ./prebuilts/ndk/Android.mk ...
  710. including ./prebuilts/qemu-kernel/x86/pc-bios/Android.mk ...
  711. including ./prebuilts/sdk/Android.mk ...
  712. including ./prebuilts/tools/Android.mk ...
  713. FindEmulator: find: `prebuilts/tools/android-arm64': No such file or directory
  714. including ./sdk/annotations/Android.mk ...
  715. including ./sdk/avdlauncher/Android.mk ...
  716. including ./sdk/dumpeventlog/Android.mk ...
  717. including ./sdk/emulator/mksdcard/Android.mk ...
  718. including ./sdk/eventanalyzer/Android.mk ...
  719. including ./sdk/find_java/Android.mk ...
  720. including ./sdk/find_lock/Android.mk ...
  721. including ./sdk/hierarchyviewer/etc/Android.mk ...
  722. including ./sdk/hierarchyviewer/src/Android.mk ...
  723. including ./sdk/sdklauncher/Android.mk ...
  724. including ./system/bt/Android.mk ...
  725. including ./system/ca-certificates/Android.mk ...
  726. including ./system/connectivity/apmanager/Android.mk ...
  727. including ./system/connectivity/shill/Android.mk ...
  728. including ./system/core/Android.mk ...
  729. including ./system/extras/Android.mk ...
  730. including ./system/firewalld/Android.mk ...
  731. including ./system/gatekeeper/Android.mk ...
  732. including ./system/keymaster/Android.mk ...
  733. including ./system/media/alsa_utils/Android.mk ...
  734. including ./system/media/audio_route/Android.mk ...
  735. including ./system/media/audio_utils/Android.mk ...
  736. including ./system/media/brillo/audio/audioservice/Android.mk ...
  737. including ./system/media/camera/src/Android.mk ...
  738. including ./system/media/camera/tests/Android.mk ...
  739. including ./system/media/radio/src/Android.mk ...
  740. including ./system/nativepower/Android.mk ...
  741. including ./system/netd/Android.mk ...
  742. including ./system/security/keystore-engine/Android.mk ...
  743. including ./system/security/keystore/Android.mk ...
  744. including ./system/security/softkeymaster/Android.mk ...
  745. including ./system/sepolicy/Android.mk ...
  746. including ./system/tools/aidl/Android.mk ...
  747. including ./system/tpm/trunks/Android.mk ...
  748. including ./system/update_engine/Android.mk ...
  749. including ./system/vold/Android.mk ...
  750. including ./system/weaved/Android.mk ...
  751. including ./system/webservd/Android.mk ...
  752. including ./tools/external/fat32lib/Android.mk ...
  753. including ./tools/test/connectivity/Android.mk ...
  754. including ./vendor/amlogic/apps/AppInstaller/Android.mk ...
  755. including ./vendor/amlogic/apps/DLNA/Android.mk ...
  756. including ./vendor/amlogic/apps/DTVPlayer/Android.mk ...
  757. 25 vendor/amlogic/apps/DTVPlayer cp v5 v6 file
  758. including ./vendor/amlogic/apps/Dig/Android.mk ...
  759. including ./vendor/amlogic/apps/DroidTvSettings/Android.mk ...
  760. including ./vendor/amlogic/apps/FileBrowser/Android.mk ...
  761. including ./vendor/amlogic/apps/HDMI_in/Android.mk ...
  762. including ./vendor/amlogic/apps/HdmiSwitch/Android.mk ...
  763. including ./vendor/amlogic/apps/IrBlaster/Android.mk ...
  764. including ./vendor/amlogic/apps/MboxLauncher2/Android.mk ...
  765. AndroidMainfest.xml is overlay by device/khadas/kvim2/overlay/vendor/amlogic/apps/MboxLauncher2/AndroidManifest.xml
  766. including ./vendor/amlogic/apps/MboxSettings/Android.mk ...
  767. including ./vendor/amlogic/apps/Miracast/Android.mk ...
  768. including ./vendor/amlogic/apps/NativeImagePlayer/Android.mk ...
  769. including ./vendor/amlogic/apps/OTAUpgrade2/Android.mk ...
  770. including ./vendor/amlogic/apps/PPPoE/Android.mk ...
  771. including ./vendor/amlogic/apps/RemoteIME/Android.mk ...
  772. including ./vendor/amlogic/apps/SubTitle/Android.mk ...
  773. including ./vendor/amlogic/apps/TvInput/Android.mk ...
  774. including ./vendor/amlogic/apps/TvMiddleware/Android.mk ...
  775. out/target/common/obj/APPS/TVService_intermediates/src/src/com/amlogic/tvservice/TVDeviceImpl.java
  776. including ./vendor/amlogic/apps/VideoPlayer/Android.mk ...
  777. including ./vendor/amlogic/dvb/Android.mk ...
  778. including ./vendor/amlogic/external/alsa-lib/Android.mk ...
  779. including ./vendor/amlogic/external/busybox/Android.mk ...
  780. including ./vendor/amlogic/external/ffmpeg/Android.mk ...
  781. including ./vendor/amlogic/external/libaudioeffect/Android.mk ...
  782. including ./vendor/amlogic/external/libbluray/Android.mk ...
  783. including ./vendor/amlogic/external/libiconv/Android.mk ...
  784. including ./vendor/amlogic/external/libtiff/Android.mk ...
  785. including ./vendor/amlogic/external/libzvbi/Android.mk ...
  786. including ./vendor/amlogic/external/ntfs-3g/Android.mk ...
  787. including ./vendor/amlogic/external/pppoe/Android.mk ...
  788. including ./vendor/amlogic/frameworks/av/Android.mk ...
  789. build/core/binary.mk:1192: vendor/amlogic/frameworks/av/codecs/wma/wmapro_dec/Android.mk: libstagefright_soft_wmaprodec: Unused source files: \
  790. build/core/binary.mk:1192: vendor/amlogic/frameworks/av/codecs/wma/wmapro_dec/Android.mk: libstagefright_soft_wmaprodec: Unused source files: \
  791. including ./vendor/amlogic/frameworks/core/java/Android.mk ...
  792. including ./vendor/amlogic/frameworks/core/jni/Android.mk ...
  793. including ./vendor/amlogic/frameworks/core/res/Android.mk ...
  794. including ./vendor/amlogic/frameworks/pppoe/java/Android.mk ...
  795. including ./vendor/amlogic/frameworks/pppoe/jni/Android.mk ...
  796. including ./vendor/amlogic/frameworks/services/data_integrity_guard/Android.mk ...
  797. including ./vendor/amlogic/frameworks/services/dv_config/Android.mk ...
  798. including ./vendor/amlogic/frameworks/services/fbc_tool/Android.mk ...
  799. including ./vendor/amlogic/frameworks/services/hdmicec/Android.mk ...
  800. including ./vendor/amlogic/frameworks/services/imageplayer/Android.mk ...
  801. including ./vendor/amlogic/frameworks/services/remoteconf/Android.mk ...
  802. including ./vendor/amlogic/frameworks/services/systemcontrol/Android.mk ...
  803. including ./vendor/amlogic/frameworks/services/zygote_proxy/Android.mk ...
  804. including ./vendor/amlogic/prebuilt/Android.mk ...
  805. "no bootaccelerate source code, add prebuilts"
  806. "no tvserver source code, add binary lib"
  807. including ./vendor/amlogic/system/libge2d/Android.mk ...
  808. build/core/base_rules.mk:104: unusual tags ge2d_feature_test on ge2d_feature_test at vendor/amlogic/system/libge2d
  809. build/core/base_rules.mk:104: unusual tags ge2d_load_test on ge2d_load_test at vendor/amlogic/system/libge2d
  810. including ./vendor/amlogic/system/libhealthd/Android.mk ...
  811. including ./vendor/amlogic/system/libinstaboot_support/Android.mk ...
  812. including ./vendor/amlogic/system/modem/Android.mk ...
  813. including ./vendor/amlogic/tools/logo_img_packer/Android.mk ...
  814. including ./vendor/amlogic/tv/frameworks/core/java/Android.mk ...
  815. including ./vendor/amlogic/tv/frameworks/core/jni/Android.mk ...
  816. including ./vendor/amlogic/tv/frameworks/libtvbinder/Android.mk ...
  817. including ./vendor/huitong/Android.mk ...
  818. including ./vendor/widevine/Android.mk ...
  819. No private recovery resources for TARGET_DEVICE kvim2
  820. build/core/base_rules.mk:319: warning: overriding commands for target `out/target/product/kvim2/root/verity_key'
  821. build/core/base_rules.mk:319: warning: ignoring old commands for target `out/target/product/kvim2/root/verity_key'
  822. vendor/amlogic/frameworks/av/LibPlayer/amffmpeg/libavcodec/Makefile:711: warning: overriding commands for target `cos_tables.c'
  823. vendor/amlogic/frameworks/av/LibPlayer/amffmpeg/libavcodec/Makefile:711: warning: ignoring old commands for target `cos_tables.c'
  824. vendor/amlogic/frameworks/av/LibPlayer/amffmpeg/libavcodec/Makefile:711: warning: overriding commands for target `cos_fixed_tables.c'
  825. vendor/amlogic/frameworks/av/LibPlayer/amffmpeg/libavcodec/Makefile:711: warning: ignoring old commands for target `cos_fixed_tables.c'
  826. vendor/amlogic/frameworks/av/LibPlayer/amffmpeg/libavcodec/Makefile:711: warning: overriding commands for target `sin_tables.c'
  827. vendor/amlogic/frameworks/av/LibPlayer/amffmpeg/libavcodec/Makefile:711: warning: ignoring old commands for target `sin_tables.c'
  828. vendor/amlogic/frameworks/av/LibPlayer/amffmpeg/libavcodec/Makefile:725: warning: overriding commands for target `cbrt_tables.h'
  829. vendor/amlogic/frameworks/av/LibPlayer/amffmpeg/libavcodec/Makefile:725: warning: ignoring old commands for target `cbrt_tables.h'
  830. vendor/amlogic/frameworks/av/LibPlayer/amffmpeg/libavcodec/Makefile:725: warning: overriding commands for target `aacps_tables.h'
  831. vendor/amlogic/frameworks/av/LibPlayer/amffmpeg/libavcodec/Makefile:725: warning: ignoring old commands for target `aacps_tables.h'
  832. vendor/amlogic/frameworks/av/LibPlayer/amffmpeg/libavcodec/Makefile:725: warning: overriding commands for target `aac_tables.h'
  833. vendor/amlogic/frameworks/av/LibPlayer/amffmpeg/libavcodec/Makefile:725: warning: ignoring old commands for target `aac_tables.h'
  834. vendor/amlogic/frameworks/av/LibPlayer/amffmpeg/libavcodec/Makefile:725: warning: overriding commands for target `dv_tables.h'
  835. vendor/amlogic/frameworks/av/LibPlayer/amffmpeg/libavcodec/Makefile:725: warning: ignoring old commands for target `dv_tables.h'
  836. vendor/amlogic/frameworks/av/LibPlayer/amffmpeg/libavcodec/Makefile:725: warning: overriding commands for target `sinewin_tables.h'
  837. vendor/amlogic/frameworks/av/LibPlayer/amffmpeg/libavcodec/Makefile:725: warning: ignoring old commands for target `sinewin_tables.h'
  838. vendor/amlogic/frameworks/av/LibPlayer/amffmpeg/libavcodec/Makefile:725: warning: overriding commands for target `mpegaudio_tables.h'
  839. vendor/amlogic/frameworks/av/LibPlayer/amffmpeg/libavcodec/Makefile:725: warning: ignoring old commands for target `mpegaudio_tables.h'
  840. vendor/amlogic/frameworks/av/LibPlayer/amffmpeg/libavcodec/Makefile:725: warning: overriding commands for target `motionpixels_tables.h'
  841. vendor/amlogic/frameworks/av/LibPlayer/amffmpeg/libavcodec/Makefile:725: warning: ignoring old commands for target `motionpixels_tables.h'
  842. vendor/amlogic/frameworks/av/LibPlayer/amffmpeg/libavcodec/Makefile:725: warning: overriding commands for target `pcm_tables.h'
  843. vendor/amlogic/frameworks/av/LibPlayer/amffmpeg/libavcodec/Makefile:725: warning: ignoring old commands for target `pcm_tables.h'
  844. vendor/amlogic/frameworks/av/LibPlayer/amffmpeg/libavcodec/Makefile:725: warning: overriding commands for target `qdm2_tables.h'
  845. vendor/amlogic/frameworks/av/LibPlayer/amffmpeg/libavcodec/Makefile:725: warning: ignoring old commands for target `qdm2_tables.h'
  846. build/core/Makefile:34: warning: overriding commands for target `out/target/product/kvim2/system/lib/hw/audio.huitong.default.so'
  847. build/core/base_rules.mk:319: warning: ignoring old commands for target `out/target/product/kvim2/system/lib/hw/audio.huitong.default.so'
  848. build/core/Makefile:34: warning: overriding commands for target `out/target/product/kvim2/system/usr/keylayout/Generic.kl'
  849. build/core/Makefile:34: warning: ignoring old commands for target `out/target/product/kvim2/system/usr/keylayout/Generic.kl'
  850. build/core/Makefile:34: warning: overriding commands for target `out/target/product/kvim2/system/bin/wl'
  851. build/core/base_rules.mk:319: warning: ignoring old commands for target `out/target/product/kvim2/system/bin/wl'
  852. Starting build with ninja
  853. ninja: Entering directory `.'
  854. [ 0% 8/46764] Copying: out/host/common/obj/JAVA_LIBRARIES/signapk_intermediates/classes-jarjar.jar
  855. [ 0% 9/46764] Copying: out/host/common/obj/JAVA_LIBRARIES/signapk_intermediates/javalib.jar
  856. [ 0% 10/46764] host C: libcrypto_static <= external/boringssl/src/crypto/cipher/aead.c
  857. [ 0% 11/46764] host C: libcrypto_static <= external/boringssl/src/crypto/chacha/chacha_vec.c
  858. [ 0% 12/46764] host C: libcrypto_static <= external/boringssl/src/crypto/cipher/derive_key.c
  859. [ 0% 13/46764] host C: libcrypto_static <= external/boringssl/src/crypto/cipher/e_des.c
  860. [ 0% 14/46764] host C: libcrypto_static <= external/boringssl/src/crypto/cipher/e_null.c
  861. [ 0% 15/46764] host C: libcrypto_static <= external/boringssl/src/crypto/cipher/cipher.c
  862. [ 0% 16/46764] host C: libcrypto_static <= external/boringssl/src/crypto/cipher/e_chacha20poly1305.c
  863. [ 0% 17/46764] host C: libcrypto_static <= external/boringssl/src/crypto/cipher/e_rc4.c
  864. [ 0% 18/46764] host C: libcrypto_static <= external/boringssl/src/crypto/cipher/e_aes.c
  865. [ 0% 19/46764] host C: libcrypto_static <= external/boringssl/src/crypto/cipher/e_rc2.c
  866. [ 0% 20/46764] host C: libcrypto_static <= external/boringssl/src/crypto/cipher/e_ssl3.c
  867. [ 0% 21/46764] build out/target/product/kvim2/obj/KERNEL_OBJ/.config
  868. make: Entering directory '/home/d00268009/opensource/other/vim2-android/common'
  869. KBUILD_CFLAGS_MODULE:-DMODULE
  870. GEN /home/d00268009/opensource/other/vim2-android/out/target/product/kvim2/obj/KERNEL_OBJ/Makefile
  871. #
  872. # configuration written to .config
  873. #
  874. make: Leaving directory '/home/d00268009/opensource/other/vim2-android/common'
  875. [ 0% 22/46764] host C: libcrypto_static <= external/boringssl/src/crypto/cpu-arm.c
  876. [ 0% 23/46764] host C: libcrypto_static <= external/boringssl/src/crypto/cipher/e_tls.c
  877. [ 0% 24/46764] host C: libcrypto_static <= external/boringssl/src/crypto/cpu-intel.c
  878. [ 0% 25/46764] host C: libcrypto_static <= external/boringssl/src/crypto/crypto.c
  879. [ 0% 26/46764] host C: libcrypto_static <= external/boringssl/src/crypto/cipher/tls_cbc.c
  880. [ 0% 27/46764] host C: libcrypto_static <= external/boringssl/src/crypto/dh/check.c
  881. [ 0% 28/46764] host C: libcrypto_static <= external/boringssl/src/crypto/curve25519/x25519-x86_64.c
  882. [ 0% 29/46764] host C: libcrypto_static <= external/boringssl/src/crypto/dh/params.c
  883. [ 0% 30/46764] host C: libcrypto_static <= external/boringssl/src/crypto/dh/dh.c
  884. [ 0% 31/46764] host C: libcrypto_static <= external/boringssl/src/crypto/dh/dh_asn1.c
  885. [ 0% 32/46764] host C: libcrypto_static <= external/boringssl/src/crypto/directory_posix.c
  886. [ 0% 33/46764] host C: libcrypto_static <= external/boringssl/src/crypto/digest/digest.c
  887. [ 0% 34/46764] host C: libcrypto_static <= external/boringssl/src/crypto/digest/digests.c
  888. [ 0% 35/46764] host C: libcrypto_static <= external/boringssl/src/crypto/directory_win.c
  889. [ 0% 36/46764] Ensure Jack server is installed and started
  890. Jack server already installed in "/home/d00268009/.jack-server"
  891. Server is already running
  892. [ 0% 37/46764] host C: libcrypto_static <= external/boringssl/src/crypto/dsa/dsa_asn1.c
  893. [ 0% 38/46764] host C: libcrypto_static <= external/boringssl/src/crypto/dsa/dsa.c
  894. [ 0% 39/46764] Copying: out/target/common/obj/JAVA_LIBRARIES/framework_intermediates/classes.dex
  895. [ 0% 40/46764] host C: libcrypto_static <= external/boringssl/src/crypto/ec/oct.c
  896. [ 0% 41/46764] host C: libcrypto_static <= external/boringssl/src/crypto/ec/ec_asn1.c
  897. [ 0% 42/46764] host C: libcrypto_static <= external/boringssl/src/crypto/ec/p224-64.c
  898. [ 0% 43/46764] host C: libcrypto_static <= external/boringssl/src/crypto/ec/ec.c
  899. [ 0% 44/46764] host C: libcrypto_static <= external/boringssl/src/crypto/ec/ec_key.c
  900. [ 0% 45/46764] host C: libcrypto_static <= external/boringssl/src/crypto/des/des.c
  901. [ 0% 46/46764] host C: libcrypto_static <= external/boringssl/src/crypto/ec/p256-x86_64.c
  902. [ 0% 47/46764] host C: libcrypto_static <= external/boringssl/src/crypto/ec/util-64.c
  903. [ 0% 48/46764] host C: libcrypto_static <= external/boringssl/src/crypto/x509v3/pcy_tree.c
  904. [ 0% 49/46764] host C: libcrypto_static <= external/boringssl/src/crypto/ec/wnaf.c
  905. [ 0% 50/46764] host C: libcrypto_static <= external/boringssl/src/crypto/ecdh/ecdh.c
  906. [ 0% 51/46764] host C: libcrypto_static <= external/boringssl/src/crypto/ecdsa/ecdsa.c
  907. [ 0% 52/46764] host C: libcrypto_static <= external/boringssl/src/crypto/ec/simple.c
  908. [ 0% 53/46764] host C: libcrypto_static <= external/boringssl/src/crypto/engine/engine.c
  909. [ 0% 54/46764] host C: libcrypto_static <= external/boringssl/src/crypto/err/err.c
  910. [ 0% 55/46764] host C: libcrypto_static <= external/boringssl/src/crypto/ecdsa/ecdsa_asn1.c
  911. [ 0% 56/46764] host C: libcrypto_static <= external/boringssl/src/crypto/evp/algorithm.c
  912. [ 0% 57/46764] host C: libcrypto_static <= external/boringssl/src/crypto/evp/digestsign.c
  913. [ 0% 58/46764] Generating TOC: out/target/common/obj/JAVA_LIBRARIES/framework_intermediates/classes.dex.toc
  914. [ 0% 59/46764] host C: libcrypto_static <= external/boringssl/src/crypto/evp/evp_asn1.c
  915. [ 0% 60/46764] host C: libcrypto_static <= external/boringssl/src/crypto/evp/pbkdf.c
  916. [ 0% 61/46764] host C: libcrypto_static <= external/boringssl/src/crypto/evp/evp.c
  917. [ 0% 62/46764] host C: libcrypto_static <= external/boringssl/src/crypto/evp/p_ec.c
  918. [ 0% 63/46764] host C: libcrypto_static <= external/boringssl/src/crypto/evp/p_rsa_asn1.c
  919. [ 0% 64/46764] host C: libcrypto_static <= external/boringssl/src/crypto/evp/evp_ctx.c
  920. [ 0% 65/46764] host C: libcrypto_static <= external/boringssl/src/crypto/evp/p_ec_asn1.c
  921. [ 0% 66/46764] host C: libcrypto_static <= external/boringssl/src/crypto/evp/p_dsa_asn1.c
  922. [ 0% 67/46764] host C: libcrypto_static <= external/boringssl/src/crypto/evp/sign.c
  923. [ 0% 68/46764] host C: libcrypto_static <= external/boringssl/src/crypto/evp/p_rsa.c
  924. [ 0% 69/46764] host C: libcrypto_static <= external/boringssl/src/crypto/lhash/lhash.c
  925. [ 0% 70/46764] host C: libcrypto_static <= external/boringssl/src/crypto/hkdf/hkdf.c
  926. [ 0% 71/46764] host C: libcrypto_static <= external/boringssl/src/crypto/ex_data.c
  927. [ 0% 72/46764] host C: libcrypto_static <= external/boringssl/src/crypto/hmac/hmac.c
  928. [ 0% 73/46764] host C: libcrypto_static <= external/boringssl/src/crypto/md5/md5.c
  929. [ 0% 74/46764] host C: libcrypto_static <= external/boringssl/src/crypto/md4/md4.c
  930. [ 0% 75/46764] host C: libcrypto_static <= external/boringssl/src/crypto/modes/cbc.c
  931. [ 0% 76/46764] host C: libcrypto_static <= external/boringssl/src/crypto/mem.c
  932. [ 0% 77/46764] host C: libcrypto_static <= external/boringssl/src/crypto/modes/cfb.c
  933. [ 0% 78/46764] host C: libcrypto_static <= external/boringssl/src/crypto/modes/ctr.c
  934. [ 0% 79/46764] host C: libcrypto_static <= external/boringssl/src/crypto/modes/ofb.c
  935. [ 0% 80/46764] host C: libcrypto_static <= external/boringssl/src/crypto/obj/obj_xref.c
  936. [ 0% 81/46764] host C: libcrypto_static <= external/boringssl/src/crypto/obj/obj.c
  937. [ 0% 82/46764] host C: libcrypto_static <= external/boringssl/src/crypto/rand/rand.c
  938. [ 0% 83/46764] host C: libcrypto_static <= external/boringssl/src/crypto/modes/gcm.c
  939. [ 0% 84/46764] host C: libcrypto_static <= external/boringssl/src/crypto/pem/pem_all.c
  940. [ 0% 85/46764] host C: libcrypto_static <= external/boringssl/src/crypto/pem/pem_info.c
  941. [ 0% 86/46764] host C: libcrypto_static <= external/boringssl/src/crypto/pem/pem_oth.c
  942. [ 0% 87/46764] host C: libcrypto_static <= external/boringssl/src/crypto/pem/pem_pk8.c
  943. [ 0% 88/46764] host C: libcrypto_static <= external/boringssl/src/crypto/pem/pem_pkey.c
  944. [ 0% 89/46764] host C: libcrypto_static <= external/boringssl/src/crypto/pem/pem_x509.c
  945. [ 0% 90/46764] host C: libcrypto_static <= external/boringssl/src/crypto/pem/pem_xaux.c
  946. [ 0% 91/46764] host C: libcrypto_static <= external/boringssl/src/crypto/pem/pem_lib.c
  947. [ 0% 92/46764] host C: libcrypto_static <= external/boringssl/src/crypto/pkcs8/p5_pbe.c
  948. [ 0% 93/46764] host C: libcrypto_static <= external/boringssl/src/crypto/pkcs8/p8_pkey.c
  949. [ 0% 94/46764] host C: libcrypto_static <= external/boringssl/src/crypto/pkcs8/p5_pbev2.c
  950. [ 0% 95/46764] host C: libcrypto_static <= external/boringssl/src/crypto/poly1305/poly1305.c
  951. [ 0% 96/46764] host C: libcrypto_static <= external/boringssl/src/crypto/poly1305/poly1305_arm.c
  952. [ 0% 97/46764] host C: libcrypto_static <= external/boringssl/src/crypto/rand/windows.c
  953. [ 0% 98/46764] host C: libcrypto_static <= external/boringssl/src/crypto/rc4/rc4.c
  954. [ 0% 99/46764] host C: libcrypto_static <= external/boringssl/src/crypto/rand/urandom.c
  955. [ 0% 100/46764] host C: libcrypto_static <= external/boringssl/src/crypto/refcount_c11.c
  956. [ 0% 101/46764] host C: libcrypto_static <= external/boringssl/src/crypto/sha/sha1.c
  957. [ 0% 102/46764] host C: libcrypto_static <= external/boringssl/src/crypto/refcount_lock.c
  958. [ 0% 103/46764] host C: libcrypto_static <= external/boringssl/src/crypto/pkcs8/pkcs8.c
  959. [ 0% 104/46764] host C: libcrypto_static <= external/boringssl/src/crypto/poly1305/poly1305_vec.c
  960. [ 0% 105/46764] host C: libcrypto_static <= external/boringssl/src/crypto/stack/stack.c
  961. [ 0% 106/46764] Building with Jack: out/target/common/obj/APPS/AppInstaller_intermediates/with-local/classes.dex
  962. [ 0% 107/46764] host C: libcrypto_static <= external/boringssl/src/crypto/rsa/blinding.c
  963. [ 0% 108/46764] Copying: out/target/common/obj/APPS/AppInstaller_intermediates/classes.dex
  964. [ 0% 109/46764] host C: libcrypto_static <= external/boringssl/src/crypto/rsa/rsa_asn1.c
  965. [ 0% 110/46764] host C: libcrypto_static <= external/boringssl/src/crypto/rsa/rsa.c
  966. [ 0% 111/46764] host C: libcrypto_static <= external/boringssl/src/crypto/sha/sha256.c
  967. [ 0% 112/46764] host C: libcrypto_static <= external/boringssl/src/crypto/rsa/padding.c
  968. [ 0% 113/46764] host C: libcrypto_static <= external/boringssl/src/crypto/sha/sha512.c
  969. [ 0% 114/46764] host C: libcrypto_static <= external/boringssl/src/crypto/rsa/rsa_impl.c
  970. [ 0% 115/46764] host C: libcrypto_static <= external/boringssl/src/crypto/thread.c
  971. [ 0% 116/46764] host C: libcrypto_static <= external/boringssl/src/crypto/thread_none.c
  972. [ 0% 117/46764] host C: libcrypto_static <= external/boringssl/src/crypto/thread_win.c
  973. [ 0% 118/46764] host C: libcrypto_static <= external/boringssl/src/crypto/thread_pthread.c
  974. [ 0% 119/46764] host C: libcrypto_static <= external/boringssl/src/crypto/time_support.c
  975. [ 0% 120/46764] host C: libcrypto_static <= external/boringssl/src/crypto/x509/t_req.c
  976. [ 0% 121/46764] host C: libcrypto_static <= external/boringssl/src/crypto/x509/a_digest.c
  977. [ 0% 122/46764] host C: libcrypto_static <= external/boringssl/src/crypto/x509/a_sign.c
  978. [ 0% 123/46764] host C: libcrypto_static <= external/boringssl/src/crypto/x509/t_x509.c
  979. [ 0% 124/46764] host C: libcrypto_static <= external/boringssl/src/crypto/x509/a_verify.c
  980. [ 0% 125/46764] host C: libcrypto_static <= external/boringssl/src/crypto/x509/a_strex.c
  981. [ 0% 126/46764] host C: libcrypto_static <= external/boringssl/src/crypto/x509/by_file.c
  982. [ 0% 127/46764] host C: libcrypto_static <= external/boringssl/src/crypto/x509/i2d_pr.c
  983. [ 0% 128/46764] host C: libcrypto_static <= external/boringssl/src/crypto/x509/by_dir.c
  984. [ 0% 129/46764] host C: libcrypto_static <= external/boringssl/src/crypto/x509/asn1_gen.c
  985. [ 0% 130/46764] host C: libcrypto_static <= external/boringssl/src/crypto/x509/pkcs7.c
  986. [ 0% 131/46764] host C: libcrypto_static <= external/boringssl/src/crypto/x509/t_crl.c
  987. [ 0% 132/46764] host C: libcrypto_static <= external/boringssl/src/crypto/x509/x509.c
  988. [ 0% 133/46764] host C: libcrypto_static <= external/boringssl/src/crypto/x509/t_x509a.c
  989. [ 0% 134/46764] host C: libcrypto_static <= external/boringssl/src/crypto/x509/x509_att.c
  990. [ 0% 135/46764] host C: libcrypto_static <= external/boringssl/src/crypto/x509/x509_d2.c
  991. [ 0% 136/46764] host C: libcrypto_static <= external/boringssl/src/crypto/x509/x_all.c
  992. [ 0% 137/46764] host C: libcrypto_static <= external/boringssl/src/crypto/x509/x509_def.c
  993. [ 0% 138/46764] host C: libcrypto_static <= external/boringssl/src/crypto/x509/x509_cmp.c
  994. [ 0% 139/46764] host C: libcrypto_static <= external/boringssl/src/crypto/x509/x509_ext.c
  995. [ 0% 140/46764] host C: libcrypto_static <= external/boringssl/src/crypto/x509/x509_set.c
  996. [ 0% 141/46764] host C: libcrypto_static <= external/boringssl/src/crypto/x509/x509_obj.c
  997. [ 0% 142/46764] host C: libcrypto_static <= external/boringssl/src/crypto/x509/x509_r2x.c
  998. [ 0% 143/46764] host C: libcrypto_static <= external/boringssl/src/crypto/x509/x509_req.c
  999. [ 0% 144/46764] host C: libcrypto_static <= external/boringssl/src/crypto/x509/x509_lu.c
  1000. [ 0% 145/46764] host C: libcrypto_static <= external/boringssl/src/crypto/x509/x509_txt.c
  1001. [ 0% 146/46764] host C: libcrypto_static <= external/boringssl/src/crypto/x509/x509_trs.c
  1002. [ 0% 147/46764] host C: libcrypto_static <= external/boringssl/src/crypto/x509/x509_v3.c
  1003. [ 0% 148/46764] host C: libcrypto_static <= external/boringssl/src/crypto/x509/x509_vpm.c
  1004. [ 0% 149/46764] host C: libcrypto_static <= external/boringssl/src/crypto/x509/x509cset.c
  1005. [ 0% 150/46764] host C: libcrypto_static <= external/boringssl/src/crypto/x509/x509rset.c
  1006. [ 0% 151/46764] host C: libcrypto_static <= external/boringssl/src/crypto/x509/x509spki.c
  1007. [ 0% 152/46764] host C: libcrypto_static <= external/boringssl/src/crypto/x509/x509name.c
  1008. [ 0% 153/46764] host C: libcrypto_static <= external/boringssl/src/crypto/x509/x509type.c
  1009. [ 0% 154/46764] host C: libcrypto_static <= external/boringssl/src/crypto/x509/x_algor.c
  1010. [ 0% 155/46764] host C: libcrypto_static <= external/boringssl/src/crypto/x509/x_attrib.c
  1011. [ 0% 156/46764] host C: libcrypto_static <= external/boringssl/src/crypto/x509/x_exten.c
  1012. [ 0% 157/46764] host C: libcrypto_static <= external/boringssl/src/crypto/x509/x509_vfy.c
  1013. [ 0% 158/46764] host C: libcrypto_static <= external/boringssl/src/crypto/x509/x_req.c
  1014. [ 0% 159/46764] host C: libcrypto_static <= external/boringssl/src/crypto/x509/x_crl.c
  1015. [ 0% 160/46764] host C: libcrypto_static <= external/boringssl/src/crypto/x509/x_info.c
  1016. [ 0% 161/46764] host C: libcrypto_static <= external/boringssl/src/crypto/x509/x_pkey.c
  1017. [ 0% 162/46764] host C: libcrypto_static <= external/boringssl/src/crypto/x509/x_name.c
  1018. [ 0% 163/46764] host C: libcrypto_static <= external/boringssl/src/crypto/x509/x_spki.c
  1019. [ 0% 164/46764] host C: libcrypto_static <= external/boringssl/src/crypto/x509/x_pubkey.c
  1020. [ 0% 165/46764] host C: libcrypto_static <= external/boringssl/src/crypto/x509/x_val.c
  1021. [ 0% 166/46764] host C: libcrypto_static <= external/boringssl/src/crypto/x509/x_sig.c
  1022. [ 0% 167/46764] host C: libcrypto_static <= external/boringssl/src/crypto/x509/x_x509a.c
  1023. [ 0% 168/46764] host C: libcrypto_static <= external/boringssl/src/crypto/x509/x_x509.c
  1024. [ 0% 169/46764] host C: libcrypto_static <= external/boringssl/src/crypto/x509v3/pcy_data.c
  1025. [ 0% 170/46764] host C: libcrypto_static <= external/boringssl/src/crypto/x509v3/pcy_cache.c
  1026. [ 0% 171/46764] host C: libcrypto_static <= external/boringssl/src/crypto/x509v3/pcy_lib.c
  1027. [ 0% 172/46764] host C: libcrypto_static <= external/boringssl/src/crypto/x509v3/pcy_map.c
  1028. [ 0% 173/46764] host C: libcrypto_static <= external/boringssl/src/crypto/x509v3/pcy_node.c
  1029. [ 0% 174/46764] host C: libcrypto_static <= external/boringssl/src/crypto/x509v3/v3_akeya.c
  1030. [ 0% 175/46764] host C: libcrypto_static <= external/boringssl/src/crypto/x509v3/v3_akey.c
  1031. [ 0% 176/46764] host C: libcrypto_static <= external/boringssl/src/crypto/x509v3/v3_bitst.c
  1032. [ 0% 177/46764] host C: libcrypto_static <= external/boringssl/src/crypto/x509v3/v3_bcons.c
  1033. [ 0% 178/46764] host C: libcrypto_static <= external/boringssl/src/crypto/x509v3/v3_alt.c
  1034. [ 0% 179/46764] host C: libcrypto_static <= external/boringssl/src/crypto/x509v3/v3_enum.c
  1035. [ 0% 180/46764] host C: libcrypto_static <= external/boringssl/src/crypto/x509v3/v3_conf.c
  1036. [ 0% 181/46764] host C: libcrypto_static <= external/boringssl/src/crypto/x509v3/v3_extku.c
  1037. [ 0% 182/46764] host C: libcrypto_static <= external/boringssl/src/crypto/x509v3/v3_cpols.c
  1038. [ 0% 183/46764] host C: libcrypto_static <= external/boringssl/src/crypto/x509v3/v3_genn.c
  1039. [ 0% 184/46764] host C: libcrypto_static <= external/boringssl/src/crypto/x509v3/v3_crld.c
  1040. [ 0% 185/46764] host C: libcrypto_static <= external/boringssl/src/crypto/x509v3/v3_ia5.c
  1041. [ 0% 186/46764] host C: libcrypto_static <= external/boringssl/src/crypto/x509v3/v3_int.c
  1042. [ 0% 187/46764] host C: libcrypto_static <= external/boringssl/src/crypto/x509v3/v3_info.c
  1043. [ 0% 188/46764] host C: libcrypto_static <= external/boringssl/src/crypto/x509v3/v3_lib.c
  1044. [ 0% 189/46764] host C: libcrypto_static <= external/boringssl/src/crypto/x509v3/v3_pcia.c
  1045. [ 0% 190/46764] host C: libcrypto_static <= external/boringssl/src/crypto/x509v3/v3_ncons.c
  1046. [ 0% 191/46764] host C: libcrypto_static <= external/boringssl/src/crypto/x509v3/v3_pci.c
  1047. [ 0% 192/46764] host C: libcrypto_static <= external/boringssl/src/crypto/x509v3/v3_pku.c
  1048. [ 0% 193/46764] host C: libcrypto_static <= external/boringssl/src/crypto/x509v3/v3_pcons.c
  1049. [ 0% 194/46764] host C: libcrypto_static <= external/boringssl/src/crypto/x509v3/v3_prn.c
  1050. [ 0% 195/46764] host C: libcrypto_static <= external/boringssl/src/crypto/ec/p256-64.c
  1051. [ 0% 196/46764] Import includes file: out/host/linux-x86/obj/STATIC_LIBRARIES/libssl_static-host_intermediates/import_includes
  1052. [ 0% 197/46764] host C: libcrypto_static <= external/boringssl/src/crypto/x509v3/v3_pmaps.c
  1053. [ 0% 198/46764] host C: libcrypto_static <= external/boringssl/src/crypto/x509v3/v3_skey.c
  1054. [ 0% 199/46764] Export includes file: -- out/host/linux-x86/obj/SHARED_LIBRARIES/libconscrypt_openjdk_jni_intermediates/export_includes
  1055. [ 0% 200/46764] host C: libcrypto_static <= external/boringssl/src/crypto/x509v3/v3_sxnet.c
  1056. [ 0% 201/46764] host C: libcrypto_static <= external/boringssl/src/crypto/x509v3/v3_purp.c
  1057. [ 0% 202/46764] host C: libssl_static-host <= external/boringssl/src/ssl/pqueue/pqueue.c
  1058. [ 0% 203/46764] host C: libssl_static-host <= external/boringssl/src/ssl/custom_extensions.c
  1059. [ 0% 204/46764] host C: libssl_static-host <= external/boringssl/src/ssl/d1_clnt.c
  1060. [ 0% 205/46764] host C: libssl_static-host <= external/boringssl/src/ssl/d1_both.c
  1061. [ 0% 206/46764] host C: libssl_static-host <= external/boringssl/src/ssl/d1_lib.c
  1062. [ 0% 207/46764] host C: libssl_static-host <= external/boringssl/src/ssl/d1_meth.c
  1063. [ 0% 208/46764] host C: libcrypto_static <= external/boringssl/src/crypto/x509v3/v3_utl.c
  1064. [ 0% 209/46764] host C: libssl_static-host <= external/boringssl/src/ssl/d1_srtp.c
  1065. [ 0% 210/46764] host C: libssl_static-host <= external/boringssl/src/ssl/d1_pkt.c
  1066. [ 0% 211/46764] host C: libssl_static-host <= external/boringssl/src/ssl/d1_srvr.c
  1067. [ 0% 212/46764] host StaticLib: libcrypto_static (out/host/linux-x86/obj/STATIC_LIBRARIES/libcrypto_static_intermediates/libcrypto_static.a)
  1068. [ 0% 213/46764] host C: libssl_static-host <= external/boringssl/src/ssl/dtls_record.c
  1069. [ 0% 214/46764] host C: libssl_static-host <= external/boringssl/src/ssl/s3_enc.c
  1070. [ 0% 215/46764] host C: libssl_static-host <= external/boringssl/src/ssl/s3_both.c
  1071. [ 0% 216/46764] host C: libssl_static-host <= external/boringssl/src/ssl/s3_meth.c
  1072. [ 0% 217/46764] host C: libssl_static-host <= external/boringssl/src/ssl/s3_lib.c
  1073. [ 0% 218/46764] host C: libssl_static-host <= external/boringssl/src/ssl/s3_pkt.c
  1074. [ 0% 219/46764] host C: libssl_static-host <= external/boringssl/src/ssl/ssl_aead_ctx.c
  1075. [ 0% 220/46764] host C: libssl_static-host <= external/boringssl/src/ssl/ssl_buffer.c
  1076. [ 0% 221/46764] host C: libssl_static-host <= external/boringssl/src/ssl/ssl_asn1.c
  1077. [ 0% 222/46764] host C: libssl_static-host <= external/boringssl/src/ssl/s3_clnt.c
  1078. [ 0% 223/46764] host C: libssl_static-host <= external/boringssl/src/ssl/ssl_stat.c
  1079. [ 0% 224/46764] host C: libssl_static-host <= external/boringssl/src/ssl/ssl_cert.c
  1080. [ 0% 225/46764] host C: libssl_static-host <= external/boringssl/src/ssl/ssl_ecdh.c
  1081. [ 0% 226/46764] host C: libssl_static-host <= external/boringssl/src/ssl/ssl_cipher.c
  1082. [ 0% 227/46764] host C: libssl_static-host <= external/boringssl/src/ssl/s3_srvr.c
  1083. [ 0% 228/46764] Notice file: external/conscrypt/NOTICE -- out/host/linux-x86/obj/NOTICE_FILES/src//lib64/libconscrypt_openjdk_jni.so.txt
  1084. [ 0% 229/46764] host C: libssl_static-host <= external/boringssl/src/ssl/ssl_file.c
  1085. [ 0% 230/46764] Notice file: external/boringssl/NOTICE -- out/host/linux-x86/obj/NOTICE_FILES/src//lib64/libcrypto_static.a.txt
  1086. [ 0% 231/46764] Notice file: external/boringssl/NOTICE -- out/host/linux-x86/obj/NOTICE_FILES/src//lib/libcrypto_static.a.txt
  1087. [ 0% 232/46764] Notice file: external/boringssl/NOTICE -- out/host/windows-x86/obj/NOTICE_FILES/src//lib/libcrypto_static.a.txt
  1088. [ 0% 233/46764] Notice file: external/boringssl/NOTICE -- out/host/windows-x86/obj/NOTICE_FILES/src//lib64/libcrypto_static.a.txt
  1089. [ 0% 234/46764] host C: libssl_static-host <= external/boringssl/src/ssl/ssl_rsa.c
  1090. [ 0% 235/46764] Notice file: external/boringssl/NOTICE -- out/host/linux-x86/obj/NOTICE_FILES/src//lib/libssl_static-host.a.txt
  1091. [ 0% 236/46764] host C: libssl_static-host <= external/boringssl/src/ssl/tls_record.c
  1092. [ 0% 237/46764] Notice file: external/boringssl/NOTICE -- out/host/linux-x86/obj/NOTICE_FILES/src//lib64/libssl_static-host.a.txt
  1093. [ 0% 238/46764] host C: libssl_static-host <= external/boringssl/src/ssl/t1_enc.c
  1094. [ 0% 239/46764] Export includes file: -- out/host/linux-x86/obj32/STATIC_LIBRARIES/libc++_static_intermediates/export_includes
  1095. [ 0% 240/46764] host C: libssl_static-host <= external/boringssl/src/ssl/ssl_session.c
  1096. [ 0% 241/46764] Export includes file: -- out/host/linux-x86/obj32/STATIC_LIBRARIES/libssl_static-host_intermediates/export_includes
  1097. [ 0% 242/46764] Export includes file: -- out/host/linux-x86/obj32/STATIC_LIBRARIES/libcompiler_rt-extras_intermediates/export_includes
  1098. [ 0% 243/46764] Export includes file: -- out/host/linux-x86/obj32/STATIC_LIBRARIES/libcrypto_static_intermediates/export_includes
  1099. [ 0% 244/46764] Export includes file: -- out/host/linux-x86/obj32/STATIC_LIBRARIES/libc++abi_intermediates/export_includes
  1100. [ 0% 245/46764] Notice file: external/conscrypt/NOTICE -- out/host/linux-x86/obj/NOTICE_FILES/src//lib/libconscrypt_openjdk_jni.so.txt
  1101. [ 0% 246/46764] Export includes file: -- out/host/linux-x86/obj32/SHARED_LIBRARIES/libconscrypt_openjdk_jni_intermediates/export_includes
  1102. [ 0% 247/46764] Import includes file: out/host/linux-x86/obj32/STATIC_LIBRARIES/libc++abi_intermediates/import_includes
  1103. [ 0% 248/46764] Import includes file: out/host/linux-x86/obj32/SHARED_LIBRARIES/libconscrypt_openjdk_jni_intermediates/import_includes
  1104. [ 0% 249/46764] host C: libssl_static-host <= external/boringssl/src/ssl/ssl_lib.c
  1105. [ 0% 250/46764] Import includes file: out/host/linux-x86/obj32/STATIC_LIBRARIES/libc++_static_intermediates/import_includes
  1106. [ 0% 251/46764] Import includes file: out/host/linux-x86/obj32/STATIC_LIBRARIES/libcompiler_rt-extras_intermediates/import_includes
  1107. [ 0% 252/46764] Import includes file: out/host/linux-x86/obj32/STATIC_LIBRARIES/libcrypto_static_intermediates/import_includes
  1108. [ 0% 253/46764] host C++: libc++abi_32 <= external/libcxxabi/src/abort_message.cpp
  1109. [ 0% 254/46764] host C: libssl_static-host <= external/boringssl/src/ssl/t1_lib.c
  1110. [ 0% 255/46764] host C++: libconscrypt_openjdk_jni_32 <= external/conscrypt/src/openjdk/native/JNIHelp.cpp
  1111. [ 0% 256/46764] host StaticLib: libssl_static-host (out/host/linux-x86/obj/STATIC_LIBRARIES/libssl_static-host_intermediates/libssl_static-host.a)
  1112. [ 0% 257/46764] host C++: libc++_static_32 <= external/libcxx/src/any.cpp
  1113. [ 0% 258/46764] host C++: libc++_static_32 <= external/libcxx/src/bind.cpp
  1114. [ 0% 259/46764] host C++: libc++_static_32 <= external/libcxx/src/chrono.cpp
  1115. [ 0% 260/46764] host SharedLib: libconscrypt_openjdk_jni (out/host/linux-x86/obj/lib/libconscrypt_openjdk_jni.so)
  1116. [ 0% 261/46764] Install: out/host/linux-x86/lib64/libconscrypt_openjdk_jni.so
  1117. [ 0% 262/46764] host C++: libc++_static_32 <= external/libcxx/src/exception.cpp
  1118. [ 0% 263/46764] host C++: libc++_static_32 <= external/libcxx/src/condition_variable.cpp
  1119. [ 0% 264/46764] host C++: libc++_static_32 <= external/libcxx/src/hash.cpp
  1120. [ 0% 265/46764] host C++: libc++_static_32 <= external/libcxx/src/future.cpp
  1121. [ 0% 266/46764] host C++: libc++_static_32 <= external/libcxx/src/debug.cpp
  1122. [ 0% 267/46764] make Image
  1123. FAILED: /bin/bash -c "(make -j4 -C common O=../out/target/product/kvim2/obj/KERNEL_OBJ ARCH=arm64 CROSS_COMPILE=/opt/toolchains/gcc-linaro-aarch64-linux-gnu-4.9-2014.09_linux/bin/aarch64-linux-gnu- modules Image.gz ) && (: ) && (rm out/target/product/kvim2/obj/t83x -rf ) && (mkdir -p out/target/product/kvim2/obj/t83x ) && (cp hardware/arm/gpu/midgard/r16p0/* out/target/product/kvim2/obj/t83x/ -airf ) && (echo \"make mali module KERNEL_ARCH is arm64 current dir is \$(pwd)\" ) && (echo \"MALI is hardware/arm/gpu/midgard/r16p0, MALI_OUT is out/target/product/kvim2/obj/t83x\" ) && (echo \"GPU_DRV_VERSION is r16p0\" ) && (make -j4 -C \$(pwd)/out/target/product/kvim2/obj/KERNEL_OBJ M=\$(pwd)/out/target/product/kvim2/obj/t83x/kernel/drivers/gpu/arm/midgard ARCH=arm64 CROSS_COMPILE=/opt/toolchains/gcc-linaro-aarch64-linux-gnu-4.9-2014.09_linux/bin/aarch64-linux-gnu- EXTRA_CFLAGS=\"-DCONFIG_MALI_PLATFORM_DEVICETREE -DCONFIG_MALI_MIDGARD_DVFS -DCONFIG_MALI_BACKEND=gpu\" CONFIG_MALI_MIDGARD=m CONFIG_MALI_PLATFORM_DEVICETREE=y CONFIG_MALI_MIDGARD_DVFS=y CONFIG_MALI_BACKEND=gpu modules ) && (mkdir -p out/target/product/kvim2/system/lib ) && (cp out/target/product/kvim2/obj/t83x/kernel/drivers/gpu/arm/midgard/mali_kbase.ko out/target/product/kvim2/system/lib/mali.ko ) && (echo \"make mali module finished current dir is \$(pwd)\" ) && (make -j4 CROSS_COMPILE=/opt/toolchains/gcc-linaro-aarch64-linux-gnu-4.9-2014.09_linux/bin/aarch64-linux-gnu- -f device/khadas/common/wifi_driver.mk multiwifi ) && (mkdir -p out/target/product/kvim2/root/boot ) && (mkdir -p out/target/product/kvim2/system/lib ) && (cp out/target/product/kvim2/obj/KERNEL_OBJ/drivers/usb/dwc3/dwc3.ko out/target/product/kvim2/system/lib/ ; true ) && (cp out/target/product/kvim2/obj/KERNEL_OBJ/drivers/amlogic/usb/dwc_otg/310/dwc_otg.ko out/target/product/kvim2/system/lib/ ; true )"
  1124. make: Entering directory '/home/d00268009/opensource/other/vim2-android/common'
  1125. KBUILD_CFLAGS_MODULE:-DMODULE
  1126. KBUILD_CFLAGS_MODULE:-DMODULE
  1127. GEN /home/d00268009/opensource/other/vim2-android/out/target/product/kvim2/obj/KERNEL_OBJ/Makefile
  1128. scripts/kconfig/conf --silentoldconfig Kconfig
  1129. KBUILD_CFLAGS_MODULE:-DMODULE
  1130. GEN /home/d00268009/opensource/other/vim2-android/out/target/product/kvim2/obj/KERNEL_OBJ/Makefile
  1131. CHK include/generated/uapi/linux/version.h
  1132. /home/d00268009/opensource/other/vim2-android/common/kernel/Makefile:146: *** No X.509 certificates found ***
  1133. Using /home/d00268009/opensource/other/vim2-android/common as source for kernel
  1134. CHK include/generated/utsrelease.h
  1135. CALL /home/d00268009/opensource/other/vim2-android/common/scripts/checksyscalls.sh
  1136. <stdin>:1232:2: warning: #warning syscall renameat2 not implemented [-Wcpp]
  1137. CHK include/generated/compile.h
  1138. /home/d00268009/opensource/other/vim2-android/common/kernel/Makefile:146: *** No X.509 certificates found ***
  1139. BC kernel/timeconst.h
  1140. /bin/sh: bc: command not found
  1141. /home/d00268009/opensource/other/vim2-android/common/kernel/Makefile:124: recipe for target 'kernel/timeconst.h' failed
  1142. make[2]: *** [kernel/timeconst.h] Error 127
  1143. /home/d00268009/opensource/other/vim2-android/common/Makefile:857: recipe for target 'kernel' failed
  1144. make[1]: *** [kernel] Error 2
  1145. make[1]: *** Waiting for unfinished jobs....
  1146. Makefile:133: recipe for target 'sub-make' failed
  1147. make: *** [sub-make] Error 2
  1148. make: Leaving directory '/home/d00268009/opensource/other/vim2-android/common'
  1149. [ 0% 267/46764] host C++: libc++_static_32 <= external/libcxx/src/memory.cpp
  1150. [ 0% 267/46764] host C++: libc++_static_32 <= external/libcxx/src/mutex.cpp
  1151. [ 0% 267/46764] host C++: libc++_static_32 <= external/libcxx/src/iostream.cpp
  1152. [ 0% 267/46764] host C++: libc++_static_32 <= external/libcxx/src/algorithm.cpp
  1153. [ 0% 267/46764] host C++: libc++_static_32 <= external/libcxx/src/ios.cpp
  1154. [ 0% 267/46764] host C++: libconscrypt_openjdk_jni_32 <= external/conscrypt/src/main/native/org_conscrypt_NativeCrypto.cpp
  1155. [ 0% 267/46764] host C++: libc++_static_32 <= external/libcxx/src/locale.cpp
  1156. ninja: build stopped: subcommand failed.
  1157. build/core/ninja.mk:148: recipe for target 'ninja_wrapper' failed
  1158. make: *** [ninja_wrapper] Error 1
  1159.  
  1160. #### make failed to build some targets (01:42 (mm:ss)) ####
RAW Paste Data