SHARE
TWEET

Untitled

a guest Jul 21st, 2019 69 Never
Not a member of Pastebin yet? Sign Up, it unlocks many cool features!
  1. Traceback (most recent call last):
  2.   File "/home/nihi1ist/Разработка/src/firefox/68.0.1/firefox-68.0.1/configure.py", line 16, in <module>
  3.     sys.path.insert(0, os.path.join(base_dir, 'python', 'mozbuild'))
  4.   File "/usr/lib/python2.7/posixpath.py", line 73, in join
  5.     path += '/' + b
  6. UnicodeDecodeError: 'ascii' codec can't decode byte 0xd0 in position 15: ordinal not in range(128)
  7. make[2]: *** [debian/rules:236: stamps/configure-browser] Ошибка 1
  8. make[2]: выход из каталога «/home/nihi1ist/Разработка/src/firefox/68.0.1/firefox-68.0.1»
  9. make[1]: *** [debian/rules:353: build-arch] Ошибка 2
  10. make[1]: выход из каталога «/home/nihi1ist/Разработка/src/firefox/68.0.1/firefox-68.0.1»
  11. make: *** [debian/rules:353: build] Ошибка 2
RAW Paste Data
We use cookies for various purposes including analytics. By continuing to use Pastebin, you agree to our use of cookies as described in the Cookies Policy. OK, I Understand
 
Top