Guest User

Untitled

a guest
Oct 31st, 2017
146
Never
Not a member of Pastebin yet? Sign Up, it unlocks many cool features!
  1. /home/ubuntu/Desktop/rockbox/firmware/target/arm/as3525/sd-as3525.c:25:2: error: invalid preprocessing directive #include1003
  2. In file included from /home/ubuntu/Desktop/rockbox/firmware/target/arm/as3525/sd-as3525.c:28:
  3. /home/ubuntu/Desktop/rockbox/firmware/export/sdmmc.h:44:6: warning: "CONFIG_STORAGE" is not defined
  4. /home/ubuntu/Desktop/rockbox/firmware/export/sdmmc.h:44:23: warning: "STORAGE_MMC" is not defined
  5. /home/ubuntu/Desktop/rockbox/firmware/export/sdmmc.h:48:6: warning: "CONFIG_STORAGE" is not defined
  6. /home/ubuntu/Desktop/rockbox/firmware/export/sdmmc.h:48:23: warning: "STORAGE_SD" is not defined
  7. /home/ubuntu/Desktop/rockbox/firmware/export/sdmmc.h:53:6: warning: "CONFIG_STORAGE" is not defined
  8. /home/ubuntu/Desktop/rockbox/firmware/export/sdmmc.h:53:23: warning: "STORAGE_SD" is not defined
  9. /home/ubuntu/Desktop/rockbox/firmware/target/arm/as3525/sd-as3525.c: In function ‘sd_init_card’:
  10. /home/ubuntu/Desktop/rockbox/firmware/target/arm/as3525/sd-as3525.c:414: warning: implicit declaration of function ‘sd_parse_csd’
  11. /home/ubuntu/Desktop/rockbox/firmware/target/arm/as3525/sd-as3525.c: In function ‘sd_select_bank’:
  12. /home/ubuntu/Desktop/rockbox/firmware/target/arm/as3525/sd-as3525.c:643: error: ‘tCardInfo’ has no member named ‘current_bank’
  13. /home/ubuntu/Desktop/rockbox/firmware/target/arm/as3525/sd-as3525.c: In function ‘sd_transfer_sectors’:
  14. /home/ubuntu/Desktop/rockbox/firmware/target/arm/as3525/sd-as3525.c:718: error: ‘tCardInfo’ has no member named ‘current_bank’
  15. make: *** [/home/ubuntu/Desktop/rockbox/build_Bilgus_new/firmware/target/arm/as3525/sd-as3525.o] Error 1
  16. make: *** Waiting for unfinished jobs....
RAW Paste Data