Guest User

Untitled

a guest
Jul 16th, 2021
96
Never
Not a member of Pastebin yet? Sign Up, it unlocks many cool features!
  1. gsys /home/mkga # emerge virtualbox
  2.  
  3. * IMPORTANT: 3 news items need reading for repository 'gentoo'.
  4. * Use eselect news read to view new items.
  5.  
  6.  
  7. * IMPORTANT: 4 config files in '/etc/portage' need updating.
  8. * See the CONFIGURATION FILES and CONFIGURATION FILES UPDATE TOOLS
  9. * sections of the emerge man page to learn how to update config files.
  10. Calculating dependencies... done!
  11.  
  12. >>> Verifying ebuild manifests
  13.  
  14. >>> Running pre-merge checks for app-emulation/virtualbox-6.1.22
  15. * You have disabled the "python" USE flag. This will only
  16. * disable the python bindings being installed.
  17.  
  18. >>> Emerging (1 of 3) app-emulation/virtualbox-modules-6.1.22::gentoo
  19. * vbox-kernel-module-src-6.1.22.tar.xz BLAKE2B SHA512 size ;-) ...
  20. * Determining the location of the kernel source code
  21. * Found kernel source directory:
  22. * /usr/src/linux
  23. * Found sources for kernel version:
  24. * 5.10.27-gentoo-x86_64
  25. * Checking for suitable kernel configuration options...
  26. >>> Unpacking source...
  27. >>> Unpacking vbox-kernel-module-src-6.1.22.tar.xz to /var/tmp/portage/app-emulation/virtualbox-modules-6.
  28. >>> Source unpacked in /var/tmp/portage/app-emulation/virtualbox-modules-6.1.22/work
  29. >>> Preparing source in /var/tmp/portage/app-emulation/virtualbox-modules-6.1.22/work ...
  30. >>> Source prepared.
  31. >>> Configuring source in /var/tmp/portage/app-emulation/virtualbox-modules-6.1.22/work ...
  32. >>> Source configured.
  33. >>> Compiling source in /var/tmp/portage/app-emulation/virtualbox-modules-6.1.22/work ...
  34. ln: failed to create symbolic link 'Module.symvers': File exists
  35. * Preparing vboxdrv module
  36. make -j6 HOSTCC=x86_64-pc-linux-gnu-gcc CROSS_COMPILE=x86_64-pc-linux-gnu- 'LDFLAGS=-m elf_x86_64' CC=x86_BOSE=1 all
  37. === Building 'vboxdrv' module ===
  38. make[1]: Entering directory '/var/tmp/portage/app-emulation/virtualbox-modules-6.1.22/work/vboxdrv'
  39. make V=1 CONFIG_MODULE_SIG= CONFIG_MODULE_SIG_ALL= -C /usr/src/linux M=/var/tmp/portage/app-emulation/virtboxdrv -j8 modules
  40. make[2]: Entering directory '/var/tmp/portage/app-emulation/virtualbox-modules-6.1.22/work/vboxdrv'
  41. make[2]: warning: -j8 forced in submake: resetting jobserver mode.
  42. test -e include/generated/autoconf.h -a -e include/config/auto.conf || ( \
  43. echo >&2; \
  44. echo >&2 " ERROR: Kernel configuration is invalid."; \
  45. echo >&2 " include/generated/autoconf.h or include/config/auto.conf are missing.";\
  46. echo >&2 " Run 'make oldconfig && make prepare' on kernel src to fix it."; \
  47. echo >&2 ; \
  48. /bin/false)
  49.  
  50. ERROR: Kernel configuration is invalid.
  51. include/generated/autoconf.h or include/config/auto.conf are missing.
  52. Run 'make oldconfig && make prepare' on kernel src to fix it.
  53.  
  54. make[2]: *** [Makefile:719: include/config/auto.conf] Error 1
  55. make[2]: Leaving directory '/usr/src/linux-5.10.27-gentoo'
  56. make[1]: *** [/var/tmp/portage/app-emulation/virtualbox-modules-6.1.22/work/vboxdrv/Makefile-footer.gmk:11
  57. make[1]: Leaving directory '/var/tmp/portage/app-emulation/virtualbox-modules-6.1.22/work/vboxdrv'
  58. make: *** [Makefile:60: vboxdrv] Error 2
  59. * ERROR: app-emulation/virtualbox-modules-6.1.22::gentoo failed (compile phase):
  60. * emake failed
  61. *
  62. * If you need support, post the output of `emerge --info '=app-emulation/virtualbox-modules-6.1.22::gento
  63. * the complete build log and the output of `emerge -pqv '=app-emulation/virtualbox-modules-6.1.22::gentoo
  64. * The complete build log is located at '/var/tmp/portage/app-emulation/virtualbox-modules-6.1.22/temp/bui
  65. * The ebuild environment file is located at '/var/tmp/portage/app-emulation/virtualbox-modules-6.1.22/tem
  66. * Working directory: '/var/tmp/portage/app-emulation/virtualbox-modules-6.1.22/work'
  67. * S: '/var/tmp/portage/app-emulation/virtualbox-modules-6.1.22/work'
  68.  
  69. >>> Failed to emerge app-emulation/virtualbox-modules-6.1.22, Log file:
  70.  
  71. >>> '/var/tmp/portage/app-emulation/virtualbox-modules-6.1.22/temp/build.log'
  72.  
  73. * Messages for package app-emulation/virtualbox-modules-6.1.22:
  74.  
  75. * ERROR: app-emulation/virtualbox-modules-6.1.22::gentoo failed (compile phase):
  76. * emake failed
  77. *
  78. * I
  79.  
RAW Paste Data