Advertisement
Guest User

Untitled

a guest
Jun 3rd, 2019
103
0
Never
Not a member of Pastebin yet? Sign Up, it unlocks many cool features!
text 21.77 KB | None | 0 0
  1. irynah@irynah-Vostro-3560:~/Openmrs-Projects/trunk-5499/openmrs-core$ mvn clean install -e
  2. [INFO] Error stacktraces are turned on.
  3. [INFO] Scanning for projects...
  4. [INFO] ------------------------------------------------------------------------
  5. [INFO] Reactor Build Order:
  6. [INFO]
  7. [INFO] OpenMRS [pom]
  8. [INFO] openmrs-tools [jar]
  9. [INFO] openmrs-test [pom]
  10. [INFO] openmrs-api [jar]
  11. [INFO] openmrs-web [jar]
  12. [INFO] openmrs-webapp [war]
  13. [INFO]
  14. [INFO] ------------------------< org.openmrs:openmrs >-------------------------
  15. [INFO] Building OpenMRS 2.3.0-SNAPSHOT [1/6]
  16. [INFO] --------------------------------[ pom ]---------------------------------
  17. [INFO]
  18. [INFO] --- maven-clean-plugin:2.5:clean (default-clean) @ openmrs ---
  19. [INFO] Deleting /home/irynah/Openmrs-Projects/trunk-5499/openmrs-core/target
  20. [INFO]
  21. [INFO] --- buildnumber-maven-plugin:1.1:create (default) @ openmrs ---
  22. [INFO] Checking for local modifications: skipped.
  23. [INFO] Updating project files from SCM: skipped.
  24. [INFO] ShortRevision tag detected. The value is '6'.
  25. [INFO] Executing: /bin/sh -c cd /home/irynah/Openmrs-Projects/trunk-5499/openmrs-core && git rev-parse --verify --short=6 HEAD
  26. [INFO] Working directory: /home/irynah/Openmrs-Projects/trunk-5499/openmrs-core
  27. [INFO] Storing buildNumber: 1bb271 at timestamp: 1559597417568
  28. [INFO] ShortRevision tag detected. The value is '6'.
  29. [INFO] Executing: /bin/sh -c cd /home/irynah/Openmrs-Projects/trunk-5499/openmrs-core && git rev-parse --verify --short=6 HEAD
  30. [INFO] Working directory: /home/irynah/Openmrs-Projects/trunk-5499/openmrs-core
  31. [INFO] Storing buildScmBranch: trunk
  32. [INFO]
  33. [INFO] --- build-helper-maven-plugin:1.5:parse-version (parse-version) @ openmrs ---
  34. [INFO]
  35. [INFO] --- maven-jar-plugin:2.3.2:test-jar (default) @ openmrs ---
  36. [WARNING] JAR will be empty - no content was marked for inclusion!
  37. [INFO] Building jar: /home/irynah/Openmrs-Projects/trunk-5499/openmrs-core/target/openmrs-2.3.0-SNAPSHOT-tests.jar
  38. [INFO]
  39. [INFO] --- license-maven-plugin:3.0:check (default) @ openmrs ---
  40. [INFO] Checking licenses...
  41. [INFO]
  42. [INFO] --- maven-install-plugin:2.4:install (default-install) @ openmrs ---
  43. [INFO] Installing /home/irynah/Openmrs-Projects/trunk-5499/openmrs-core/pom.xml to /home/irynah/.m2/repository/org/openmrs/openmrs/2.3.0-SNAPSHOT/openmrs-2.3.0-SNAPSHOT.pom
  44. [INFO] Installing /home/irynah/Openmrs-Projects/trunk-5499/openmrs-core/target/openmrs-2.3.0-SNAPSHOT-tests.jar to /home/irynah/.m2/repository/org/openmrs/openmrs/2.3.0-SNAPSHOT/openmrs-2.3.0-SNAPSHOT-tests.jar
  45. [INFO]
  46. [INFO] ------------------< org.openmrs.tools:openmrs-tools >-------------------
  47. [INFO] Building openmrs-tools 2.3.0-SNAPSHOT [2/6]
  48. [INFO] --------------------------------[ jar ]---------------------------------
  49. [INFO]
  50. [INFO] --- maven-clean-plugin:2.5:clean (default-clean) @ openmrs-tools ---
  51. [INFO] Deleting /home/irynah/Openmrs-Projects/trunk-5499/openmrs-core/tools/target
  52. [INFO]
  53. [INFO] --- buildnumber-maven-plugin:1.1:create (default) @ openmrs-tools ---
  54. [INFO]
  55. [INFO] --- build-helper-maven-plugin:1.5:parse-version (parse-version) @ openmrs-tools ---
  56. [INFO]
  57. [INFO] --- maven-resources-plugin:2.4:resources (default-resources) @ openmrs-tools ---
  58. [INFO] Using 'UTF-8' encoding to copy filtered resources.
  59. [INFO] Copying 4 resources
  60. [INFO]
  61. [INFO] --- maven-compiler-plugin:2.1:compile (default-compile) @ openmrs-tools ---
  62. [INFO] Compiling 1 source file to /home/irynah/Openmrs-Projects/trunk-5499/openmrs-core/tools/target/classes
  63. [INFO]
  64. [INFO] --- maven-resources-plugin:2.4:testResources (default-testResources) @ openmrs-tools ---
  65. [INFO] Using 'UTF-8' encoding to copy filtered resources.
  66. [INFO] skip non existing resourceDirectory /home/irynah/Openmrs-Projects/trunk-5499/openmrs-core/tools/src/test/resources
  67. [INFO]
  68. [INFO] --- maven-compiler-plugin:2.1:testCompile (default-testCompile) @ openmrs-tools ---
  69. [INFO] No sources to compile
  70. [INFO]
  71. [INFO] --- maven-surefire-plugin:2.18.1:test (default-test) @ openmrs-tools ---
  72. [INFO] No tests to run.
  73. [INFO]
  74. [INFO] --- maven-jar-plugin:2.3.2:jar (default-jar) @ openmrs-tools ---
  75. [INFO] Building jar: /home/irynah/Openmrs-Projects/trunk-5499/openmrs-core/tools/target/openmrs-tools-2.3.0-SNAPSHOT.jar
  76. [INFO]
  77. [INFO] --- maven-jar-plugin:2.3.2:test-jar (default) @ openmrs-tools ---
  78. [WARNING] JAR will be empty - no content was marked for inclusion!
  79. [INFO] Building jar: /home/irynah/Openmrs-Projects/trunk-5499/openmrs-core/tools/target/openmrs-tools-2.3.0-SNAPSHOT-tests.jar
  80. [INFO]
  81. [INFO] --- license-maven-plugin:3.0:check (default) @ openmrs-tools ---
  82. [INFO] Checking licenses...
  83. [INFO]
  84. [INFO] --- maven-install-plugin:2.4:install (default-install) @ openmrs-tools ---
  85. [INFO] Installing /home/irynah/Openmrs-Projects/trunk-5499/openmrs-core/tools/target/openmrs-tools-2.3.0-SNAPSHOT.jar to /home/irynah/.m2/repository/org/openmrs/tools/openmrs-tools/2.3.0-SNAPSHOT/openmrs-tools-2.3.0-SNAPSHOT.jar
  86. [INFO] Installing /home/irynah/Openmrs-Projects/trunk-5499/openmrs-core/tools/pom.xml to /home/irynah/.m2/repository/org/openmrs/tools/openmrs-tools/2.3.0-SNAPSHOT/openmrs-tools-2.3.0-SNAPSHOT.pom
  87. [INFO] Installing /home/irynah/Openmrs-Projects/trunk-5499/openmrs-core/tools/target/openmrs-tools-2.3.0-SNAPSHOT-tests.jar to /home/irynah/.m2/repository/org/openmrs/tools/openmrs-tools/2.3.0-SNAPSHOT/openmrs-tools-2.3.0-SNAPSHOT-tests.jar
  88. [INFO]
  89. [INFO] -------------------< org.openmrs.test:openmrs-test >--------------------
  90. [INFO] Building openmrs-test 2.3.0-SNAPSHOT [3/6]
  91. [INFO] --------------------------------[ pom ]---------------------------------
  92. [INFO]
  93. [INFO] --- maven-clean-plugin:2.5:clean (default-clean) @ openmrs-test ---
  94. [INFO] Deleting /home/irynah/Openmrs-Projects/trunk-5499/openmrs-core/test/target
  95. [INFO]
  96. [INFO] --- buildnumber-maven-plugin:1.1:create (default) @ openmrs-test ---
  97. [INFO]
  98. [INFO] --- build-helper-maven-plugin:1.5:parse-version (parse-version) @ openmrs-test ---
  99. [INFO]
  100. [INFO] --- maven-jar-plugin:2.3.2:test-jar (default) @ openmrs-test ---
  101. [WARNING] JAR will be empty - no content was marked for inclusion!
  102. [INFO] Building jar: /home/irynah/Openmrs-Projects/trunk-5499/openmrs-core/test/target/openmrs-test-2.3.0-SNAPSHOT-tests.jar
  103. [INFO]
  104. [INFO] --- license-maven-plugin:3.0:check (default) @ openmrs-test ---
  105. [INFO] Checking licenses...
  106. [INFO]
  107. [INFO] --- maven-install-plugin:2.4:install (default-install) @ openmrs-test ---
  108. [INFO] Installing /home/irynah/Openmrs-Projects/trunk-5499/openmrs-core/test/pom.xml to /home/irynah/.m2/repository/org/openmrs/test/openmrs-test/2.3.0-SNAPSHOT/openmrs-test-2.3.0-SNAPSHOT.pom
  109. [INFO] Installing /home/irynah/Openmrs-Projects/trunk-5499/openmrs-core/test/target/openmrs-test-2.3.0-SNAPSHOT-tests.jar to /home/irynah/.m2/repository/org/openmrs/test/openmrs-test/2.3.0-SNAPSHOT/openmrs-test-2.3.0-SNAPSHOT-tests.jar
  110. [INFO]
  111. [INFO] --------------------< org.openmrs.api:openmrs-api >---------------------
  112. [INFO] Building openmrs-api 2.3.0-SNAPSHOT [4/6]
  113. [INFO] --------------------------------[ jar ]---------------------------------
  114. [WARNING] The artifact org.hibernate:hibernate-validator:jar:6.0.16.Final has been relocated to org.hibernate.validator:hibernate-validator:jar:6.0.16.Final
  115. [INFO]
  116. [INFO] --- maven-clean-plugin:2.5:clean (default-clean) @ openmrs-api ---
  117. [INFO] Deleting /home/irynah/Openmrs-Projects/trunk-5499/openmrs-core/api/target
  118. [INFO]
  119. [INFO] --- buildnumber-maven-plugin:1.1:create (default) @ openmrs-api ---
  120. [INFO]
  121. [INFO] --- build-helper-maven-plugin:1.5:parse-version (parse-version) @ openmrs-api ---
  122. [INFO]
  123. [INFO] --- jacoco-maven-plugin:0.8.0:prepare-agent (prepare-agent) @ openmrs-api ---
  124. [INFO] argLine set to -javaagent:/home/irynah/.m2/repository/org/jacoco/org.jacoco.agent/0.8.0/org.jacoco.agent-0.8.0-runtime.jar=destfile=/home/irynah/Openmrs-Projects/trunk-5499/openmrs-core/api/target/jacoco.exec,includes=org/openmrs/** -Duser.language=en -Duser.region=US -Xmx2g
  125. [INFO]
  126. [INFO] --- maven-java-formatter-plugin:0.3:format (default) @ openmrs-api ---
  127. [INFO] Using 'UTF-8' encoding to format source files.
  128. [INFO] Number of files to be formatted: 1030
  129. [INFO] Successfully formatted: 0 file(s)
  130. [INFO] Fail to format : 0 file(s)
  131. [INFO] Skipped : 1030 file(s)
  132. [INFO] Approximate time taken: 4s
  133. [INFO]
  134. [INFO] --- maven-resources-plugin:2.4:resources (default-resources) @ openmrs-api ---
  135. [INFO] Using 'UTF-8' encoding to copy filtered resources.
  136. [INFO] Copying 1 resource
  137. [INFO] Copying 133 resources
  138. [INFO]
  139. [INFO] --- maven-compiler-plugin:2.1:compile (default-compile) @ openmrs-api ---
  140. [INFO] Compiling 696 source files to /home/irynah/Openmrs-Projects/trunk-5499/openmrs-core/api/target/classes
  141. [INFO] -------------------------------------------------------------
  142. [ERROR] COMPILATION ERROR :
  143. [INFO] -------------------------------------------------------------
  144. [ERROR] /home/irynah/Openmrs-Projects/trunk-5499/openmrs-core/api/src/main/java/org/openmrs/api/db/hibernate/search/TermsFilterFactory.java:[26,39] error: cannot find symbol
  145.  
  146. [ERROR] package org.hibernate.search.filter.impl
  147. /home/irynah/Openmrs-Projects/trunk-5499/openmrs-core/api/src/main/java/org/openmrs/api/db/hibernate/search/TermsFilterFactory.java:[75,13] error: cannot find symbol
  148.  
  149. [ERROR] class TermsFilterFactory
  150. /home/irynah/Openmrs-Projects/trunk-5499/openmrs-core/api/src/main/java/org/openmrs/api/db/hibernate/search/LuceneQuery.java:[302,7] error: cannot access QueryImplementor
  151.  
  152. [ERROR] class file for org.hibernate.query.spi.QueryImplementor not found
  153. /home/irynah/Openmrs-Projects/trunk-5499/openmrs-core/api/src/main/java/org/openmrs/api/db/hibernate/search/LuceneQuery.java:[303,34] error: cannot find symbol
  154.  
  155. [ERROR] variable query of type FullTextQuery
  156. /home/irynah/Openmrs-Projects/trunk-5499/openmrs-core/api/src/main/java/org/openmrs/api/db/hibernate/search/LuceneQuery.java:[338,29] error: cannot find symbol
  157.  
  158. [ERROR] interface FullTextQuery
  159. /home/irynah/Openmrs-Projects/trunk-5499/openmrs-core/api/src/main/java/org/openmrs/api/db/hibernate/search/LuceneQuery.java:[350,29] error: cannot find symbol
  160.  
  161. [ERROR] interface FullTextQuery
  162. /home/irynah/Openmrs-Projects/trunk-5499/openmrs-core/api/src/main/java/org/openmrs/api/db/hibernate/search/LuceneQuery.java:[365,30] error: cannot find symbol
  163.  
  164. [ERROR] variable fullTextQuery of type FullTextQuery
  165. /home/irynah/Openmrs-Projects/trunk-5499/openmrs-core/api/src/main/java/org/openmrs/api/db/hibernate/search/LuceneQuery.java:[392,37] error: cannot find symbol
  166.  
  167. [ERROR] variable fullTextQuery of type FullTextQuery
  168. /home/irynah/Openmrs-Projects/trunk-5499/openmrs-core/api/src/main/java/org/openmrs/api/db/hibernate/search/LuceneQuery.java:[408,37] error: cannot find symbol
  169.  
  170. [ERROR] variable fullTextQuery of type FullTextQuery
  171. /home/irynah/Openmrs-Projects/trunk-5499/openmrs-core/api/src/main/java/org/openmrs/api/db/hibernate/HibernateAdministrationDAO.java:[192,49] error: cannot find symbol
  172.  
  173. [ERROR] variable configuration of type Configuration
  174. /home/irynah/Openmrs-Projects/trunk-5499/openmrs-core/api/src/main/java/org/openmrs/api/db/hibernate/NativeIfNotAssignedIdentityGenerator.java:[36,7] error: NativeIfNotAssignedIdentityGenerator is not abstract and does not override abstract method configure(Type,Properties,ServiceRegistry) in Configurable
  175.  
  176. [ERROR] /home/irynah/Openmrs-Projects/trunk-5499/openmrs-core/api/src/main/java/org/openmrs/api/db/hibernate/NativeIfNotAssignedIdentityGenerator.java:[56,1] error: method does not override or implement a method from a supertype
  177.  
  178. [ERROR] /home/irynah/Openmrs-Projects/trunk-5499/openmrs-core/api/src/main/java/org/openmrs/api/db/hibernate/DbSession.java:[304,27] error: incompatible types: void cannot be converted to Connection
  179.  
  180. [ERROR] /home/irynah/Openmrs-Projects/trunk-5499/openmrs-core/api/src/main/java/org/openmrs/api/db/hibernate/HibernateContextDAO.java:[472,31] error: reference to getFlushMode is ambiguous
  181.  
  182. [ERROR] both method getFlushMode() in EntityManager and method getFlushMode() in Session match
  183. /home/irynah/Openmrs-Projects/trunk-5499/openmrs-core/api/src/main/java/org/openmrs/api/db/hibernate/HibernateContextDAO.java:[472,44] error: incompatible types: FlushModeType cannot be converted to FlushMode
  184.  
  185. [INFO] 15 errors
  186. [INFO] -------------------------------------------------------------
  187. [INFO] ------------------------------------------------------------------------
  188. [INFO] Reactor Summary for OpenMRS 2.3.0-SNAPSHOT:
  189. [INFO]
  190. [INFO] OpenMRS ............................................ SUCCESS [ 2.510 s]
  191. [INFO] openmrs-tools ...................................... SUCCESS [ 1.126 s]
  192. [INFO] openmrs-test ....................................... SUCCESS [ 0.150 s]
  193. [INFO] openmrs-api ........................................ FAILURE [ 13.408 s]
  194. [INFO] openmrs-web ........................................ SKIPPED
  195. [INFO] openmrs-webapp ..................................... SKIPPED
  196. [INFO] ------------------------------------------------------------------------
  197. [INFO] BUILD FAILURE
  198. [INFO] ------------------------------------------------------------------------
  199. [INFO] Total time: 17.665 s
  200. [INFO] Finished at: 2019-06-04T00:30:33+03:00
  201. [INFO] ------------------------------------------------------------------------
  202. [ERROR] Failed to execute goal org.apache.maven.plugins:maven-compiler-plugin:2.1:compile (default-compile) on project openmrs-api: Compilation failure: Compilation failure:
  203. [ERROR] /home/irynah/Openmrs-Projects/trunk-5499/openmrs-core/api/src/main/java/org/openmrs/api/db/hibernate/search/TermsFilterFactory.java:[26,39] error: cannot find symbol
  204. [ERROR]
  205. [ERROR] package org.hibernate.search.filter.impl
  206. [ERROR] /home/irynah/Openmrs-Projects/trunk-5499/openmrs-core/api/src/main/java/org/openmrs/api/db/hibernate/search/TermsFilterFactory.java:[75,13] error: cannot find symbol
  207. [ERROR]
  208. [ERROR] class TermsFilterFactory
  209. [ERROR] /home/irynah/Openmrs-Projects/trunk-5499/openmrs-core/api/src/main/java/org/openmrs/api/db/hibernate/search/LuceneQuery.java:[302,7] error: cannot access QueryImplementor
  210. [ERROR]
  211. [ERROR] class file for org.hibernate.query.spi.QueryImplementor not found
  212. [ERROR] /home/irynah/Openmrs-Projects/trunk-5499/openmrs-core/api/src/main/java/org/openmrs/api/db/hibernate/search/LuceneQuery.java:[303,34] error: cannot find symbol
  213. [ERROR]
  214. [ERROR] variable query of type FullTextQuery
  215. [ERROR] /home/irynah/Openmrs-Projects/trunk-5499/openmrs-core/api/src/main/java/org/openmrs/api/db/hibernate/search/LuceneQuery.java:[338,29] error: cannot find symbol
  216. [ERROR]
  217. [ERROR] interface FullTextQuery
  218. [ERROR] /home/irynah/Openmrs-Projects/trunk-5499/openmrs-core/api/src/main/java/org/openmrs/api/db/hibernate/search/LuceneQuery.java:[350,29] error: cannot find symbol
  219. [ERROR]
  220. [ERROR] interface FullTextQuery
  221. [ERROR] /home/irynah/Openmrs-Projects/trunk-5499/openmrs-core/api/src/main/java/org/openmrs/api/db/hibernate/search/LuceneQuery.java:[365,30] error: cannot find symbol
  222. [ERROR]
  223. [ERROR] variable fullTextQuery of type FullTextQuery
  224. [ERROR] /home/irynah/Openmrs-Projects/trunk-5499/openmrs-core/api/src/main/java/org/openmrs/api/db/hibernate/search/LuceneQuery.java:[392,37] error: cannot find symbol
  225. [ERROR]
  226. [ERROR] variable fullTextQuery of type FullTextQuery
  227. [ERROR] /home/irynah/Openmrs-Projects/trunk-5499/openmrs-core/api/src/main/java/org/openmrs/api/db/hibernate/search/LuceneQuery.java:[408,37] error: cannot find symbol
  228. [ERROR]
  229. [ERROR] variable fullTextQuery of type FullTextQuery
  230. [ERROR] /home/irynah/Openmrs-Projects/trunk-5499/openmrs-core/api/src/main/java/org/openmrs/api/db/hibernate/HibernateAdministrationDAO.java:[192,49] error: cannot find symbol
  231. [ERROR]
  232. [ERROR] variable configuration of type Configuration
  233. [ERROR] /home/irynah/Openmrs-Projects/trunk-5499/openmrs-core/api/src/main/java/org/openmrs/api/db/hibernate/NativeIfNotAssignedIdentityGenerator.java:[36,7] error: NativeIfNotAssignedIdentityGenerator is not abstract and does not override abstract method configure(Type,Properties,ServiceRegistry) in Configurable
  234. [ERROR]
  235. [ERROR] /home/irynah/Openmrs-Projects/trunk-5499/openmrs-core/api/src/main/java/org/openmrs/api/db/hibernate/NativeIfNotAssignedIdentityGenerator.java:[56,1] error: method does not override or implement a method from a supertype
  236. [ERROR]
  237. [ERROR] /home/irynah/Openmrs-Projects/trunk-5499/openmrs-core/api/src/main/java/org/openmrs/api/db/hibernate/DbSession.java:[304,27] error: incompatible types: void cannot be converted to Connection
  238. [ERROR]
  239. [ERROR] /home/irynah/Openmrs-Projects/trunk-5499/openmrs-core/api/src/main/java/org/openmrs/api/db/hibernate/HibernateContextDAO.java:[472,31] error: reference to getFlushMode is ambiguous
  240. [ERROR]
  241. [ERROR] both method getFlushMode() in EntityManager and method getFlushMode() in Session match
  242. [ERROR] /home/irynah/Openmrs-Projects/trunk-5499/openmrs-core/api/src/main/java/org/openmrs/api/db/hibernate/HibernateContextDAO.java:[472,44] error: incompatible types: FlushModeType cannot be converted to FlushMode
  243. [ERROR] -> [Help 1]
  244. org.apache.maven.lifecycle.LifecycleExecutionException: Failed to execute goal org.apache.maven.plugins:maven-compiler-plugin:2.1:compile (default-compile) on project openmrs-api: Compilation failure
  245. at org.apache.maven.lifecycle.internal.MojoExecutor.execute (MojoExecutor.java:215)
  246. at org.apache.maven.lifecycle.internal.MojoExecutor.execute (MojoExecutor.java:156)
  247. at org.apache.maven.lifecycle.internal.MojoExecutor.execute (MojoExecutor.java:148)
  248. at org.apache.maven.lifecycle.internal.LifecycleModuleBuilder.buildProject (LifecycleModuleBuilder.java:117)
  249. at org.apache.maven.lifecycle.internal.LifecycleModuleBuilder.buildProject (LifecycleModuleBuilder.java:81)
  250. at org.apache.maven.lifecycle.internal.builder.singlethreaded.SingleThreadedBuilder.build (SingleThreadedBuilder.java:56)
  251. at org.apache.maven.lifecycle.internal.LifecycleStarter.execute (LifecycleStarter.java:128)
  252. at org.apache.maven.DefaultMaven.doExecute (DefaultMaven.java:305)
  253. at org.apache.maven.DefaultMaven.doExecute (DefaultMaven.java:192)
  254. at org.apache.maven.DefaultMaven.execute (DefaultMaven.java:105)
  255. at org.apache.maven.cli.MavenCli.execute (MavenCli.java:956)
  256. at org.apache.maven.cli.MavenCli.doMain (MavenCli.java:288)
  257. at org.apache.maven.cli.MavenCli.main (MavenCli.java:192)
  258. at sun.reflect.NativeMethodAccessorImpl.invoke0 (Native Method)
  259. at sun.reflect.NativeMethodAccessorImpl.invoke (NativeMethodAccessorImpl.java:62)
  260. at sun.reflect.DelegatingMethodAccessorImpl.invoke (DelegatingMethodAccessorImpl.java:43)
  261. at java.lang.reflect.Method.invoke (Method.java:498)
  262. at org.codehaus.plexus.classworlds.launcher.Launcher.launchEnhanced (Launcher.java:289)
  263. at org.codehaus.plexus.classworlds.launcher.Launcher.launch (Launcher.java:229)
  264. at org.codehaus.plexus.classworlds.launcher.Launcher.mainWithExitCode (Launcher.java:415)
  265. at org.codehaus.plexus.classworlds.launcher.Launcher.main (Launcher.java:356)
  266. Caused by: org.apache.maven.plugin.CompilationFailureException: Compilation failure
  267. at org.apache.maven.plugin.AbstractCompilerMojo.execute (AbstractCompilerMojo.java:613)
  268. at org.apache.maven.plugin.CompilerMojo.execute (CompilerMojo.java:116)
  269. at org.apache.maven.plugin.DefaultBuildPluginManager.executeMojo (DefaultBuildPluginManager.java:137)
  270. at org.apache.maven.lifecycle.internal.MojoExecutor.execute (MojoExecutor.java:210)
  271. at org.apache.maven.lifecycle.internal.MojoExecutor.execute (MojoExecutor.java:156)
  272. at org.apache.maven.lifecycle.internal.MojoExecutor.execute (MojoExecutor.java:148)
  273. at org.apache.maven.lifecycle.internal.LifecycleModuleBuilder.buildProject (LifecycleModuleBuilder.java:117)
  274. at org.apache.maven.lifecycle.internal.LifecycleModuleBuilder.buildProject (LifecycleModuleBuilder.java:81)
  275. at org.apache.maven.lifecycle.internal.builder.singlethreaded.SingleThreadedBuilder.build (SingleThreadedBuilder.java:56)
  276. at org.apache.maven.lifecycle.internal.LifecycleStarter.execute (LifecycleStarter.java:128)
  277. at org.apache.maven.DefaultMaven.doExecute (DefaultMaven.java:305)
  278. at org.apache.maven.DefaultMaven.doExecute (DefaultMaven.java:192)
  279. at org.apache.maven.DefaultMaven.execute (DefaultMaven.java:105)
  280. at org.apache.maven.cli.MavenCli.execute (MavenCli.java:956)
  281. at org.apache.maven.cli.MavenCli.doMain (MavenCli.java:288)
  282. at org.apache.maven.cli.MavenCli.main (MavenCli.java:192)
  283. at sun.reflect.NativeMethodAccessorImpl.invoke0 (Native Method)
  284. at sun.reflect.NativeMethodAccessorImpl.invoke (NativeMethodAccessorImpl.java:62)
  285. at sun.reflect.DelegatingMethodAccessorImpl.invoke (DelegatingMethodAccessorImpl.java:43)
  286. at java.lang.reflect.Method.invoke (Method.java:498)
  287. at org.codehaus.plexus.classworlds.launcher.Launcher.launchEnhanced (Launcher.java:289)
  288. at org.codehaus.plexus.classworlds.launcher.Launcher.launch (Launcher.java:229)
  289. at org.codehaus.plexus.classworlds.launcher.Launcher.mainWithExitCode (Launcher.java:415)
  290. at org.codehaus.plexus.classworlds.launcher.Launcher.main (Launcher.java:356)
  291. [ERROR]
  292. [ERROR] Re-run Maven using the -X switch to enable full debug logging.
  293. [ERROR]
  294. [ERROR] For more information about the errors and possible solutions, please read the following articles:
  295. [ERROR] [Help 1] http://cwiki.apache.org/confluence/display/MAVEN/MojoFailureException
  296. [ERROR]
  297. [ERROR] After correcting the problems, you can resume the build with the command
  298. [ERROR] mvn <goals> -rf :openmrs-api
  299. irynah@irynah-Vostro-3560:~/Openmrs-Projects/trunk-5499/openmrs-core$
Advertisement
Add Comment
Please, Sign In to add comment
Advertisement