Guest User

Untitled

a guest
Feb 27th, 2018
181
Never
Not a member of Pastebin yet? Sign Up, it unlocks many cool features!
  1. DKMS make.log for rt5592sta_linux_patched-dkms-2.6.0.0 for kernel 4.7.1-1-ARCH (x86_64)
  2. Wed 28 Feb 00:29:41 GMT 2018
  3. make -C tools
  4. cp -f os/linux/Makefile.6 /var/lib/dkms/rt5592sta_linux_patched-dkms/2.6.0.0/build/os/linux/Makefile
  5. make[1]: Entering directory '/var/lib/dkms/rt5592sta_linux_patched-dkms/2.6.0.0/build/tools'
  6. gcc -g bin2h.c -o bin2h
  7. make -C /lib/modules/4.7.1-1-ARCH/build SUBDIRS=/var/lib/dkms/rt5592sta_linux_patched-dkms/2.6.0.0/build/os/linux modules
  8. make[1]: Entering directory '/usr/lib/modules/4.7.1-1-ARCH/build'
  9. make[1]: Leaving directory '/var/lib/dkms/rt5592sta_linux_patched-dkms/2.6.0.0/build/tools'
  10. /var/lib/dkms/rt5592sta_linux_patched-dkms/2.6.0.0/build/tools/bin2h
  11. arch/x86/Makefile:133: stack-protector enabled but compiler support broken
  12. Makefile:677: Cannot use CONFIG_CC_STACKPROTECTOR_STRONG: -fstack-protector-strong not supported by compiler
  13.   CC [M]  /var/lib/dkms/rt5592sta_linux_patched-dkms/2.6.0.0/build/os/linux/../../common/crypt_md5.o
  14.   CC [M]  /var/lib/dkms/rt5592sta_linux_patched-dkms/2.6.0.0/build/os/linux/../../common/crypt_sha2.o
  15.   CC [M]  /var/lib/dkms/rt5592sta_linux_patched-dkms/2.6.0.0/build/os/linux/../../common/crypt_hmac.o
  16.   CC [M]  /var/lib/dkms/rt5592sta_linux_patched-dkms/2.6.0.0/build/os/linux/../../common/crypt_aes.o
  17.   CC [M]  /var/lib/dkms/rt5592sta_linux_patched-dkms/2.6.0.0/build/os/linux/../../common/crypt_arc4.o
  18. cc1: error: code model kernel does not support PIC mode
  19. cc1: error: code model kernel does not support PIC mode
  20. make[2]: *** [scripts/Makefile.build:289: /var/lib/dkms/rt5592sta_linux_patched-dkms/2.6.0.0/build/os/linux/../../common/crypt_md5.o] Error 1
  21. make[2]: *** Waiting for unfinished jobs....
  22.   CC [M]  /var/lib/dkms/rt5592sta_linux_patched-dkms/2.6.0.0/build/os/linux/../../common/mlme.o
  23. cc1: error: code model kernel does not support PIC mode
  24. cc1: error: code model kernel does not support PIC mode
  25. cc1: error: code model kernel does not support PIC mode
  26. cc1: error: code model kernel does not support PIC mode
  27. make[2]: *** [scripts/Makefile.build:289: /var/lib/dkms/rt5592sta_linux_patched-dkms/2.6.0.0/build/os/linux/../../common/crypt_sha2.o] Error 1
  28. make[2]: *** [scripts/Makefile.build:289: /var/lib/dkms/rt5592sta_linux_patched-dkms/2.6.0.0/build/os/linux/../../common/crypt_arc4.o] Error 1
  29. make[2]: *** [scripts/Makefile.build:289: /var/lib/dkms/rt5592sta_linux_patched-dkms/2.6.0.0/build/os/linux/../../common/crypt_aes.o] Error 1
  30. make[2]: *** [scripts/Makefile.build:289: /var/lib/dkms/rt5592sta_linux_patched-dkms/2.6.0.0/build/os/linux/../../common/mlme.o] Error 1
  31. make[2]: *** [scripts/Makefile.build:289: /var/lib/dkms/rt5592sta_linux_patched-dkms/2.6.0.0/build/os/linux/../../common/crypt_hmac.o] Error 1
  32. make[1]: *** [Makefile:1457: _module_/var/lib/dkms/rt5592sta_linux_patched-dkms/2.6.0.0/build/os/linux] Error 2
  33. make[1]: Leaving directory '/usr/lib/modules/4.7.1-1-ARCH/build'
  34. make: *** [Makefile:358: LINUX] Error 2
RAW Paste Data