thevipershowita

Untitled

Mar 18th, 2020
772
Never
Not a member of Pastebin yet? Sign Up, it unlocks many cool features!
  1. /Library/Java/JavaVirtualMachines/adoptopenjdk-13.0.2.jdk/Contents/Home/bin/java -Dmaven.multiModuleProjectDirectory=/Users/marco/Documents/IntelliJ/Paper "-Dmaven.home=/Applications/IntelliJ IDEA.app/Contents/plugins/maven/lib/maven3" "-Dclassworlds.conf=/Applications/IntelliJ IDEA.app/Contents/plugins/maven/lib/maven3/bin/m2.conf" "-Dmaven.ext.class.path=/Applications/IntelliJ IDEA.app/Contents/plugins/maven/lib/maven-event-listener.jar" "-javaagent:/Applications/IntelliJ IDEA.app/Contents/lib/idea_rt.jar=53649:/Applications/IntelliJ IDEA.app/Contents/bin" -Dfile.encoding=UTF-8 -classpath "/Applications/IntelliJ IDEA.app/Contents/plugins/maven/lib/maven3/boot/plexus-classworlds-2.6.0.jar" org.codehaus.classworlds.Launcher -Didea.version2019.3.3 package
  2. [INFO] Scanning for projects...
  3. [INFO] ------------------------------------------------------------------------
  4. [INFO] Reactor Build Order:
  5. [INFO]
  6. [INFO] Paper-Parent                                                       [pom]
  7. [INFO] Paper-API                                                          [jar]
  8. [INFO] Paper                                                              [jar]
  9. [INFO]
  10. [INFO] ----------------< com.destroystokyo.paper:paper-parent >----------------
  11. [INFO] Building Paper-Parent dev-SNAPSHOT                                 [1/3]
  12. [INFO] --------------------------------[ pom ]---------------------------------
  13. [INFO]
  14. [INFO] -----------------< com.destroystokyo.paper:paper-api >------------------
  15. [INFO] Building Paper-API 1.15.2-R0.1-SNAPSHOT                            [2/3]
  16. [INFO] --------------------------------[ jar ]---------------------------------
  17. Downloading from md_5-releases: https://repo.md-5.net/content/repositories/releases/net/md-5/bungeecord-chat/1.15-SNAPSHOT/maven-metadata.xml
  18. [WARNING] Could not transfer metadata net.md-5:bungeecord-chat:1.15-SNAPSHOT/maven-metadata.xml from/to md_5-releases (https://repo.md-5.net/content/repositories/releases/): Failed to transfer file https://repo.md-5.net/content/repositories/releases/net/md-5/bungeecord-chat/1.15-SNAPSHOT/maven-metadata.xml with status code 400
  19. [WARNING] Failure to transfer net.md-5:bungeecord-chat:1.15-SNAPSHOT/maven-metadata.xml from https://repo.md-5.net/content/repositories/releases/ was cached in the local repository, resolution will not be reattempted until the update interval of md_5-releases has elapsed or updates are forced. Original error: Could not transfer metadata net.md-5:bungeecord-chat:1.15-SNAPSHOT/maven-metadata.xml from/to md_5-releases (https://repo.md-5.net/content/repositories/releases/): Failed to transfer file https://repo.md-5.net/content/repositories/releases/net/md-5/bungeecord-chat/1.15-SNAPSHOT/maven-metadata.xml with status code 400
  20. Downloading from md_5-releases: https://repo.md-5.net/content/repositories/releases/net/md-5/bungeecord-parent/1.15-SNAPSHOT/maven-metadata.xml
  21. [WARNING] Could not transfer metadata net.md-5:bungeecord-parent:1.15-SNAPSHOT/maven-metadata.xml from/to md_5-releases (https://repo.md-5.net/content/repositories/releases/): Failed to transfer file https://repo.md-5.net/content/repositories/releases/net/md-5/bungeecord-parent/1.15-SNAPSHOT/maven-metadata.xml with status code 400
  22. [INFO]
  23. [INFO] --- maven-resources-plugin:2.6:resources (default-resources) @ paper-api ---
  24. [INFO] Using 'UTF-8' encoding to copy filtered resources.
  25. [INFO] skip non existing resourceDirectory /Users/marco/Documents/IntelliJ/Paper/Paper-API/src/main/resources
  26. [INFO]
  27. [INFO] --- maven-compiler-plugin:3.8.1:compile (default-compile) @ paper-api ---
  28. [INFO] Changes detected - recompiling the module!
  29. [INFO] Compiling 1077 source files to /Users/marco/Documents/IntelliJ/Paper/Paper-API/target/classes
  30. [WARNING] /Users/marco/Documents/IntelliJ/Paper/Paper-API/src/main/java/com/destroystokyo/paper/utils/UnsafeUtils.java:[4,16] sun.misc.Unsafe is internal proprietary API and may be removed in a future release
  31. [WARNING] /Users/marco/Documents/IntelliJ/Paper/Paper-API/src/main/java/com/destroystokyo/paper/utils/UnsafeUtils.java:[11,26] sun.misc.Unsafe is internal proprietary API and may be removed in a future release
  32. [WARNING] /Users/marco/Documents/IntelliJ/Paper/Paper-API/src/main/java/com/destroystokyo/paper/utils/UnsafeUtils.java:[13,9] sun.misc.Unsafe is internal proprietary API and may be removed in a future release
  33. [WARNING] /Users/marco/Documents/IntelliJ/Paper/Paper-API/src/main/java/com/destroystokyo/paper/utils/UnsafeUtils.java:[18,23] sun.misc.Unsafe is internal proprietary API and may be removed in a future release
  34. [WARNING] /Users/marco/Documents/IntelliJ/Paper/Paper-API/src/main/java/com/destroystokyo/paper/utils/UnsafeUtils.java:[32,19] sun.misc.Unsafe is internal proprietary API and may be removed in a future release
  35. [INFO] /Users/marco/Documents/IntelliJ/Paper/Paper-API/src/main/java/org/bukkit/inventory/meta/ItemMeta.java: Some input files use or override a deprecated API.
  36. [INFO] /Users/marco/Documents/IntelliJ/Paper/Paper-API/src/main/java/org/bukkit/inventory/meta/ItemMeta.java: Recompile with -Xlint:deprecation for details.
  37. [INFO] /Users/marco/Documents/IntelliJ/Paper/Paper-API/src/main/java/org/bukkit/Material.java: Some input files use unchecked or unsafe operations.
  38. [INFO] /Users/marco/Documents/IntelliJ/Paper/Paper-API/src/main/java/org/bukkit/Material.java: Recompile with -Xlint:unchecked for details.
  39. [INFO]
  40. [INFO] --- maven-resources-plugin:2.6:testResources (default-testResources) @ paper-api ---
  41. [INFO] Using 'UTF-8' encoding to copy filtered resources.
  42. [INFO] skip non existing resourceDirectory /Users/marco/Documents/IntelliJ/Paper/Paper-API/src/test/resources
  43. [INFO]
  44. [INFO] --- maven-compiler-plugin:3.8.1:testCompile (default-testCompile) @ paper-api ---
  45. [INFO] Changes detected - recompiling the module!
  46. [INFO] Compiling 55 source files to /Users/marco/Documents/IntelliJ/Paper/Paper-API/target/test-classes
  47. [INFO] /Users/marco/Documents/IntelliJ/Paper/Paper-API/src/test/java/org/bukkit/event/PlayerChatTabCompleteEventTest.java: Some input files use or override a deprecated API.
  48. [INFO] /Users/marco/Documents/IntelliJ/Paper/Paper-API/src/test/java/org/bukkit/event/PlayerChatTabCompleteEventTest.java: Recompile with -Xlint:deprecation for details.
  49. [INFO] /Users/marco/Documents/IntelliJ/Paper/Paper-API/src/test/java/org/bukkit/conversations/ConversationContextTest.java: Some input files use unchecked or unsafe operations.
  50. [INFO] /Users/marco/Documents/IntelliJ/Paper/Paper-API/src/test/java/org/bukkit/conversations/ConversationContextTest.java: Recompile with -Xlint:unchecked for details.
  51. [INFO]
  52. [INFO] --- maven-surefire-plugin:2.12.4:test (default-test) @ paper-api ---
  53. [INFO] Surefire report directory: /Users/marco/Documents/IntelliJ/Paper/Paper-API/target/surefire-reports
  54.  
  55. -------------------------------------------------------
  56.  T E S T S
  57. -------------------------------------------------------
  58. Running org.bukkit.NoteTest
  59. Tests run: 17, Failures: 0, Errors: 0, Skipped: 0, Time elapsed: 0.086 sec
  60. Running org.bukkit.configuration.file.YamlConfigurationTest
  61. Tests run: 17, Failures: 0, Errors: 0, Skipped: 0, Time elapsed: 0.144 sec
  62. Running org.bukkit.configuration.MemorySectionTest
  63. Tests run: 44, Failures: 0, Errors: 0, Skipped: 0, Time elapsed: 0.157 sec
  64. Running org.bukkit.configuration.MemoryConfigurationTest
  65. Tests run: 6, Failures: 0, Errors: 0, Skipped: 0, Time elapsed: 0.001 sec
  66. Running org.bukkit.materials.MaterialDataTest
  67. Tests run: 11, Failures: 0, Errors: 0, Skipped: 0, Time elapsed: 0.012 sec
  68. Running org.bukkit.util.StringUtilStartsWithTest
  69. Tests run: 10, Failures: 0, Errors: 0, Skipped: 0, Time elapsed: 0.021 sec
  70. Running org.bukkit.util.io.BukkitObjectStreamTest
  71. Tests run: 6, Failures: 0, Errors: 0, Skipped: 3, Time elapsed: 0.046 sec
  72. Running org.bukkit.util.BoundingBoxTest
  73. Tests run: 10, Failures: 0, Errors: 0, Skipped: 0, Time elapsed: 0.006 sec
  74. Running org.bukkit.util.StringUtilTest
  75. Tests run: 8, Failures: 0, Errors: 0, Skipped: 0, Time elapsed: 0.004 sec
  76. Running org.bukkit.util.VectorTest
  77. Tests run: 12, Failures: 0, Errors: 0, Skipped: 0, Time elapsed: 0.006 sec
  78. Running org.bukkit.CropStateTest
  79. Tests run: 1, Failures: 0, Errors: 0, Skipped: 0, Time elapsed: 0 sec
  80. Running org.bukkit.entity.memory.MemoryKeyTest
  81. Tests run: 6, Failures: 0, Errors: 0, Skipped: 0, Time elapsed: 0.003 sec
  82. Running org.bukkit.GrassSpeciesTest
  83. Tests run: 1, Failures: 0, Errors: 0, Skipped: 0, Time elapsed: 0.002 sec
  84. Running org.bukkit.TreeSpeciesTest
  85. Tests run: 1, Failures: 0, Errors: 0, Skipped: 0, Time elapsed: 0.001 sec
  86. Running org.bukkit.ColorTest
  87. Tests run: 52, Failures: 0, Errors: 0, Skipped: 0, Time elapsed: 0.034 sec
  88. Running org.bukkit.WorldTypeTest
  89. Tests run: 1, Failures: 0, Errors: 0, Skipped: 0, Time elapsed: 0 sec
  90. Running org.bukkit.plugin.TimedRegisteredListenerTest
  91. Tests run: 1, Failures: 0, Errors: 0, Skipped: 0, Time elapsed: 0.002 sec
  92. Running org.bukkit.plugin.messaging.StandardMessengerTest
  93. Tests run: 18, Failures: 0, Errors: 0, Skipped: 0, Time elapsed: 0.247 sec
  94. Running org.bukkit.plugin.PluginManagerTest
  95. mar 18, 2020 3:57:57 PM org.bukkit.Bukkit setServer
  96. INFORMAZIONI: This server is running TestServer version Version_null (Implementing API version BukkitVersion_null)
  97. Tests run: 6, Failures: 0, Errors: 0, Skipped: 0, Time elapsed: 0.076 sec
  98. Running org.bukkit.DyeColorTest
  99. Tests run: 80, Failures: 0, Errors: 0, Skipped: 0, Time elapsed: 0.015 sec
  100. Running org.bukkit.GameModeTest
  101. Tests run: 1, Failures: 0, Errors: 0, Skipped: 0, Time elapsed: 0 sec
  102. Running org.bukkit.MaterialTest
  103. Tests run: 8, Failures: 0, Errors: 0, Skipped: 0, Time elapsed: 0.048 sec
  104. Running org.bukkit.ChatColorTest
  105. Tests run: 10, Failures: 0, Errors: 0, Skipped: 0, Time elapsed: 0.01 sec
  106. Running org.bukkit.CoalTypeTest
  107. Tests run: 1, Failures: 0, Errors: 0, Skipped: 0, Time elapsed: 0 sec
  108. Running org.bukkit.AnnotationTest
  109. Tests run: 1, Failures: 0, Errors: 0, Skipped: 0, Time elapsed: 0.218 sec
  110. Running org.bukkit.DifficultyTest
  111. Tests run: 1, Failures: 0, Errors: 0, Skipped: 0, Time elapsed: 0.001 sec
  112. Running org.bukkit.conversations.ConversationTest
  113. Tests run: 4, Failures: 0, Errors: 0, Skipped: 0, Time elapsed: 0.005 sec
  114. Running org.bukkit.conversations.ValidatingPromptTest
  115. Tests run: 4, Failures: 0, Errors: 0, Skipped: 0, Time elapsed: 0.017 sec
  116. Running org.bukkit.conversations.ConversationContextTest
  117. Tests run: 3, Failures: 0, Errors: 0, Skipped: 0, Time elapsed: 0 sec
  118. Running org.bukkit.LocationTest
  119. Tests run: 90, Failures: 0, Errors: 0, Skipped: 0, Time elapsed: 0.059 sec
  120. Running org.bukkit.BukkitMirrorTest
  121. Tests run: 650, Failures: 0, Errors: 0, Skipped: 0, Time elapsed: 0.113 sec
  122. Running org.bukkit.EffectTest
  123. Tests run: 1, Failures: 0, Errors: 0, Skipped: 0, Time elapsed: 0 sec
  124. Running org.bukkit.InstrumentTest
  125. Tests run: 1, Failures: 0, Errors: 0, Skipped: 0, Time elapsed: 0 sec
  126. Running org.bukkit.ChatPaginatorTest
  127. Tests run: 15, Failures: 0, Errors: 0, Skipped: 0, Time elapsed: 0.001 sec
  128. Running org.bukkit.event.SyntheticEventTest
  129. Tests run: 1, Failures: 0, Errors: 0, Skipped: 0, Time elapsed: 0.048 sec
  130. Running org.bukkit.event.PlayerChatTabCompleteEventTest
  131. Tests run: 1, Failures: 0, Errors: 0, Skipped: 0, Time elapsed: 0 sec
  132. Running org.bukkit.metadata.MetadataStoreTest
  133. Tests run: 9, Failures: 0, Errors: 0, Skipped: 0, Time elapsed: 0.006 sec
  134. Running org.bukkit.metadata.FixedMetadataValueTest
  135. Tests run: 3, Failures: 0, Errors: 0, Skipped: 0, Time elapsed: 0 sec
  136. Running org.bukkit.metadata.LazyMetadataValueTest
  137. Tests run: 8, Failures: 0, Errors: 0, Skipped: 0, Time elapsed: 0.003 sec
  138. Running org.bukkit.metadata.MetadataConversionTest
  139. Tests run: 5, Failures: 0, Errors: 0, Skipped: 0, Time elapsed: 0.001 sec
  140. Running org.bukkit.metadata.MetadataValueAdapterTest
  141. Tests run: 4, Failures: 0, Errors: 0, Skipped: 0, Time elapsed: 0.003 sec
  142. Running org.bukkit.EntityEffectTest
  143. Tests run: 1, Failures: 0, Errors: 0, Skipped: 0, Time elapsed: 0 sec
  144. Running org.bukkit.ArtTest
  145. Tests run: 5, Failures: 0, Errors: 0, Skipped: 0, Time elapsed: 0.001 sec
  146. Running org.bukkit.NamespacedKeyTest
  147. Tests run: 9, Failures: 0, Errors: 0, Skipped: 0, Time elapsed: 0.002 sec
  148. Running com.destroystokyo.paper.MaterialTagsTest
  149. Tests run: 1, Failures: 0, Errors: 0, Skipped: 0, Time elapsed: 0.034 sec
  150.  
  151. Results :
  152.  
  153. Tests run: 1145, Failures: 0, Errors: 0, Skipped: 3
  154.  
  155. [INFO]
  156. [INFO] --- maven-jar-plugin:2.4:jar (default-jar) @ paper-api ---
  157. [INFO] Building jar: /Users/marco/Documents/IntelliJ/Paper/Paper-API/target/paper-api-1.15.2-R0.1-SNAPSHOT.jar
  158. [INFO]
  159. [INFO] --- maven-shade-plugin:3.2.1:shade (default) @ paper-api ---
  160. [INFO] Including commons-lang:commons-lang:jar:2.6 in the shaded jar.
  161. [INFO] Including com.google.code.findbugs:jsr305:jar:1.3.9 in the shaded jar.
  162. [INFO] Including com.googlecode.json-simple:json-simple:jar:1.1.1 in the shaded jar.
  163. [INFO] Including com.google.guava:guava:jar:21.0 in the shaded jar.
  164. [INFO] Including com.google.code.gson:gson:jar:2.8.0 in the shaded jar.
  165. [INFO] Including net.md-5:bungeecord-chat:jar:1.15-SNAPSHOT in the shaded jar.
  166. [INFO] Including org.yaml:snakeyaml:jar:1.25 in the shaded jar.
  167. [INFO] Including org.slf4j:slf4j-api:jar:1.7.25 in the shaded jar.
  168. [INFO] Including org.ow2.asm:asm:jar:7.3.1 in the shaded jar.
  169. [INFO] Including org.ow2.asm:asm-commons:jar:7.3.1 in the shaded jar.
  170. [INFO] Including org.ow2.asm:asm-analysis:jar:7.3.1 in the shaded jar.
  171. [WARNING] Discovered module-info.class. Shading will break its strong encapsulation.
  172. [WARNING] Discovered module-info.class. Shading will break its strong encapsulation.
  173. [WARNING] Discovered module-info.class. Shading will break its strong encapsulation.
  174. [INFO] Attaching shaded artifact.
  175. [INFO]
  176. [INFO] -------------------< com.destroystokyo.paper:paper >--------------------
  177. [INFO] Building Paper 1.15.2-R0.1-SNAPSHOT                                [3/3]
  178. [INFO] --------------------------------[ jar ]---------------------------------
  179. Downloading from md_5-releases: https://repo.md-5.net/content/repositories/releases/org/spigotmc/minecraft-server/1.15.2-SNAPSHOT/maven-metadata.xml
  180. [WARNING] Could not transfer metadata org.spigotmc:minecraft-server:1.15.2-SNAPSHOT/maven-metadata.xml from/to md_5-releases (https://repo.md-5.net/content/repositories/releases/): Failed to transfer file https://repo.md-5.net/content/repositories/releases/org/spigotmc/minecraft-server/1.15.2-SNAPSHOT/maven-metadata.xml with status code 400
  181. [WARNING] Failure to transfer org.spigotmc:minecraft-server:1.15.2-SNAPSHOT/maven-metadata.xml from https://repo.md-5.net/content/repositories/releases/ was cached in the local repository, resolution will not be reattempted until the update interval of md_5-releases has elapsed or updates are forced. Original error: Could not transfer metadata org.spigotmc:minecraft-server:1.15.2-SNAPSHOT/maven-metadata.xml from/to md_5-releases (https://repo.md-5.net/content/repositories/releases/): Failed to transfer file https://repo.md-5.net/content/repositories/releases/org/spigotmc/minecraft-server/1.15.2-SNAPSHOT/maven-metadata.xml with status code 400
  182. [WARNING] Failure to transfer net.md-5:bungeecord-chat:1.15-SNAPSHOT/maven-metadata.xml from https://repo.md-5.net/content/repositories/releases/ was cached in the local repository, resolution will not be reattempted until the update interval of md_5-releases has elapsed or updates are forced. Original error: Could not transfer metadata net.md-5:bungeecord-chat:1.15-SNAPSHOT/maven-metadata.xml from/to md_5-releases (https://repo.md-5.net/content/repositories/releases/): Failed to transfer file https://repo.md-5.net/content/repositories/releases/net/md-5/bungeecord-chat/1.15-SNAPSHOT/maven-metadata.xml with status code 400
  183. [INFO]
  184. [INFO] --- maven-resources-plugin:2.6:resources (default-resources) @ paper ---
  185. [INFO] Using 'UTF-8' encoding to copy filtered resources.
  186. [INFO] Copying 5 resources
  187. [INFO]
  188. [INFO] --- maven-compiler-plugin:3.8.1:compile (default-compile) @ paper ---
  189. [INFO] Nothing to compile - all classes are up to date
  190. [INFO]
  191. [INFO] --- gitdescribe-maven-plugin:1.3:gitdescribe (default) @ paper ---
  192. [INFO] Setting Git Describe: git-Paper-"e1281a14"
  193. [INFO]
  194. [INFO] --- maven-resources-plugin:2.6:testResources (default-testResources) @ paper ---
  195. [INFO] Using 'UTF-8' encoding to copy filtered resources.
  196. [INFO] skip non existing resourceDirectory /Users/marco/Documents/IntelliJ/Paper/Paper-Server/src/test/resources
  197. [INFO]
  198. [INFO] --- maven-compiler-plugin:3.8.1:testCompile (default-testCompile) @ paper ---
  199. [INFO] Nothing to compile - all classes are up to date
  200. [INFO]
  201. [INFO] --- maven-surefire-plugin:2.12.4:test (default-test) @ paper ---
  202. [INFO] Surefire report directory: /Users/marco/Documents/IntelliJ/Paper/Paper-Server/target/surefire-reports
  203.  
  204. -------------------------------------------------------
  205.  T E S T S
  206. -------------------------------------------------------
  207. Running org.bukkit.BiomeTest
  208. 2020-03-18 15:58:07,502 main WARN Advanced terminal features are not available in this environment
  209. [15:58:10 INFO]: Reloading ResourceManager: Default
  210. mar 18, 2020 3:58:11 PM org.bukkit.Bukkit setServer
  211. INFORMAZIONI: This server is running org.bukkit.support.DummyServer version null (Implementing API version 1.15.2-R0.1-SNAPSHOT)
  212. Tests run: 2, Failures: 0, Errors: 0, Skipped: 0, Time elapsed: 10.89 sec
  213. Running org.bukkit.enchantments.EnchantmentTargetTest
  214. Tests run: 1, Failures: 0, Errors: 0, Skipped: 0, Time elapsed: 0.06 sec
  215. Running org.bukkit.StructureTypeTest
  216. Tests run: 3, Failures: 0, Errors: 0, Skipped: 0, Time elapsed: 0.007 sec
  217. Running org.bukkit.entity.memory.CraftMemoryKeyTest
  218. Tests run: 9, Failures: 0, Errors: 0, Skipped: 0, Time elapsed: 0.005 sec
  219. Running org.bukkit.entity.EnderDragonPhaseTest
  220. Tests run: 3, Failures: 0, Errors: 0, Skipped: 0, Time elapsed: 0.432 sec
  221. Running org.bukkit.entity.TropicalFishTest
  222. Tests run: 1, Failures: 0, Errors: 0, Skipped: 0, Time elapsed: 0.011 sec
  223. Running org.bukkit.entity.EntityTypesTest
  224. Tests run: 1, Failures: 0, Errors: 0, Skipped: 0, Time elapsed: 0.005 sec
  225. Running org.bukkit.entity.PandaGeneTest
  226. Tests run: 2, Failures: 0, Errors: 0, Skipped: 0, Time elapsed: 0.011 sec
  227. Running org.bukkit.WorldTypeTest
  228. Tests run: 1, Failures: 0, Errors: 0, Skipped: 0, Time elapsed: 0.003 sec
  229. Running org.bukkit.GameRuleTest
  230. Tests run: 6, Failures: 0, Errors: 0, Skipped: 0, Time elapsed: 0.023 sec
  231. Running org.bukkit.PerMaterialTest
  232. Tests run: 20475, Failures: 0, Errors: 0, Skipped: 0, Time elapsed: 1.688 sec
  233. Running org.bukkit.EnchantmentTest
  234. Tests run: 1, Failures: 0, Errors: 0, Skipped: 0, Time elapsed: 0.001 sec
  235. Running org.bukkit.MaterialTest
  236. Tests run: 1, Failures: 0, Errors: 0, Skipped: 0, Time elapsed: 0.001 sec
  237. Running org.bukkit.SoundTest
  238. Tests run: 4, Failures: 0, Errors: 0, Skipped: 0, Time elapsed: 0.004 sec
  239. Running org.bukkit.map.MapTest
  240. Tests run: 1, Failures: 0, Errors: 0, Skipped: 0, Time elapsed: 0.009 sec
  241. Running org.bukkit.craftbukkit.HeightMapTest
  242. Tests run: 2, Failures: 0, Errors: 0, Skipped: 0, Time elapsed: 0.005 sec
  243. Running org.bukkit.craftbukkit.legacy.LegacyTest
  244. [15:58:14 INFO]: [STDERR]: Initializing Legacy Material Support. Unless you have legacy plugins and/or data this is a bug!
  245. Tests run: 3, Failures: 0, Errors: 0, Skipped: 0, Time elapsed: 2.657 sec
  246. Running org.bukkit.craftbukkit.legacy.EvilTest
  247. Tests run: 3, Failures: 0, Errors: 0, Skipped: 0, Time elapsed: 0.005 sec
  248. Running org.bukkit.craftbukkit.generator.ChunkDataTest
  249. Tests run: 3, Failures: 0, Errors: 0, Skipped: 0, Time elapsed: 0.245 sec
  250. Running org.bukkit.craftbukkit.inventory.ItemMetaImplementationOverrideTest
  251. Tests run: 221, Failures: 0, Errors: 0, Skipped: 0, Time elapsed: 0.038 sec
  252. Running org.bukkit.craftbukkit.inventory.DeprecatedItemMetaCustomValueTest
  253. Tests run: 12, Failures: 0, Errors: 12, Skipped: 0, Time elapsed: 0.022 sec <<< FAILURE!
  254. encapsulatedContainers(org.bukkit.craftbukkit.inventory.DeprecatedItemMetaCustomValueTest)  Time elapsed: 0.007 sec  <<< ERROR!
  255. java.lang.NullPointerException
  256.     at org.bukkit.craftbukkit.inventory.DeprecatedItemMetaCustomValueTest.encapsulatedContainers(DeprecatedItemMetaCustomValueTest.java:186)
  257.     at java.base/jdk.internal.reflect.NativeMethodAccessorImpl.invoke0(Native Method)
  258.     at java.base/jdk.internal.reflect.NativeMethodAccessorImpl.invoke(NativeMethodAccessorImpl.java:62)
  259.     at java.base/jdk.internal.reflect.DelegatingMethodAccessorImpl.invoke(DelegatingMethodAccessorImpl.java:43)
  260.     at java.base/java.lang.reflect.Method.invoke(Method.java:567)
  261.     at org.junit.runners.model.FrameworkMethod$1.runReflectiveCall(FrameworkMethod.java:59)
  262.     at org.junit.internal.runners.model.ReflectiveCallable.run(ReflectiveCallable.java:12)
  263.     at org.junit.runners.model.FrameworkMethod.invokeExplosively(FrameworkMethod.java:56)
  264.     at org.junit.internal.runners.statements.InvokeMethod.evaluate(InvokeMethod.java:17)
  265.     at org.junit.internal.runners.statements.RunBefores.evaluate(RunBefores.java:26)
  266.     at org.junit.runners.ParentRunner$3.evaluate(ParentRunner.java:306)
  267.     at org.junit.runners.BlockJUnit4ClassRunner$1.evaluate(BlockJUnit4ClassRunner.java:100)
  268.     at org.junit.runners.ParentRunner.runLeaf(ParentRunner.java:366)
  269.     at org.junit.runners.BlockJUnit4ClassRunner.runChild(BlockJUnit4ClassRunner.java:103)
  270.     at org.junit.runners.BlockJUnit4ClassRunner.runChild(BlockJUnit4ClassRunner.java:63)
  271.     at org.junit.runners.ParentRunner$4.run(ParentRunner.java:331)
  272.     at org.junit.runners.ParentRunner$1.schedule(ParentRunner.java:79)
  273.     at org.junit.runners.ParentRunner.runChildren(ParentRunner.java:329)
  274.     at org.junit.runners.ParentRunner.access$100(ParentRunner.java:66)
  275.     at org.junit.runners.ParentRunner$2.evaluate(ParentRunner.java:293)
  276.     at org.junit.runners.ParentRunner$3.evaluate(ParentRunner.java:306)
  277.     at org.junit.runners.ParentRunner.run(ParentRunner.java:413)
  278.     at org.apache.maven.surefire.junit4.JUnit4Provider.execute(JUnit4Provider.java:252)
  279.     at org.apache.maven.surefire.junit4.JUnit4Provider.executeTestSet(JUnit4Provider.java:141)
  280.     at org.apache.maven.surefire.junit4.JUnit4Provider.invoke(JUnit4Provider.java:112)
  281.     at java.base/jdk.internal.reflect.NativeMethodAccessorImpl.invoke0(Native Method)
  282.     at java.base/jdk.internal.reflect.NativeMethodAccessorImpl.invoke(NativeMethodAccessorImpl.java:62)
  283.     at java.base/jdk.internal.reflect.DelegatingMethodAccessorImpl.invoke(DelegatingMethodAccessorImpl.java:43)
  284.     at java.base/java.lang.reflect.Method.invoke(Method.java:567)
  285.     at org.apache.maven.surefire.util.ReflectionUtils.invokeMethodWithArray(ReflectionUtils.java:189)
  286.     at org.apache.maven.surefire.booter.ProviderFactory$ProviderProxy.invoke(ProviderFactory.java:165)
  287.     at org.apache.maven.surefire.booter.ProviderFactory.invokeProvider(ProviderFactory.java:85)
  288.     at org.apache.maven.surefire.booter.ForkedBooter.runSuitesInProcess(ForkedBooter.java:115)
  289.     at org.apache.maven.surefire.booter.ForkedBooter.main(ForkedBooter.java:75)
  290.  
  291. testYAMLStoring(org.bukkit.craftbukkit.inventory.DeprecatedItemMetaCustomValueTest)  Time elapsed: 0.002 sec  <<< ERROR!
  292. java.lang.NullPointerException
  293.     at org.bukkit.craftbukkit.inventory.DeprecatedItemMetaCustomValueTest.createComplexItemMeta(DeprecatedItemMetaCustomValueTest.java:153)
  294.     at org.bukkit.craftbukkit.inventory.DeprecatedItemMetaCustomValueTest.testYAMLStoring(DeprecatedItemMetaCustomValueTest.java:113)
  295.     at java.base/jdk.internal.reflect.NativeMethodAccessorImpl.invoke0(Native Method)
  296.     at java.base/jdk.internal.reflect.NativeMethodAccessorImpl.invoke(NativeMethodAccessorImpl.java:62)
  297.     at java.base/jdk.internal.reflect.DelegatingMethodAccessorImpl.invoke(DelegatingMethodAccessorImpl.java:43)
  298.     at java.base/java.lang.reflect.Method.invoke(Method.java:567)
  299.     at org.junit.runners.model.FrameworkMethod$1.runReflectiveCall(FrameworkMethod.java:59)
  300.     at org.junit.internal.runners.model.ReflectiveCallable.run(ReflectiveCallable.java:12)
  301.     at org.junit.runners.model.FrameworkMethod.invokeExplosively(FrameworkMethod.java:56)
  302.     at org.junit.internal.runners.statements.InvokeMethod.evaluate(InvokeMethod.java:17)
  303.     at org.junit.internal.runners.statements.RunBefores.evaluate(RunBefores.java:26)
  304.     at org.junit.runners.ParentRunner$3.evaluate(ParentRunner.java:306)
  305.     at org.junit.runners.BlockJUnit4ClassRunner$1.evaluate(BlockJUnit4ClassRunner.java:100)
  306.     at org.junit.runners.ParentRunner.runLeaf(ParentRunner.java:366)
  307.     at org.junit.runners.BlockJUnit4ClassRunner.runChild(BlockJUnit4ClassRunner.java:103)
  308.     at org.junit.runners.BlockJUnit4ClassRunner.runChild(BlockJUnit4ClassRunner.java:63)
  309.     at org.junit.runners.ParentRunner$4.run(ParentRunner.java:331)
  310.     at org.junit.runners.ParentRunner$1.schedule(ParentRunner.java:79)
  311.     at org.junit.runners.ParentRunner.runChildren(ParentRunner.java:329)
  312.     at org.junit.runners.ParentRunner.access$100(ParentRunner.java:66)
  313.     at org.junit.runners.ParentRunner$2.evaluate(ParentRunner.java:293)
  314.     at org.junit.runners.ParentRunner$3.evaluate(ParentRunner.java:306)
  315.     at org.junit.runners.ParentRunner.run(ParentRunner.java:413)
  316.     at org.apache.maven.surefire.junit4.JUnit4Provider.execute(JUnit4Provider.java:252)
  317.     at org.apache.maven.surefire.junit4.JUnit4Provider.executeTestSet(JUnit4Provider.java:141)
  318.     at org.apache.maven.surefire.junit4.JUnit4Provider.invoke(JUnit4Provider.java:112)
  319.     at java.base/jdk.internal.reflect.NativeMethodAccessorImpl.invoke0(Native Method)
  320.     at java.base/jdk.internal.reflect.NativeMethodAccessorImpl.invoke(NativeMethodAccessorImpl.java:62)
  321.     at java.base/jdk.internal.reflect.DelegatingMethodAccessorImpl.invoke(DelegatingMethodAccessorImpl.java:43)
  322.     at java.base/java.lang.reflect.Method.invoke(Method.java:567)
  323.     at org.apache.maven.surefire.util.ReflectionUtils.invokeMethodWithArray(ReflectionUtils.java:189)
  324.     at org.apache.maven.surefire.booter.ProviderFactory$ProviderProxy.invoke(ProviderFactory.java:165)
  325.     at org.apache.maven.surefire.booter.ProviderFactory.invokeProvider(ProviderFactory.java:85)
  326.     at org.apache.maven.surefire.booter.ForkedBooter.runSuitesInProcess(ForkedBooter.java:115)
  327.     at org.apache.maven.surefire.booter.ForkedBooter.main(ForkedBooter.java:75)
  328.  
  329. storeUUIDOnItemTest(org.bukkit.craftbukkit.inventory.DeprecatedItemMetaCustomValueTest)  Time elapsed: 0 sec  <<< ERROR!
  330. java.lang.NullPointerException
  331.     at org.bukkit.craftbukkit.inventory.DeprecatedItemMetaCustomValueTest.storeUUIDOnItemTest(DeprecatedItemMetaCustomValueTest.java:176)
  332.     at java.base/jdk.internal.reflect.NativeMethodAccessorImpl.invoke0(Native Method)
  333.     at java.base/jdk.internal.reflect.NativeMethodAccessorImpl.invoke(NativeMethodAccessorImpl.java:62)
  334.     at java.base/jdk.internal.reflect.DelegatingMethodAccessorImpl.invoke(DelegatingMethodAccessorImpl.java:43)
  335.     at java.base/java.lang.reflect.Method.invoke(Method.java:567)
  336.     at org.junit.runners.model.FrameworkMethod$1.runReflectiveCall(FrameworkMethod.java:59)
  337.     at org.junit.internal.runners.model.ReflectiveCallable.run(ReflectiveCallable.java:12)
  338.     at org.junit.runners.model.FrameworkMethod.invokeExplosively(FrameworkMethod.java:56)
  339.     at org.junit.internal.runners.statements.InvokeMethod.evaluate(InvokeMethod.java:17)
  340.     at org.junit.internal.runners.statements.RunBefores.evaluate(RunBefores.java:26)
  341.     at org.junit.runners.ParentRunner$3.evaluate(ParentRunner.java:306)
  342.     at org.junit.runners.BlockJUnit4ClassRunner$1.evaluate(BlockJUnit4ClassRunner.java:100)
  343.     at org.junit.runners.ParentRunner.runLeaf(ParentRunner.java:366)
  344.     at org.junit.runners.BlockJUnit4ClassRunner.runChild(BlockJUnit4ClassRunner.java:103)
  345.     at org.junit.runners.BlockJUnit4ClassRunner.runChild(BlockJUnit4ClassRunner.java:63)
  346.     at org.junit.runners.ParentRunner$4.run(ParentRunner.java:331)
  347.     at org.junit.runners.ParentRunner$1.schedule(ParentRunner.java:79)
  348.     at org.junit.runners.ParentRunner.runChildren(ParentRunner.java:329)
  349.     at org.junit.runners.ParentRunner.access$100(ParentRunner.java:66)
  350.     at org.junit.runners.ParentRunner$2.evaluate(ParentRunner.java:293)
  351.     at org.junit.runners.ParentRunner$3.evaluate(ParentRunner.java:306)
  352.     at org.junit.runners.ParentRunner.run(ParentRunner.java:413)
  353.     at org.apache.maven.surefire.junit4.JUnit4Provider.execute(JUnit4Provider.java:252)
  354.     at org.apache.maven.surefire.junit4.JUnit4Provider.executeTestSet(JUnit4Provider.java:141)
  355.     at org.apache.maven.surefire.junit4.JUnit4Provider.invoke(JUnit4Provider.java:112)
  356.     at java.base/jdk.internal.reflect.NativeMethodAccessorImpl.invoke0(Native Method)
  357.     at java.base/jdk.internal.reflect.NativeMethodAccessorImpl.invoke(NativeMethodAccessorImpl.java:62)
  358.     at java.base/jdk.internal.reflect.DelegatingMethodAccessorImpl.invoke(DelegatingMethodAccessorImpl.java:43)
  359.     at java.base/java.lang.reflect.Method.invoke(Method.java:567)
  360.     at org.apache.maven.surefire.util.ReflectionUtils.invokeMethodWithArray(ReflectionUtils.java:189)
  361.     at org.apache.maven.surefire.booter.ProviderFactory$ProviderProxy.invoke(ProviderFactory.java:165)
  362.     at org.apache.maven.surefire.booter.ProviderFactory.invokeProvider(ProviderFactory.java:85)
  363.     at org.apache.maven.surefire.booter.ForkedBooter.runSuitesInProcess(ForkedBooter.java:115)
  364.     at org.apache.maven.surefire.booter.ForkedBooter.main(ForkedBooter.java:75)
  365.  
  366. testPrimitiveCustomTags(org.bukkit.craftbukkit.inventory.DeprecatedItemMetaCustomValueTest)  Time elapsed: 0 sec  <<< ERROR!
  367. java.lang.NullPointerException
  368.     at org.bukkit.craftbukkit.inventory.DeprecatedItemMetaCustomValueTest.testPrimitiveCustomTag(DeprecatedItemMetaCustomValueTest.java:267)
  369.     at org.bukkit.craftbukkit.inventory.DeprecatedItemMetaCustomValueTest.testPrimitiveCustomTags(DeprecatedItemMetaCustomValueTest.java:244)
  370.     at java.base/jdk.internal.reflect.NativeMethodAccessorImpl.invoke0(Native Method)
  371.     at java.base/jdk.internal.reflect.NativeMethodAccessorImpl.invoke(NativeMethodAccessorImpl.java:62)
  372.     at java.base/jdk.internal.reflect.DelegatingMethodAccessorImpl.invoke(DelegatingMethodAccessorImpl.java:43)
  373.     at java.base/java.lang.reflect.Method.invoke(Method.java:567)
  374.     at org.junit.runners.model.FrameworkMethod$1.runReflectiveCall(FrameworkMethod.java:59)
  375.     at org.junit.internal.runners.model.ReflectiveCallable.run(ReflectiveCallable.java:12)
  376.     at org.junit.runners.model.FrameworkMethod.invokeExplosively(FrameworkMethod.java:56)
  377.     at org.junit.internal.runners.statements.InvokeMethod.evaluate(InvokeMethod.java:17)
  378.     at org.junit.internal.runners.statements.RunBefores.evaluate(RunBefores.java:26)
  379.     at org.junit.runners.ParentRunner$3.evaluate(ParentRunner.java:306)
  380.     at org.junit.runners.BlockJUnit4ClassRunner$1.evaluate(BlockJUnit4ClassRunner.java:100)
  381.     at org.junit.runners.ParentRunner.runLeaf(ParentRunner.java:366)
  382.     at org.junit.runners.BlockJUnit4ClassRunner.runChild(BlockJUnit4ClassRunner.java:103)
  383.     at org.junit.runners.BlockJUnit4ClassRunner.runChild(BlockJUnit4ClassRunner.java:63)
  384.     at org.junit.runners.ParentRunner$4.run(ParentRunner.java:331)
  385.     at org.junit.runners.ParentRunner$1.schedule(ParentRunner.java:79)
  386.     at org.junit.runners.ParentRunner.runChildren(ParentRunner.java:329)
  387.     at org.junit.runners.ParentRunner.access$100(ParentRunner.java:66)
  388.     at org.junit.runners.ParentRunner$2.evaluate(ParentRunner.java:293)
  389.     at org.junit.runners.ParentRunner$3.evaluate(ParentRunner.java:306)
  390.     at org.junit.runners.ParentRunner.run(ParentRunner.java:413)
  391.     at org.apache.maven.surefire.junit4.JUnit4Provider.execute(JUnit4Provider.java:252)
  392.     at org.apache.maven.surefire.junit4.JUnit4Provider.executeTestSet(JUnit4Provider.java:141)
  393.     at org.apache.maven.surefire.junit4.JUnit4Provider.invoke(JUnit4Provider.java:112)
  394.     at java.base/jdk.internal.reflect.NativeMethodAccessorImpl.invoke0(Native Method)
  395.     at java.base/jdk.internal.reflect.NativeMethodAccessorImpl.invoke(NativeMethodAccessorImpl.java:62)
  396.     at java.base/jdk.internal.reflect.DelegatingMethodAccessorImpl.invoke(DelegatingMethodAccessorImpl.java:43)
  397.     at java.base/java.lang.reflect.Method.invoke(Method.java:567)
  398.     at org.apache.maven.surefire.util.ReflectionUtils.invokeMethodWithArray(ReflectionUtils.java:189)
  399.     at org.apache.maven.surefire.booter.ProviderFactory$ProviderProxy.invoke(ProviderFactory.java:165)
  400.     at org.apache.maven.surefire.booter.ProviderFactory.invokeProvider(ProviderFactory.java:85)
  401.     at org.apache.maven.surefire.booter.ForkedBooter.runSuitesInProcess(ForkedBooter.java:115)
  402.     at org.apache.maven.surefire.booter.ForkedBooter.main(ForkedBooter.java:75)
  403.  
  404. testNBTTagStoring(org.bukkit.craftbukkit.inventory.DeprecatedItemMetaCustomValueTest)  Time elapsed: 0 sec  <<< ERROR!
  405. java.lang.NullPointerException
  406.     at org.bukkit.craftbukkit.inventory.DeprecatedItemMetaCustomValueTest.createComplexItemMeta(DeprecatedItemMetaCustomValueTest.java:153)
  407.     at org.bukkit.craftbukkit.inventory.DeprecatedItemMetaCustomValueTest.testNBTTagStoring(DeprecatedItemMetaCustomValueTest.java:94)
  408.     at java.base/jdk.internal.reflect.NativeMethodAccessorImpl.invoke0(Native Method)
  409.     at java.base/jdk.internal.reflect.NativeMethodAccessorImpl.invoke(NativeMethodAccessorImpl.java:62)
  410.     at java.base/jdk.internal.reflect.DelegatingMethodAccessorImpl.invoke(DelegatingMethodAccessorImpl.java:43)
  411.     at java.base/java.lang.reflect.Method.invoke(Method.java:567)
  412.     at org.junit.runners.model.FrameworkMethod$1.runReflectiveCall(FrameworkMethod.java:59)
  413.     at org.junit.internal.runners.model.ReflectiveCallable.run(ReflectiveCallable.java:12)
  414.     at org.junit.runners.model.FrameworkMethod.invokeExplosively(FrameworkMethod.java:56)
  415.     at org.junit.internal.runners.statements.InvokeMethod.evaluate(InvokeMethod.java:17)
  416.     at org.junit.internal.runners.statements.RunBefores.evaluate(RunBefores.java:26)
  417.     at org.junit.runners.ParentRunner$3.evaluate(ParentRunner.java:306)
  418.     at org.junit.runners.BlockJUnit4ClassRunner$1.evaluate(BlockJUnit4ClassRunner.java:100)
  419.     at org.junit.runners.ParentRunner.runLeaf(ParentRunner.java:366)
  420.     at org.junit.runners.BlockJUnit4ClassRunner.runChild(BlockJUnit4ClassRunner.java:103)
  421.     at org.junit.runners.BlockJUnit4ClassRunner.runChild(BlockJUnit4ClassRunner.java:63)
  422.     at org.junit.runners.ParentRunner$4.run(ParentRunner.java:331)
  423.     at org.junit.runners.ParentRunner$1.schedule(ParentRunner.java:79)
  424.     at org.junit.runners.ParentRunner.runChildren(ParentRunner.java:329)
  425.     at org.junit.runners.ParentRunner.access$100(ParentRunner.java:66)
  426.     at org.junit.runners.ParentRunner$2.evaluate(ParentRunner.java:293)
  427.     at org.junit.runners.ParentRunner$3.evaluate(ParentRunner.java:306)
  428.     at org.junit.runners.ParentRunner.run(ParentRunner.java:413)
  429.     at org.apache.maven.surefire.junit4.JUnit4Provider.execute(JUnit4Provider.java:252)
  430.     at org.apache.maven.surefire.junit4.JUnit4Provider.executeTestSet(JUnit4Provider.java:141)
  431.     at org.apache.maven.surefire.junit4.JUnit4Provider.invoke(JUnit4Provider.java:112)
  432.     at java.base/jdk.internal.reflect.NativeMethodAccessorImpl.invoke0(Native Method)
  433.     at java.base/jdk.internal.reflect.NativeMethodAccessorImpl.invoke(NativeMethodAccessorImpl.java:62)
  434.     at java.base/jdk.internal.reflect.DelegatingMethodAccessorImpl.invoke(DelegatingMethodAccessorImpl.java:43)
  435.     at java.base/java.lang.reflect.Method.invoke(Method.java:567)
  436.     at org.apache.maven.surefire.util.ReflectionUtils.invokeMethodWithArray(ReflectionUtils.java:189)
  437.     at org.apache.maven.surefire.booter.ProviderFactory$ProviderProxy.invoke(ProviderFactory.java:165)
  438.     at org.apache.maven.surefire.booter.ProviderFactory.invokeProvider(ProviderFactory.java:85)
  439.     at org.apache.maven.surefire.booter.ForkedBooter.runSuitesInProcess(ForkedBooter.java:115)
  440.     at org.apache.maven.surefire.booter.ForkedBooter.main(ForkedBooter.java:75)
  441.  
  442. testHasNoAdapter(org.bukkit.craftbukkit.inventory.DeprecatedItemMetaCustomValueTest)  Time elapsed: 0.001 sec  <<< ERROR!
  443. java.lang.Exception: Unexpected exception, expected<java.lang.IllegalArgumentException> but was<java.lang.NullPointerException>
  444.     at org.junit.internal.runners.statements.ExpectException.evaluate(ExpectException.java:30)
  445.     at org.junit.internal.runners.statements.RunBefores.evaluate(RunBefores.java:26)
  446.     at org.junit.runners.ParentRunner$3.evaluate(ParentRunner.java:306)
  447.     at org.junit.runners.BlockJUnit4ClassRunner$1.evaluate(BlockJUnit4ClassRunner.java:100)
  448.     at org.junit.runners.ParentRunner.runLeaf(ParentRunner.java:366)
  449.     at org.junit.runners.BlockJUnit4ClassRunner.runChild(BlockJUnit4ClassRunner.java:103)
  450.     at org.junit.runners.BlockJUnit4ClassRunner.runChild(BlockJUnit4ClassRunner.java:63)
  451.     at org.junit.runners.ParentRunner$4.run(ParentRunner.java:331)
  452.     at org.junit.runners.ParentRunner$1.schedule(ParentRunner.java:79)
  453.     at org.junit.runners.ParentRunner.runChildren(ParentRunner.java:329)
  454.     at org.junit.runners.ParentRunner.access$100(ParentRunner.java:66)
  455.     at org.junit.runners.ParentRunner$2.evaluate(ParentRunner.java:293)
  456.     at org.junit.runners.ParentRunner$3.evaluate(ParentRunner.java:306)
  457.     at org.junit.runners.ParentRunner.run(ParentRunner.java:413)
  458.     at org.apache.maven.surefire.junit4.JUnit4Provider.execute(JUnit4Provider.java:252)
  459.     at org.apache.maven.surefire.junit4.JUnit4Provider.executeTestSet(JUnit4Provider.java:141)
  460.     at org.apache.maven.surefire.junit4.JUnit4Provider.invoke(JUnit4Provider.java:112)
  461.     at java.base/jdk.internal.reflect.NativeMethodAccessorImpl.invoke0(Native Method)
  462.     at java.base/jdk.internal.reflect.NativeMethodAccessorImpl.invoke(NativeMethodAccessorImpl.java:62)
  463.     at java.base/jdk.internal.reflect.DelegatingMethodAccessorImpl.invoke(DelegatingMethodAccessorImpl.java:43)
  464.     at java.base/java.lang.reflect.Method.invoke(Method.java:567)
  465.     at org.apache.maven.surefire.util.ReflectionUtils.invokeMethodWithArray(ReflectionUtils.java:189)
  466.     at org.apache.maven.surefire.booter.ProviderFactory$ProviderProxy.invoke(ProviderFactory.java:165)
  467.     at org.apache.maven.surefire.booter.ProviderFactory.invokeProvider(ProviderFactory.java:85)
  468.     at org.apache.maven.surefire.booter.ForkedBooter.runSuitesInProcess(ForkedBooter.java:115)
  469.     at org.apache.maven.surefire.booter.ForkedBooter.main(ForkedBooter.java:75)
  470. Caused by: java.lang.NullPointerException
  471.     at org.bukkit.craftbukkit.inventory.DeprecatedItemMetaCustomValueTest.testHasNoAdapter(DeprecatedItemMetaCustomValueTest.java:47)
  472.     at java.base/jdk.internal.reflect.NativeMethodAccessorImpl.invoke0(Native Method)
  473.     at java.base/jdk.internal.reflect.NativeMethodAccessorImpl.invoke(NativeMethodAccessorImpl.java:62)
  474.     at java.base/jdk.internal.reflect.DelegatingMethodAccessorImpl.invoke(DelegatingMethodAccessorImpl.java:43)
  475.     at java.base/java.lang.reflect.Method.invoke(Method.java:567)
  476.     at org.junit.runners.model.FrameworkMethod$1.runReflectiveCall(FrameworkMethod.java:59)
  477.     at org.junit.internal.runners.model.ReflectiveCallable.run(ReflectiveCallable.java:12)
  478.     at org.junit.runners.model.FrameworkMethod.invokeExplosively(FrameworkMethod.java:56)
  479.     at org.junit.internal.runners.statements.InvokeMethod.evaluate(InvokeMethod.java:17)
  480.     at org.junit.internal.runners.statements.ExpectException.evaluate(ExpectException.java:19)
  481.     ... 25 more
  482.  
  483. testDifferentNamespace(org.bukkit.craftbukkit.inventory.DeprecatedItemMetaCustomValueTest)  Time elapsed: 0.001 sec  <<< ERROR!
  484. java.lang.NullPointerException
  485.     at org.bukkit.craftbukkit.inventory.DeprecatedItemMetaCustomValueTest.testDifferentNamespace(DeprecatedItemMetaCustomValueTest.java:74)
  486.     at java.base/jdk.internal.reflect.NativeMethodAccessorImpl.invoke0(Native Method)
  487.     at java.base/jdk.internal.reflect.NativeMethodAccessorImpl.invoke(NativeMethodAccessorImpl.java:62)
  488.     at java.base/jdk.internal.reflect.DelegatingMethodAccessorImpl.invoke(DelegatingMethodAccessorImpl.java:43)
  489.     at java.base/java.lang.reflect.Method.invoke(Method.java:567)
  490.     at org.junit.runners.model.FrameworkMethod$1.runReflectiveCall(FrameworkMethod.java:59)
  491.     at org.junit.internal.runners.model.ReflectiveCallable.run(ReflectiveCallable.java:12)
  492.     at org.junit.runners.model.FrameworkMethod.invokeExplosively(FrameworkMethod.java:56)
  493.     at org.junit.internal.runners.statements.InvokeMethod.evaluate(InvokeMethod.java:17)
  494.     at org.junit.internal.runners.statements.RunBefores.evaluate(RunBefores.java:26)
  495.     at org.junit.runners.ParentRunner$3.evaluate(ParentRunner.java:306)
  496.     at org.junit.runners.BlockJUnit4ClassRunner$1.evaluate(BlockJUnit4ClassRunner.java:100)
  497.     at org.junit.runners.ParentRunner.runLeaf(ParentRunner.java:366)
  498.     at org.junit.runners.BlockJUnit4ClassRunner.runChild(BlockJUnit4ClassRunner.java:103)
  499.     at org.junit.runners.BlockJUnit4ClassRunner.runChild(BlockJUnit4ClassRunner.java:63)
  500.     at org.junit.runners.ParentRunner$4.run(ParentRunner.java:331)
  501.     at org.junit.runners.ParentRunner$1.schedule(ParentRunner.java:79)
  502.     at org.junit.runners.ParentRunner.runChildren(ParentRunner.java:329)
  503.     at org.junit.runners.ParentRunner.access$100(ParentRunner.java:66)
  504.     at org.junit.runners.ParentRunner$2.evaluate(ParentRunner.java:293)
  505.     at org.junit.runners.ParentRunner$3.evaluate(ParentRunner.java:306)
  506.     at org.junit.runners.ParentRunner.run(ParentRunner.java:413)
  507.     at org.apache.maven.surefire.junit4.JUnit4Provider.execute(JUnit4Provider.java:252)
  508.     at org.apache.maven.surefire.junit4.JUnit4Provider.executeTestSet(JUnit4Provider.java:141)
  509.     at org.apache.maven.surefire.junit4.JUnit4Provider.invoke(JUnit4Provider.java:112)
  510.     at java.base/jdk.internal.reflect.NativeMethodAccessorImpl.invoke0(Native Method)
  511.     at java.base/jdk.internal.reflect.NativeMethodAccessorImpl.invoke(NativeMethodAccessorImpl.java:62)
  512.     at java.base/jdk.internal.reflect.DelegatingMethodAccessorImpl.invoke(DelegatingMethodAccessorImpl.java:43)
  513.     at java.base/java.lang.reflect.Method.invoke(Method.java:567)
  514.     at org.apache.maven.surefire.util.ReflectionUtils.invokeMethodWithArray(ReflectionUtils.java:189)
  515.     at org.apache.maven.surefire.booter.ProviderFactory$ProviderProxy.invoke(ProviderFactory.java:165)
  516.     at org.apache.maven.surefire.booter.ProviderFactory.invokeProvider(ProviderFactory.java:85)
  517.     at org.apache.maven.surefire.booter.ForkedBooter.runSuitesInProcess(ForkedBooter.java:115)
  518.     at org.apache.maven.surefire.booter.ForkedBooter.main(ForkedBooter.java:75)
  519.  
  520. testGetNoAdapter(org.bukkit.craftbukkit.inventory.DeprecatedItemMetaCustomValueTest)  Time elapsed: 0.002 sec  <<< ERROR!
  521. java.lang.Exception: Unexpected exception, expected<java.lang.IllegalArgumentException> but was<java.lang.NullPointerException>
  522.     at org.junit.internal.runners.statements.ExpectException.evaluate(ExpectException.java:30)
  523.     at org.junit.internal.runners.statements.RunBefores.evaluate(RunBefores.java:26)
  524.     at org.junit.runners.ParentRunner$3.evaluate(ParentRunner.java:306)
  525.     at org.junit.runners.BlockJUnit4ClassRunner$1.evaluate(BlockJUnit4ClassRunner.java:100)
  526.     at org.junit.runners.ParentRunner.runLeaf(ParentRunner.java:366)
  527.     at org.junit.runners.BlockJUnit4ClassRunner.runChild(BlockJUnit4ClassRunner.java:103)
  528.     at org.junit.runners.BlockJUnit4ClassRunner.runChild(BlockJUnit4ClassRunner.java:63)
  529.     at org.junit.runners.ParentRunner$4.run(ParentRunner.java:331)
  530.     at org.junit.runners.ParentRunner$1.schedule(ParentRunner.java:79)
  531.     at org.junit.runners.ParentRunner.runChildren(ParentRunner.java:329)
  532.     at org.junit.runners.ParentRunner.access$100(ParentRunner.java:66)
  533.     at org.junit.runners.ParentRunner$2.evaluate(ParentRunner.java:293)
  534.     at org.junit.runners.ParentRunner$3.evaluate(ParentRunner.java:306)
  535.     at org.junit.runners.ParentRunner.run(ParentRunner.java:413)
  536.     at org.apache.maven.surefire.junit4.JUnit4Provider.execute(JUnit4Provider.java:252)
  537.     at org.apache.maven.surefire.junit4.JUnit4Provider.executeTestSet(JUnit4Provider.java:141)
  538.     at org.apache.maven.surefire.junit4.JUnit4Provider.invoke(JUnit4Provider.java:112)
  539.     at java.base/jdk.internal.reflect.NativeMethodAccessorImpl.invoke0(Native Method)
  540.     at java.base/jdk.internal.reflect.NativeMethodAccessorImpl.invoke(NativeMethodAccessorImpl.java:62)
  541.     at java.base/jdk.internal.reflect.DelegatingMethodAccessorImpl.invoke(DelegatingMethodAccessorImpl.java:43)
  542.     at java.base/java.lang.reflect.Method.invoke(Method.java:567)
  543.     at org.apache.maven.surefire.util.ReflectionUtils.invokeMethodWithArray(ReflectionUtils.java:189)
  544.     at org.apache.maven.surefire.booter.ProviderFactory$ProviderProxy.invoke(ProviderFactory.java:165)
  545.     at org.apache.maven.surefire.booter.ProviderFactory.invokeProvider(ProviderFactory.java:85)
  546.     at org.apache.maven.surefire.booter.ForkedBooter.runSuitesInProcess(ForkedBooter.java:115)
  547.     at org.apache.maven.surefire.booter.ForkedBooter.main(ForkedBooter.java:75)
  548. Caused by: java.lang.NullPointerException
  549.     at org.bukkit.craftbukkit.inventory.DeprecatedItemMetaCustomValueTest.testGetNoAdapter(DeprecatedItemMetaCustomValueTest.java:57)
  550.     at java.base/jdk.internal.reflect.NativeMethodAccessorImpl.invoke0(Native Method)
  551.     at java.base/jdk.internal.reflect.NativeMethodAccessorImpl.invoke(NativeMethodAccessorImpl.java:62)
  552.     at java.base/jdk.internal.reflect.DelegatingMethodAccessorImpl.invoke(DelegatingMethodAccessorImpl.java:43)
  553.     at java.base/java.lang.reflect.Method.invoke(Method.java:567)
  554.     at org.junit.runners.model.FrameworkMethod$1.runReflectiveCall(FrameworkMethod.java:59)
  555.     at org.junit.internal.runners.model.ReflectiveCallable.run(ReflectiveCallable.java:12)
  556.     at org.junit.runners.model.FrameworkMethod.invokeExplosively(FrameworkMethod.java:56)
  557.     at org.junit.internal.runners.statements.InvokeMethod.evaluate(InvokeMethod.java:17)
  558.     at org.junit.internal.runners.statements.ExpectException.evaluate(ExpectException.java:19)
  559.     ... 25 more
  560.  
  561. testGetWrongType(org.bukkit.craftbukkit.inventory.DeprecatedItemMetaCustomValueTest)  Time elapsed: 0 sec  <<< ERROR!
  562. java.lang.Exception: Unexpected exception, expected<java.lang.IllegalArgumentException> but was<java.lang.NullPointerException>
  563.     at org.junit.internal.runners.statements.ExpectException.evaluate(ExpectException.java:30)
  564.     at org.junit.internal.runners.statements.RunBefores.evaluate(RunBefores.java:26)
  565.     at org.junit.runners.ParentRunner$3.evaluate(ParentRunner.java:306)
  566.     at org.junit.runners.BlockJUnit4ClassRunner$1.evaluate(BlockJUnit4ClassRunner.java:100)
  567.     at org.junit.runners.ParentRunner.runLeaf(ParentRunner.java:366)
  568.     at org.junit.runners.BlockJUnit4ClassRunner.runChild(BlockJUnit4ClassRunner.java:103)
  569.     at org.junit.runners.BlockJUnit4ClassRunner.runChild(BlockJUnit4ClassRunner.java:63)
  570.     at org.junit.runners.ParentRunner$4.run(ParentRunner.java:331)
  571.     at org.junit.runners.ParentRunner$1.schedule(ParentRunner.java:79)
  572.     at org.junit.runners.ParentRunner.runChildren(ParentRunner.java:329)
  573.     at org.junit.runners.ParentRunner.access$100(ParentRunner.java:66)
  574.     at org.junit.runners.ParentRunner$2.evaluate(ParentRunner.java:293)
  575.     at org.junit.runners.ParentRunner$3.evaluate(ParentRunner.java:306)
  576.     at org.junit.runners.ParentRunner.run(ParentRunner.java:413)
  577.     at org.apache.maven.surefire.junit4.JUnit4Provider.execute(JUnit4Provider.java:252)
  578.     at org.apache.maven.surefire.junit4.JUnit4Provider.executeTestSet(JUnit4Provider.java:141)
  579.     at org.apache.maven.surefire.junit4.JUnit4Provider.invoke(JUnit4Provider.java:112)
  580.     at java.base/jdk.internal.reflect.NativeMethodAccessorImpl.invoke0(Native Method)
  581.     at java.base/jdk.internal.reflect.NativeMethodAccessorImpl.invoke(NativeMethodAccessorImpl.java:62)
  582.     at java.base/jdk.internal.reflect.DelegatingMethodAccessorImpl.invoke(DelegatingMethodAccessorImpl.java:43)
  583.     at java.base/java.lang.reflect.Method.invoke(Method.java:567)
  584.     at org.apache.maven.surefire.util.ReflectionUtils.invokeMethodWithArray(ReflectionUtils.java:189)
  585.     at org.apache.maven.surefire.booter.ProviderFactory$ProviderProxy.invoke(ProviderFactory.java:165)
  586.     at org.apache.maven.surefire.booter.ProviderFactory.invokeProvider(ProviderFactory.java:85)
  587.     at org.apache.maven.surefire.booter.ForkedBooter.runSuitesInProcess(ForkedBooter.java:115)
  588.     at org.apache.maven.surefire.booter.ForkedBooter.main(ForkedBooter.java:75)
  589. Caused by: java.lang.NullPointerException
  590.     at org.bukkit.craftbukkit.inventory.DeprecatedItemMetaCustomValueTest.testGetWrongType(DeprecatedItemMetaCustomValueTest.java:64)
  591.     at java.base/jdk.internal.reflect.NativeMethodAccessorImpl.invoke0(Native Method)
  592.     at java.base/jdk.internal.reflect.NativeMethodAccessorImpl.invoke(NativeMethodAccessorImpl.java:62)
  593.     at java.base/jdk.internal.reflect.DelegatingMethodAccessorImpl.invoke(DelegatingMethodAccessorImpl.java:43)
  594.     at java.base/java.lang.reflect.Method.invoke(Method.java:567)
  595.     at org.junit.runners.model.FrameworkMethod$1.runReflectiveCall(FrameworkMethod.java:59)
  596.     at org.junit.internal.runners.model.ReflectiveCallable.run(ReflectiveCallable.java:12)
  597.     at org.junit.runners.model.FrameworkMethod.invokeExplosively(FrameworkMethod.java:56)
  598.     at org.junit.internal.runners.statements.InvokeMethod.evaluate(InvokeMethod.java:17)
  599.     at org.junit.internal.runners.statements.ExpectException.evaluate(ExpectException.java:19)
  600.     ... 25 more
  601.  
  602. testCorrectType(org.bukkit.craftbukkit.inventory.DeprecatedItemMetaCustomValueTest)  Time elapsed: 0.005 sec  <<< ERROR!
  603. java.lang.NullPointerException
  604.     at org.bukkit.craftbukkit.inventory.DeprecatedItemMetaCustomValueTest.createComplexItemMeta(DeprecatedItemMetaCustomValueTest.java:153)
  605.     at org.bukkit.craftbukkit.inventory.DeprecatedItemMetaCustomValueTest.testCorrectType(DeprecatedItemMetaCustomValueTest.java:129)
  606.     at java.base/jdk.internal.reflect.NativeMethodAccessorImpl.invoke0(Native Method)
  607.     at java.base/jdk.internal.reflect.NativeMethodAccessorImpl.invoke(NativeMethodAccessorImpl.java:62)
  608.     at java.base/jdk.internal.reflect.DelegatingMethodAccessorImpl.invoke(DelegatingMethodAccessorImpl.java:43)
  609.     at java.base/java.lang.reflect.Method.invoke(Method.java:567)
  610.     at org.junit.runners.model.FrameworkMethod$1.runReflectiveCall(FrameworkMethod.java:59)
  611.     at org.junit.internal.runners.model.ReflectiveCallable.run(ReflectiveCallable.java:12)
  612.     at org.junit.runners.model.FrameworkMethod.invokeExplosively(FrameworkMethod.java:56)
  613.     at org.junit.internal.runners.statements.InvokeMethod.evaluate(InvokeMethod.java:17)
  614.     at org.junit.internal.runners.statements.RunBefores.evaluate(RunBefores.java:26)
  615.     at org.junit.runners.ParentRunner$3.evaluate(ParentRunner.java:306)
  616.     at org.junit.runners.BlockJUnit4ClassRunner$1.evaluate(BlockJUnit4ClassRunner.java:100)
  617.     at org.junit.runners.ParentRunner.runLeaf(ParentRunner.java:366)
  618.     at org.junit.runners.BlockJUnit4ClassRunner.runChild(BlockJUnit4ClassRunner.java:103)
  619.     at org.junit.runners.BlockJUnit4ClassRunner.runChild(BlockJUnit4ClassRunner.java:63)
  620.     at org.junit.runners.ParentRunner$4.run(ParentRunner.java:331)
  621.     at org.junit.runners.ParentRunner$1.schedule(ParentRunner.java:79)
  622.     at org.junit.runners.ParentRunner.runChildren(ParentRunner.java:329)
  623.     at org.junit.runners.ParentRunner.access$100(ParentRunner.java:66)
  624.     at org.junit.runners.ParentRunner$2.evaluate(ParentRunner.java:293)
  625.     at org.junit.runners.ParentRunner$3.evaluate(ParentRunner.java:306)
  626.     at org.junit.runners.ParentRunner.run(ParentRunner.java:413)
  627.     at org.apache.maven.surefire.junit4.JUnit4Provider.execute(JUnit4Provider.java:252)
  628.     at org.apache.maven.surefire.junit4.JUnit4Provider.executeTestSet(JUnit4Provider.java:141)
  629.     at org.apache.maven.surefire.junit4.JUnit4Provider.invoke(JUnit4Provider.java:112)
  630.     at java.base/jdk.internal.reflect.NativeMethodAccessorImpl.invoke0(Native Method)
  631.     at java.base/jdk.internal.reflect.NativeMethodAccessorImpl.invoke(NativeMethodAccessorImpl.java:62)
  632.     at java.base/jdk.internal.reflect.DelegatingMethodAccessorImpl.invoke(DelegatingMethodAccessorImpl.java:43)
  633.     at java.base/java.lang.reflect.Method.invoke(Method.java:567)
  634.     at org.apache.maven.surefire.util.ReflectionUtils.invokeMethodWithArray(ReflectionUtils.java:189)
  635.     at org.apache.maven.surefire.booter.ProviderFactory$ProviderProxy.invoke(ProviderFactory.java:165)
  636.     at org.apache.maven.surefire.booter.ProviderFactory.invokeProvider(ProviderFactory.java:85)
  637.     at org.apache.maven.surefire.booter.ForkedBooter.runSuitesInProcess(ForkedBooter.java:115)
  638.     at org.apache.maven.surefire.booter.ForkedBooter.main(ForkedBooter.java:75)
  639.  
  640. testMapStoring(org.bukkit.craftbukkit.inventory.DeprecatedItemMetaCustomValueTest)  Time elapsed: 0 sec  <<< ERROR!
  641. java.lang.NullPointerException
  642.     at org.bukkit.craftbukkit.inventory.DeprecatedItemMetaCustomValueTest.createComplexItemMeta(DeprecatedItemMetaCustomValueTest.java:153)
  643.     at org.bukkit.craftbukkit.inventory.DeprecatedItemMetaCustomValueTest.testMapStoring(DeprecatedItemMetaCustomValueTest.java:104)
  644.     at java.base/jdk.internal.reflect.NativeMethodAccessorImpl.invoke0(Native Method)
  645.     at java.base/jdk.internal.reflect.NativeMethodAccessorImpl.invoke(NativeMethodAccessorImpl.java:62)
  646.     at java.base/jdk.internal.reflect.DelegatingMethodAccessorImpl.invoke(DelegatingMethodAccessorImpl.java:43)
  647.     at java.base/java.lang.reflect.Method.invoke(Method.java:567)
  648.     at org.junit.runners.model.FrameworkMethod$1.runReflectiveCall(FrameworkMethod.java:59)
  649.     at org.junit.internal.runners.model.ReflectiveCallable.run(ReflectiveCallable.java:12)
  650.     at org.junit.runners.model.FrameworkMethod.invokeExplosively(FrameworkMethod.java:56)
  651.     at org.junit.internal.runners.statements.InvokeMethod.evaluate(InvokeMethod.java:17)
  652.     at org.junit.internal.runners.statements.RunBefores.evaluate(RunBefores.java:26)
  653.     at org.junit.runners.ParentRunner$3.evaluate(ParentRunner.java:306)
  654.     at org.junit.runners.BlockJUnit4ClassRunner$1.evaluate(BlockJUnit4ClassRunner.java:100)
  655.     at org.junit.runners.ParentRunner.runLeaf(ParentRunner.java:366)
  656.     at org.junit.runners.BlockJUnit4ClassRunner.runChild(BlockJUnit4ClassRunner.java:103)
  657.     at org.junit.runners.BlockJUnit4ClassRunner.runChild(BlockJUnit4ClassRunner.java:63)
  658.     at org.junit.runners.ParentRunner$4.run(ParentRunner.java:331)
  659.     at org.junit.runners.ParentRunner$1.schedule(ParentRunner.java:79)
  660.     at org.junit.runners.ParentRunner.runChildren(ParentRunner.java:329)
  661.     at org.junit.runners.ParentRunner.access$100(ParentRunner.java:66)
  662.     at org.junit.runners.ParentRunner$2.evaluate(ParentRunner.java:293)
  663.     at org.junit.runners.ParentRunner$3.evaluate(ParentRunner.java:306)
  664.     at org.junit.runners.ParentRunner.run(ParentRunner.java:413)
  665.     at org.apache.maven.surefire.junit4.JUnit4Provider.execute(JUnit4Provider.java:252)
  666.     at org.apache.maven.surefire.junit4.JUnit4Provider.executeTestSet(JUnit4Provider.java:141)
  667.     at org.apache.maven.surefire.junit4.JUnit4Provider.invoke(JUnit4Provider.java:112)
  668.     at java.base/jdk.internal.reflect.NativeMethodAccessorImpl.invoke0(Native Method)
  669.     at java.base/jdk.internal.reflect.NativeMethodAccessorImpl.invoke(NativeMethodAccessorImpl.java:62)
  670.     at java.base/jdk.internal.reflect.DelegatingMethodAccessorImpl.invoke(DelegatingMethodAccessorImpl.java:43)
  671.     at java.base/java.lang.reflect.Method.invoke(Method.java:567)
  672.     at org.apache.maven.surefire.util.ReflectionUtils.invokeMethodWithArray(ReflectionUtils.java:189)
  673.     at org.apache.maven.surefire.booter.ProviderFactory$ProviderProxy.invoke(ProviderFactory.java:165)
  674.     at org.apache.maven.surefire.booter.ProviderFactory.invokeProvider(ProviderFactory.java:85)
  675.     at org.apache.maven.surefire.booter.ForkedBooter.runSuitesInProcess(ForkedBooter.java:115)
  676.     at org.apache.maven.surefire.booter.ForkedBooter.main(ForkedBooter.java:75)
  677.  
  678. testSetNoAdapter(org.bukkit.craftbukkit.inventory.DeprecatedItemMetaCustomValueTest)  Time elapsed: 0 sec  <<< ERROR!
  679. java.lang.Exception: Unexpected exception, expected<java.lang.IllegalArgumentException> but was<java.lang.NullPointerException>
  680.     at org.junit.internal.runners.statements.ExpectException.evaluate(ExpectException.java:30)
  681.     at org.junit.internal.runners.statements.RunBefores.evaluate(RunBefores.java:26)
  682.     at org.junit.runners.ParentRunner$3.evaluate(ParentRunner.java:306)
  683.     at org.junit.runners.BlockJUnit4ClassRunner$1.evaluate(BlockJUnit4ClassRunner.java:100)
  684.     at org.junit.runners.ParentRunner.runLeaf(ParentRunner.java:366)
  685.     at org.junit.runners.BlockJUnit4ClassRunner.runChild(BlockJUnit4ClassRunner.java:103)
  686.     at org.junit.runners.BlockJUnit4ClassRunner.runChild(BlockJUnit4ClassRunner.java:63)
  687.     at org.junit.runners.ParentRunner$4.run(ParentRunner.java:331)
  688.     at org.junit.runners.ParentRunner$1.schedule(ParentRunner.java:79)
  689.     at org.junit.runners.ParentRunner.runChildren(ParentRunner.java:329)
  690.     at org.junit.runners.ParentRunner.access$100(ParentRunner.java:66)
  691.     at org.junit.runners.ParentRunner$2.evaluate(ParentRunner.java:293)
  692.     at org.junit.runners.ParentRunner$3.evaluate(ParentRunner.java:306)
  693.     at org.junit.runners.ParentRunner.run(ParentRunner.java:413)
  694.     at org.apache.maven.surefire.junit4.JUnit4Provider.execute(JUnit4Provider.java:252)
  695.     at org.apache.maven.surefire.junit4.JUnit4Provider.executeTestSet(JUnit4Provider.java:141)
  696.     at org.apache.maven.surefire.junit4.JUnit4Provider.invoke(JUnit4Provider.java:112)
  697.     at java.base/jdk.internal.reflect.NativeMethodAccessorImpl.invoke0(Native Method)
  698.     at java.base/jdk.internal.reflect.NativeMethodAccessorImpl.invoke(NativeMethodAccessorImpl.java:62)
  699.     at java.base/jdk.internal.reflect.DelegatingMethodAccessorImpl.invoke(DelegatingMethodAccessorImpl.java:43)
  700.     at java.base/java.lang.reflect.Method.invoke(Method.java:567)
  701.     at org.apache.maven.surefire.util.ReflectionUtils.invokeMethodWithArray(ReflectionUtils.java:189)
  702.     at org.apache.maven.surefire.booter.ProviderFactory$ProviderProxy.invoke(ProviderFactory.java:165)
  703.     at org.apache.maven.surefire.booter.ProviderFactory.invokeProvider(ProviderFactory.java:85)
  704.     at org.apache.maven.surefire.booter.ForkedBooter.runSuitesInProcess(ForkedBooter.java:115)
  705.     at org.apache.maven.surefire.booter.ForkedBooter.main(ForkedBooter.java:75)
  706. Caused by: java.lang.NullPointerException
  707.     at org.bukkit.craftbukkit.inventory.DeprecatedItemMetaCustomValueTest.testSetNoAdapter(DeprecatedItemMetaCustomValueTest.java:38)
  708.     at java.base/jdk.internal.reflect.NativeMethodAccessorImpl.invoke0(Native Method)
  709.     at java.base/jdk.internal.reflect.NativeMethodAccessorImpl.invoke(NativeMethodAccessorImpl.java:62)
  710.     at java.base/jdk.internal.reflect.DelegatingMethodAccessorImpl.invoke(DelegatingMethodAccessorImpl.java:43)
  711.     at java.base/java.lang.reflect.Method.invoke(Method.java:567)
  712.     at org.junit.runners.model.FrameworkMethod$1.runReflectiveCall(FrameworkMethod.java:59)
  713.     at org.junit.internal.runners.model.ReflectiveCallable.run(ReflectiveCallable.java:12)
  714.     at org.junit.runners.model.FrameworkMethod.invokeExplosively(FrameworkMethod.java:56)
  715.     at org.junit.internal.runners.statements.InvokeMethod.evaluate(InvokeMethod.java:17)
  716.     at org.junit.internal.runners.statements.ExpectException.evaluate(ExpectException.java:19)
  717.     ... 25 more
  718.  
  719. Running org.bukkit.craftbukkit.inventory.FactoryItemMaterialTest
  720. Tests run: 3536, Failures: 0, Errors: 0, Skipped: 0, Time elapsed: 2.871 sec
  721. Running org.bukkit.craftbukkit.inventory.PlayerInventoryTest
  722. Tests run: 1, Failures: 0, Errors: 0, Skipped: 0, Time elapsed: 0 sec
  723. Running org.bukkit.craftbukkit.inventory.ItemMetaTest
  724. Tests run: 15, Failures: 0, Errors: 0, Skipped: 0, Time elapsed: 0.068 sec
  725. Running org.bukkit.craftbukkit.inventory.PersistentDataContainerTest
  726. Tests run: 13, Failures: 2, Errors: 0, Skipped: 0, Time elapsed: 0.069 sec <<< FAILURE!
  727. testYAMLStoring(org.bukkit.craftbukkit.inventory.PersistentDataContainerTest)  Time elapsed: 0.052 sec  <<< FAILURE!
  728. java.lang.AssertionError: expected:<ItemStack{DIAMOND x 1, UNSPECIFIC_META:{meta-type=UNSPECIFIC, display-name=Item Display Name, PublicBukkitValues={test-plugin:custom-byte-array=[B;0B,1B,2B,10B], test-plugin:custom-inner-compound={test:validkey=5L}, test-plugin:custom-int=3i, test-plugin:custom-long=4L, test-plugin:custom-string=Hello there world, test-plugin:custom-double=3.123d}}}> but was:<ItemStack{DIAMOND x 1}>
  729.     at org.junit.Assert.fail(Assert.java:89)
  730.     at org.junit.Assert.failNotEquals(Assert.java:835)
  731.     at org.junit.Assert.assertEquals(Assert.java:120)
  732.     at org.junit.Assert.assertEquals(Assert.java:146)
  733.     at org.bukkit.craftbukkit.inventory.PersistentDataContainerTest.testYAMLStoring(PersistentDataContainerTest.java:122)
  734.     at java.base/jdk.internal.reflect.NativeMethodAccessorImpl.invoke0(Native Method)
  735.     at java.base/jdk.internal.reflect.NativeMethodAccessorImpl.invoke(NativeMethodAccessorImpl.java:62)
  736.     at java.base/jdk.internal.reflect.DelegatingMethodAccessorImpl.invoke(DelegatingMethodAccessorImpl.java:43)
  737.     at java.base/java.lang.reflect.Method.invoke(Method.java:567)
  738.     at org.junit.runners.model.FrameworkMethod$1.runReflectiveCall(FrameworkMethod.java:59)
  739.     at org.junit.internal.runners.model.ReflectiveCallable.run(ReflectiveCallable.java:12)
  740.     at org.junit.runners.model.FrameworkMethod.invokeExplosively(FrameworkMethod.java:56)
  741.     at org.junit.internal.runners.statements.InvokeMethod.evaluate(InvokeMethod.java:17)
  742.     at org.junit.internal.runners.statements.RunBefores.evaluate(RunBefores.java:26)
  743.     at org.junit.runners.ParentRunner$3.evaluate(ParentRunner.java:306)
  744.     at org.junit.runners.BlockJUnit4ClassRunner$1.evaluate(BlockJUnit4ClassRunner.java:100)
  745.     at org.junit.runners.ParentRunner.runLeaf(ParentRunner.java:366)
  746.     at org.junit.runners.BlockJUnit4ClassRunner.runChild(BlockJUnit4ClassRunner.java:103)
  747.     at org.junit.runners.BlockJUnit4ClassRunner.runChild(BlockJUnit4ClassRunner.java:63)
  748.     at org.junit.runners.ParentRunner$4.run(ParentRunner.java:331)
  749.     at org.junit.runners.ParentRunner$1.schedule(ParentRunner.java:79)
  750.     at org.junit.runners.ParentRunner.runChildren(ParentRunner.java:329)
  751.     at org.junit.runners.ParentRunner.access$100(ParentRunner.java:66)
  752.     at org.junit.runners.ParentRunner$2.evaluate(ParentRunner.java:293)
  753.     at org.junit.runners.ParentRunner$3.evaluate(ParentRunner.java:306)
  754.     at org.junit.runners.ParentRunner.run(ParentRunner.java:413)
  755.     at org.apache.maven.surefire.junit4.JUnit4Provider.execute(JUnit4Provider.java:252)
  756.     at org.apache.maven.surefire.junit4.JUnit4Provider.executeTestSet(JUnit4Provider.java:141)
  757.     at org.apache.maven.surefire.junit4.JUnit4Provider.invoke(JUnit4Provider.java:112)
  758.     at java.base/jdk.internal.reflect.NativeMethodAccessorImpl.invoke0(Native Method)
  759.     at java.base/jdk.internal.reflect.NativeMethodAccessorImpl.invoke(NativeMethodAccessorImpl.java:62)
  760.     at java.base/jdk.internal.reflect.DelegatingMethodAccessorImpl.invoke(DelegatingMethodAccessorImpl.java:43)
  761.     at java.base/java.lang.reflect.Method.invoke(Method.java:567)
  762.     at org.apache.maven.surefire.util.ReflectionUtils.invokeMethodWithArray(ReflectionUtils.java:189)
  763.     at org.apache.maven.surefire.booter.ProviderFactory$ProviderProxy.invoke(ProviderFactory.java:165)
  764.     at org.apache.maven.surefire.booter.ProviderFactory.invokeProvider(ProviderFactory.java:85)
  765.     at org.apache.maven.surefire.booter.ForkedBooter.runSuitesInProcess(ForkedBooter.java:115)
  766.     at org.apache.maven.surefire.booter.ForkedBooter.main(ForkedBooter.java:75)
  767.  
  768. testCorrectType(org.bukkit.craftbukkit.inventory.PersistentDataContainerTest)  Time elapsed: 0.005 sec  <<< FAILURE!
  769. java.lang.AssertionError
  770.     at org.junit.Assert.fail(Assert.java:87)
  771.     at org.junit.Assert.assertTrue(Assert.java:42)
  772.     at org.junit.Assert.assertTrue(Assert.java:53)
  773.     at org.bukkit.craftbukkit.inventory.PersistentDataContainerTest.testCorrectType(PersistentDataContainerTest.java:142)
  774.     at java.base/jdk.internal.reflect.NativeMethodAccessorImpl.invoke0(Native Method)
  775.     at java.base/jdk.internal.reflect.NativeMethodAccessorImpl.invoke(NativeMethodAccessorImpl.java:62)
  776.     at java.base/jdk.internal.reflect.DelegatingMethodAccessorImpl.invoke(DelegatingMethodAccessorImpl.java:43)
  777.     at java.base/java.lang.reflect.Method.invoke(Method.java:567)
  778.     at org.junit.runners.model.FrameworkMethod$1.runReflectiveCall(FrameworkMethod.java:59)
  779.     at org.junit.internal.runners.model.ReflectiveCallable.run(ReflectiveCallable.java:12)
  780.     at org.junit.runners.model.FrameworkMethod.invokeExplosively(FrameworkMethod.java:56)
  781.     at org.junit.internal.runners.statements.InvokeMethod.evaluate(InvokeMethod.java:17)
  782.     at org.junit.internal.runners.statements.RunBefores.evaluate(RunBefores.java:26)
  783.     at org.junit.runners.ParentRunner$3.evaluate(ParentRunner.java:306)
  784.     at org.junit.runners.BlockJUnit4ClassRunner$1.evaluate(BlockJUnit4ClassRunner.java:100)
  785.     at org.junit.runners.ParentRunner.runLeaf(ParentRunner.java:366)
  786.     at org.junit.runners.BlockJUnit4ClassRunner.runChild(BlockJUnit4ClassRunner.java:103)
  787.     at org.junit.runners.BlockJUnit4ClassRunner.runChild(BlockJUnit4ClassRunner.java:63)
  788.     at org.junit.runners.ParentRunner$4.run(ParentRunner.java:331)
  789.     at org.junit.runners.ParentRunner$1.schedule(ParentRunner.java:79)
  790.     at org.junit.runners.ParentRunner.runChildren(ParentRunner.java:329)
  791.     at org.junit.runners.ParentRunner.access$100(ParentRunner.java:66)
  792.     at org.junit.runners.ParentRunner$2.evaluate(ParentRunner.java:293)
  793.     at org.junit.runners.ParentRunner$3.evaluate(ParentRunner.java:306)
  794.     at org.junit.runners.ParentRunner.run(ParentRunner.java:413)
  795.     at org.apache.maven.surefire.junit4.JUnit4Provider.execute(JUnit4Provider.java:252)
  796.     at org.apache.maven.surefire.junit4.JUnit4Provider.executeTestSet(JUnit4Provider.java:141)
  797.     at org.apache.maven.surefire.junit4.JUnit4Provider.invoke(JUnit4Provider.java:112)
  798.     at java.base/jdk.internal.reflect.NativeMethodAccessorImpl.invoke0(Native Method)
  799.     at java.base/jdk.internal.reflect.NativeMethodAccessorImpl.invoke(NativeMethodAccessorImpl.java:62)
  800.     at java.base/jdk.internal.reflect.DelegatingMethodAccessorImpl.invoke(DelegatingMethodAccessorImpl.java:43)
  801.     at java.base/java.lang.reflect.Method.invoke(Method.java:567)
  802.     at org.apache.maven.surefire.util.ReflectionUtils.invokeMethodWithArray(ReflectionUtils.java:189)
  803.     at org.apache.maven.surefire.booter.ProviderFactory$ProviderProxy.invoke(ProviderFactory.java:165)
  804.     at org.apache.maven.surefire.booter.ProviderFactory.invokeProvider(ProviderFactory.java:85)
  805.     at org.apache.maven.surefire.booter.ForkedBooter.runSuitesInProcess(ForkedBooter.java:115)
  806.     at org.apache.maven.surefire.booter.ForkedBooter.main(ForkedBooter.java:75)
  807.  
  808. Running org.bukkit.craftbukkit.inventory.ItemFactoryTest
  809. Tests run: 1, Failures: 0, Errors: 0, Skipped: 0, Time elapsed: 1.253 sec
  810. Running org.bukkit.craftbukkit.inventory.ItemMetaCloneTest
  811. Tests run: 1, Failures: 0, Errors: 0, Skipped: 0, Time elapsed: 0 sec
  812. Running org.bukkit.craftbukkit.inventory.NMSCraftItemStackTest
  813. Tests run: 2, Failures: 0, Errors: 0, Skipped: 0, Time elapsed: 0.002 sec
  814. Running org.bukkit.LootTablesTest
  815. Tests run: 2, Failures: 0, Errors: 0, Skipped: 0, Time elapsed: 0.009 sec
  816. Running org.bukkit.NibbleArrayTest
  817. Tests run: 1, Failures: 0, Errors: 0, Skipped: 0, Time elapsed: 0.001 sec
  818. Running org.bukkit.StatisticsAndAchievementsTest
  819. Tests run: 2, Failures: 0, Errors: 0, Skipped: 0, Time elapsed: 0.048 sec
  820. Running org.bukkit.DyeColorsTest
  821. Tests run: 32, Failures: 0, Errors: 0, Skipped: 0, Time elapsed: 0.002 sec
  822. Running org.bukkit.BlockDataTest
  823. Tests run: 16, Failures: 0, Errors: 0, Skipped: 0, Time elapsed: 0.007 sec
  824. Running org.bukkit.ParticleTest
  825. Tests run: 1, Failures: 0, Errors: 0, Skipped: 0, Time elapsed: 0.003 sec
  826. Running org.bukkit.ChatTest
  827. Tests run: 2, Failures: 0, Errors: 0, Skipped: 0, Time elapsed: 0.006 sec
  828. Running org.bukkit.BlockDataConversionTest
  829. Tests run: 680, Failures: 0, Errors: 0, Skipped: 0, Time elapsed: 0.031 sec
  830. Running org.bukkit.potion.PotionTest
  831. Tests run: 2, Failures: 0, Errors: 0, Skipped: 0, Time elapsed: 0 sec
  832. Running org.bukkit.ArtTest
  833. Tests run: 3, Failures: 0, Errors: 0, Skipped: 0, Time elapsed: 0 sec
  834. Running org.bukkit.block.banner.PatternTypeTest
  835. Tests run: 2, Failures: 0, Errors: 0, Skipped: 0, Time elapsed: 0 sec
  836.  
  837. Results :
  838.  
  839. Failed tests:   testYAMLStoring(org.bukkit.craftbukkit.inventory.PersistentDataContainerTest): expected:<ItemStack{DIAMOND x 1, UNSPECIFIC_META:{meta-type=UNSPECIFIC, display-name=Item Display Name, PublicBukkitValues={test-plugin:custom-byte-array=[B;0B,1B,2B,10B], test-plugin:custom-inner-compound={test:validkey=5L}, test-plugin:custom-int=3i, test-plugin:custom-long=4L, test-plugin:custom-string=Hello there world, test-plugin:custom-double=3.123d}}}> but was:<ItemStack{DIAMOND x 1}>
  840.   testCorrectType(org.bukkit.craftbukkit.inventory.PersistentDataContainerTest)
  841.  
  842. Tests in error:
  843.   encapsulatedContainers(org.bukkit.craftbukkit.inventory.DeprecatedItemMetaCustomValueTest)
  844.   testYAMLStoring(org.bukkit.craftbukkit.inventory.DeprecatedItemMetaCustomValueTest)
  845.   storeUUIDOnItemTest(org.bukkit.craftbukkit.inventory.DeprecatedItemMetaCustomValueTest)
  846.   testPrimitiveCustomTags(org.bukkit.craftbukkit.inventory.DeprecatedItemMetaCustomValueTest)
  847.   testNBTTagStoring(org.bukkit.craftbukkit.inventory.DeprecatedItemMetaCustomValueTest)
  848.   testHasNoAdapter(org.bukkit.craftbukkit.inventory.DeprecatedItemMetaCustomValueTest): Unexpected exception, expected<java.lang.IllegalArgumentException> but was<java.lang.NullPointerException>
  849.   testDifferentNamespace(org.bukkit.craftbukkit.inventory.DeprecatedItemMetaCustomValueTest)
  850.   testGetNoAdapter(org.bukkit.craftbukkit.inventory.DeprecatedItemMetaCustomValueTest): Unexpected exception, expected<java.lang.IllegalArgumentException> but was<java.lang.NullPointerException>
  851.   testGetWrongType(org.bukkit.craftbukkit.inventory.DeprecatedItemMetaCustomValueTest): Unexpected exception, expected<java.lang.IllegalArgumentException> but was<java.lang.NullPointerException>
  852.   testCorrectType(org.bukkit.craftbukkit.inventory.DeprecatedItemMetaCustomValueTest)
  853.   testMapStoring(org.bukkit.craftbukkit.inventory.DeprecatedItemMetaCustomValueTest)
  854.   testSetNoAdapter(org.bukkit.craftbukkit.inventory.DeprecatedItemMetaCustomValueTest): Unexpected exception, expected<java.lang.IllegalArgumentException> but was<java.lang.NullPointerException>
  855.  
  856. Tests run: 25067, Failures: 2, Errors: 12, Skipped: 0
  857.  
  858. [INFO] ------------------------------------------------------------------------
  859. [INFO] Reactor Summary:
  860. [INFO]
  861. [INFO] Paper-Parent dev-SNAPSHOT .......................... SUCCESS [  0.004 s]
  862. [INFO] Paper-API 1.15.2-R0.1-SNAPSHOT ..................... SUCCESS [ 13.579 s]
  863. [INFO] Paper 1.15.2-R0.1-SNAPSHOT ......................... FAILURE [ 21.766 s]
  864. [INFO] ------------------------------------------------------------------------
  865. [INFO] BUILD FAILURE
  866. [INFO] ------------------------------------------------------------------------
  867. [INFO] Total time:  35.488 s
  868. [INFO] Finished at: 2020-03-18T15:58:21+01:00
  869. [INFO] ------------------------------------------------------------------------
  870. [ERROR] Failed to execute goal org.apache.maven.plugins:maven-surefire-plugin:2.12.4:test (default-test) on project paper: There are test failures.
  871. [ERROR]
  872. [ERROR] Please refer to /Users/marco/Documents/IntelliJ/Paper/Paper-Server/target/surefire-reports for the individual test results.
  873. [ERROR] -> [Help 1]
  874. [ERROR]
  875. [ERROR] To see the full stack trace of the errors, re-run Maven with the -e switch.
  876. [ERROR] Re-run Maven using the -X switch to enable full debug logging.
  877. [ERROR]
  878. [ERROR] For more information about the errors and possible solutions, please read the following articles:
  879. [ERROR] [Help 1] http://cwiki.apache.org/confluence/display/MAVEN/MojoFailureException
  880. [ERROR]
  881. [ERROR] After correcting the problems, you can resume the build with the command
  882. [ERROR]   mvn <goals> -rf :paper
RAW Paste Data

Adblocker detected! Please consider disabling it...

We've detected AdBlock Plus or some other adblocking software preventing Pastebin.com from fully loading.

We don't have any obnoxious sound, or popup ads, we actively block these annoying types of ads!

Please add Pastebin.com to your ad blocker whitelist or disable your adblocking software.

×