Guest User

CppunitTest_chart2_xshape failure at 125% scale

a guest
Dec 16th, 2018
249
Never
Not a member of Pastebin yet? Sign Up, it unlocks many cool features!
  1. [build CUT] chart2_xshape
  2. [build CUT] sc_subsequent_filters_test
  3. Chart2XShapeTest::testFdo75075 finished in: 51ms
  4. Chart2XShapeTest::testPropertyMappingBarChart finished in: 0ms
  5. Exception caught in XShapeDumper.cxx: NavigationOrder
  6. D:/cygwin/home/Hearthstone/lode/dev/core/test/source/diff/diff.cxx:267:Chart2XShapeTest::testPieChartLabels1
  7. double equality assertion failed
  8. - Expected: 26494
  9. - Actual : 26097
  10. - Delta : 1e-08
  11. - Reference: D:/cygwin/home/Hearthstone/lode/dev/core/chart2/qa/extras/xshape/data/reference/tdf90839-1.xml
  12. - Node: /XShapes/XShape[1]
  13. - Attr: sizeX
  14.  
  15. Chart2XShapeTest::testPieChartLabels1 finished in: 2859ms
  16. Exception caught in XShapeDumper.cxx: NavigationOrder
  17. Exception caught in XShapeDumper.cxx: NavigationOrder
  18. Exception caught in XShapeDumper.cxx: NavigationOrder
  19. D:/cygwin/home/Hearthstone/lode/dev/core/test/source/diff/diff.cxx:267:Chart2XShapeTest::testPieChartLabels2
  20. double equality assertion failed
  21. - Expected: 26494
  22. - Actual : 26097
  23. - Delta : 1e-08
  24. - Reference: D:/cygwin/home/Hearthstone/lode/dev/core/chart2/qa/extras/xshape/data/reference/tdf90839-2.xml
  25. - Node: /XShapes/XShape[1]
  26. - Attr: sizeX
  27.  
  28. Chart2XShapeTest::testPieChartLabels2 finished in: 572ms
  29. Exception caught in XShapeDumper.cxx: NavigationOrder
  30. Exception caught in XShapeDumper.cxx: NavigationOrder
  31. Exception caught in XShapeDumper.cxx: NavigationOrder
  32. D:/cygwin/home/Hearthstone/lode/dev/core/test/source/diff/diff.cxx:267:Chart2XShapeTest::testPieChartLabels3
  33. double equality assertion failed
  34. - Expected: 26494
  35. - Actual : 26097
  36. - Delta : 1e-08
  37. - Reference: D:/cygwin/home/Hearthstone/lode/dev/core/chart2/qa/extras/xshape/data/reference/tdf90839-3.xml
  38. - Node: /XShapes/XShape[1]
  39. - Attr: sizeX
  40.  
  41. Chart2XShapeTest::testPieChartLabels3 finished in: 582ms
  42. Exception caught in XShapeDumper.cxx: NavigationOrder
  43. Exception caught in XShapeDumper.cxx: NavigationOrder
  44. Exception caught in XShapeDumper.cxx: NavigationOrder
  45. Exception caught in XShapeDumper.cxx: NavigationOrder
  46. D:/cygwin/home/Hearthstone/lode/dev/core/test/source/diff/diff.cxx:267:Chart2XShapeTest::testPieChartLabels4
  47. double equality assertion failed
  48. - Expected: 4436
  49. - Actual : 4367
  50. - Delta : 1e-08
  51. - Reference: D:/cygwin/home/Hearthstone/lode/dev/core/chart2/qa/extras/xshape/data/reference/tdf90839-4.xml
  52. - Node: /XShapes/XShape[2]
  53. - Attr: positionX
  54.  
  55. Chart2XShapeTest::testPieChartLabels4 finished in: 1022ms
  56. Exception caught in XShapeDumper.cxx: NavigationOrder
  57. Exception caught in XShapeDumper.cxx: NavigationOrder
  58. Exception caught in XShapeDumper.cxx: NavigationOrder
  59. Exception caught in XShapeDumper.cxx: NavigationOrder
  60. Exception caught in XShapeDumper.cxx: NavigationOrder
  61. Exception caught in XShapeDumper.cxx: NavigationOrder
  62. Exception caught in XShapeDumper.cxx: NavigationOrder
  63. Exception caught in XShapeDumper.cxx: NavigationOrder
  64. Chart2XShapeTest::testTdf76649TrendLineBug finished in: 1190ms
  65. Exception caught in XShapeDumper.cxx: NavigationOrder
  66. Chart2XShapeTest::testTdf88154LabelRotatedLayout finished in: 1088ms
  67. D:/cygwin/home/Hearthstone/lode/dev/core/test/source/diff/diff.cxx(267) : error : Assertion
  68. Test name: Chart2XShapeTest::testPieChartLabels1
  69. double equality assertion failed
  70. - Expected: 26494
  71. - Actual : 26097
  72. - Delta : 1e-08
  73. - Reference: D:/cygwin/home/Hearthstone/lode/dev/core/chart2/qa/extras/xshape/data/reference/tdf90839-1.xml
  74. - Node: /XShapes/XShape[1]
  75. - Attr: sizeX
  76.  
  77. D:/cygwin/home/Hearthstone/lode/dev/core/test/source/diff/diff.cxx(267) : error : Assertion
  78. Test name: Chart2XShapeTest::testPieChartLabels2
  79. double equality assertion failed
  80. - Expected: 26494
  81. - Actual : 26097
  82. - Delta : 1e-08
  83. - Reference: D:/cygwin/home/Hearthstone/lode/dev/core/chart2/qa/extras/xshape/data/reference/tdf90839-2.xml
  84. - Node: /XShapes/XShape[1]
  85. - Attr: sizeX
  86.  
  87. D:/cygwin/home/Hearthstone/lode/dev/core/test/source/diff/diff.cxx(267) : error : Assertion
  88. Test name: Chart2XShapeTest::testPieChartLabels3
  89. double equality assertion failed
  90. - Expected: 26494
  91. - Actual : 26097
  92. - Delta : 1e-08
  93. - Reference: D:/cygwin/home/Hearthstone/lode/dev/core/chart2/qa/extras/xshape/data/reference/tdf90839-3.xml
  94. - Node: /XShapes/XShape[1]
  95. - Attr: sizeX
  96.  
  97. D:/cygwin/home/Hearthstone/lode/dev/core/test/source/diff/diff.cxx(267) : error : Assertion
  98. Test name: Chart2XShapeTest::testPieChartLabels4
  99. double equality assertion failed
  100. - Expected: 4436
  101. - Actual : 4367
  102. - Delta : 1e-08
  103. - Reference: D:/cygwin/home/Hearthstone/lode/dev/core/chart2/qa/extras/xshape/data/reference/tdf90839-4.xml
  104. - Node: /XShapes/XShape[2]
  105. - Attr: positionX
  106.  
  107. Failures !!!
  108. Run: 8 Failure total: 4 Failures: 4 Errors: 0
  109.  
  110. Error: a unit test failed, please do one of:
  111. make CppunitTest_chart2_xshape CPPUNITTRACE=TRUE # which is a shortcut for the following line
  112. make CppunitTest_chart2_xshape CPPUNITTRACE="'C:/Program Files (x86)/Microsoft Visual Studio/2017/Community/Common7/IDE/
  113. devenv.exe' /debugexe" # for interactive debugging in Visual Studio
  114. make CppunitTest_chart2_xshape CPPUNITTRACE="drmemory -free_max_frames 20" # for memory checking (install Dr.Memory firs
  115. t, and put it to your PATH)
  116.  
  117. You can limit the execution to just one particular test by:
  118.  
  119. make CppunitTest_chart2_xshape CPPUNIT_TEST_NAME="testXYZ" ...above mentioned params...
  120.  
  121. make[1]: *** [D:/cygwin/home/Hearthstone/lode/dev/core/solenv/gbuild/CppunitTest.mk:114: D:/cygwin/home/Hearthstone/lode
  122. /dev/core/workdir/CppunitTest/chart2_xshape.test] Error 1
  123. make[1]: *** Waiting for unfinished jobs....
  124. make: *** [Makefile:283: build] Error 2
RAW Paste Data