Guest User

Untitled

a guest
May 17th, 2020
26
Never
Not a member of Pastebin yet? Sign Up, it unlocks many cool features!
  1. 14:58:27.236
  2. 14:58:27.236 Corona Simulator 2020.3582 (Apr 19 2020 13:13:44)
  3. 14:58:27.236
  4. 14:58:30.196
  5. 14:58:30.196 Copyright (C) 2009-2020 C o r o n a L a b s I n c .
  6. 14:58:30.196 Version: 3.0.0
  7. 14:58:30.196 Build: 2020.3582
  8. 14:58:30.196 Platform: iPhone / x64 / 10.0 / Intel(R) HD Graphics 4400 / 4.3.0 - Build 20.19.15.4835 / 2020.3582 / ssy_ER | ER | ssy_ER | ssy
  9. 14:58:30.196 Loading project from: C:\sound_fused10
  10. 14:58:30.196 Project sandbox folder: C:\Users\pradeep6588\AppData\Local\Corona Labs\Corona Simulator\Sandbox\sound_fused10-E971F71C74225CB47A56956C0609AC91\Documents
  11. 14:58:30.963 PluginSync: plugin com.coronalabs/plugin.facebook.v4 needs to be updated for platform win32-sim to build number: 2932
  12. 14:58:30.963 PluginSync: downloading plugin: http://plugins.coronasphere.com/com.coronalabs/plugin.facebook.v4/2016.2932/win32-sim/plugin.facebook.v4.zip
  13. 14:58:31.073 PluginSync: plugin com.coronalabs/plugin.google.iap.v3 needs to be updated for platform win32-sim to build number: 3105
  14. 14:58:31.073 PluginSync: downloading plugin: http://plugins.coronasphere.com/com.coronalabs/plugin.google.iap.v3/2017.3105/win32-sim/plugin.google.iap.v3.zip
  15. 14:58:31.853 PluginSync: plugin com.coronalabs/plugin.advertisingId needs to be updated for platform win32-sim to build number: 3005
  16. 14:58:31.853 PluginSync: downloading plugin: http://plugins.coronasphere.com/com.coronalabs/plugin.advertisingId/2016.3005/win32-sim/plugin.advertisingId.zip
  17. 14:58:32.206 supersonic.init() WARNING: The Supersonic plugin is only supported on Android & iOS devices. Please build for device
  18. 14:58:54.915 WARNING: Runtime:addEventListener: real ios devices don't generate 'key' events
  19. 14:58:54.936 musicpoint:1
  20. 14:58:54.936 soundpoint:1
  21. 14:59:21.257 Testing credentials for 'C:\Users\pradeep6588\Downloads\zerotohero.keystore':
  22. 14:59:23.344 jar signed.
  23. 14:59:23.344 Picked up JAVA_TOOL_OPTIONS: -Duser.language=en
  24. 14:59:24.289 Using custom build id from app bundle: 00000 (AppSettings.lua)
  25. 14:59:24.289
  26. 14:59:24.289 Using custom Build Id 00000
  27. 14:59:24.289 Prepackage: Compiling Lua ...
  28. 14:59:24.899 Prepackage: Building server data file
  29. 14:59:24.899 Prepackage: running: "C:\Program Files (x86)\Java\jdk1.8.0_251\bin\java.exe" -Djava.class.path="C:\Program Files (x86)\Corona Labs\Corona\Resources/ant.jar;C:\Program Files (x86)\Corona Labs\Corona\Resources/ant-launcher.jar;C:\Program Files (x86)\Corona Labs\Corona\Resources/AntLiveManifest.jar" org.apache.tools.ant.launch.Launcher -d -DTEMP_DIR="C:\Users\PRADEE~1\AppData\Local\Temp\Corona Labs\CLtmpa10836" -DSRC_DIR="C:\sound_fused10" -DBUNDLE_DIR="C:\Program Files (x86)\Corona Labs\Corona\Resources" -DLIVE_BUILD=NO -DLIVE_BUILD_MANIFEST_FILE= -f "C:\Program Files (x86)\Corona Labs\Corona\Resources"/build.xml build-input-zip
  30. 14:59:27.256 Apache Ant version 1.8.1 compiled on April 30 2010
  31. 14:59:27.256 Buildfile: C:\Program Files (x86)\Corona Labs\Corona\Resources\build.xml
  32. 14:59:27.256 Adding reference: ant.PropertyHelper
  33. 14:59:27.256 Detected Java version: 1.6 in: C:\Program Files (x86)\Java\jdk1.8.0_251\jre
  34. 14:59:27.256 Detected OS: Windows 10
  35. 14:59:27.256 Adding reference: ant.ComponentHelper
  36. 14:59:27.256 Setting ro project property: LIVE_BUILD -> NO
  37. 14:59:27.256 Setting ro project property: BUNDLE_DIR -> C:\Program Files (x86)\Corona Labs\Corona\Resources
  38. 14:59:27.256 Setting ro project property: SRC_DIR -> C:\sound_fused10
  39. 14:59:27.256 Setting ro project property: TEMP_DIR -> C:\Users\PRADEE~1\AppData\Local\Temp\Corona Labs\CLtmpa10836
  40. 14:59:27.256 Setting ro project property: LIVE_BUILD_MANIFEST_FILE ->
  41. 14:59:27.256 Setting ro project property: ant.file -> C:\Program Files (x86)\Corona Labs\Corona\Resources\build.xml
  42. 14:59:27.256 Setting ro project property: ant.file.type -> file
  43. 14:59:27.256 Adding reference: ant.projectHelper
  44. 14:59:27.256 Adding reference: ant.parsing.context
  45. 14:59:27.256 Adding reference: ant.targets
  46. 14:59:27.256 parsing buildfile C:\Program Files (x86)\Corona Labs\Corona\Resources\build.xml with URI = file:/C:/Program%20Files%20(x86)/Corona%20Labs/Corona/Resources/build.xml
  47. 14:59:27.256 Setting ro project property: ant.project.name -> Corona Client Build
  48. 14:59:27.256 Adding reference: Corona Client Build
  49. 14:59:27.256 Setting ro project property: ant.project.default-target -> none
  50. 14:59:27.256 Setting ro project property: ant.file.Corona Client Build -> C:\Program Files (x86)\Corona Labs\Corona\Resources\build.xml
  51. 14:59:27.256 Setting ro project property: ant.file.type.Corona Client Build -> file
  52. 14:59:27.256 Project base dir set to: C:\Program Files (x86)\Corona Labs\Corona\Resources
  53. 14:59:27.256 +Target:
  54. 14:59:27.256 +Target: generate-live-build-manifest
  55. 14:59:27.256 +Target: check-gradle-bundle
  56. 14:59:27.256 +Target: setup-gradle-builds
  57. 14:59:27.256 +Target: build-input-zip
  58. 14:59:27.256 +Target: unzip-apk-template
  59. 14:59:27.256 +Target: find-main-application-icons
  60. 14:59:27.256 +Target: find-main-application-banner
  61. 14:59:27.256 +Target: find-ouya-application-icon
  62. 14:59:27.256 +Target: find-ouya-xiaomi-application-icon
  63. 14:59:27.256 +Target: find-default-notification-icons
  64. 14:59:27.256 +Target: copy-file
  65. 14:59:27.256 +Target: can-copy-file
  66. 14:59:27.256 +Target: delete-file
  67. 14:59:27.256 +Target: can-delete-file
  68. 14:59:27.256 +Target: insert-main-application-icons
  69. 14:59:27.256 +Target: insert-main-application-banner
  70. 14:59:27.256 +Target: insert-ouya-application-icon
  71. 14:59:27.256 +Target: insert-ouya-xiaomi-application-icon
  72. 14:59:27.256 +Target: insert-default-notification-icons
  73. 14:59:27.256 +Target: insert-assets-multi-icon
  74. 14:59:27.256 +Target: copy-apk-assets
  75. 14:59:27.256 +Target: copy-files-to-apk
  76. 14:59:27.256 +Target: sign-apk
  77. 14:59:27.256 +Target: sign-apk-md5
  78. 14:59:27.256 +Target: sign-apk-sha1
  79. 14:59:27.256 +Target: sign-apk-auto
  80. 14:59:27.256 +Target: build-unsigned-apk
  81. 14:59:27.256 +Target: build-signed-apk
  82. 14:59:27.256 +Target: build-expansion-file
  83. 14:59:27.256 +Target: copy-apk-to
  84. 14:59:27.256 +Target: copy-to
  85. 14:59:27.256 +Target: build
  86. 14:59:27.256 +Target: test-sign
  87. 14:59:27.256 Adding reference: ant.LocalProperties
  88. 14:59:27.256 parsing buildfile jar:file:/C:/Program%20Files%20(x86)/Corona%20Labs/Corona/Resources/ant.jar!/org/apache/tools/ant/antlib.xml with URI = jar:file:/C:/Program%20Files%20(x86)/Corona%20Labs/Corona/Resources/ant.jar!/org/apache/tools/ant/antlib.xml from a zip file
  89. 14:59:27.256 [property] Loading C:\Program Files (x86)\Corona Labs\Corona\Resources\build.properties
  90. 14:59:27.256 Setting project property: ANDROID_ROOT -> /usr/local/bin/android-sdk-mac_x86
  91. 14:59:27.256 Setting project property: ANDROID_API_VERSION -> android-8
  92. 14:59:27.256 Setting project property: USER_ACTIVITY_PATH -> com/ansca/test/analyticstest
  93. 14:59:27.256 Setting project property: ANDROID_VERSION -> android-8
  94. 14:59:27.256 Setting project property: USER_ACTIVITY_PACKAGE -> com.ansca.test.analyticstest
  95. 14:59:27.256 Setting project property: ANDROID_MIN_SDK_INTEGER_VERSION -> 8
  96. 14:59:27.256 Setting project property: CORONA_ROOT -> /Volumes/Ansca/code/main
  97. 14:59:27.256 Setting project property: USER_APP_DISPLAY_NAME -> analyticstest
  98. 14:59:27.256 Override ignored for property "SRC_DIR"
  99. 14:59:27.256 Setting project property: APK_APP_NAME -> MyCoronaActivity
  100. 14:59:27.256 Class org.apache.tools.ant.taskdefs.condition.Os loaded from parent loader (parentFirst)
  101. 14:59:27.256 Condition true; setting SCRIPT_EXT to exe
  102. 14:59:27.256 Setting project property: SCRIPT_EXT -> exe
  103. 14:59:27.256 Override ignored for property "SCRIPT_EXT"
  104. 14:59:27.256 Condition true; setting USE_OLD_TOUCH to true
  105. 14:59:27.256 Setting project property: USE_OLD_TOUCH -> true
  106. 14:59:27.256 Condition true; setting onWindows to true
  107. 14:59:27.256 Setting project property: onWindows -> true
  108. 14:59:27.256 Class org.apache.tools.ant.taskdefs.condition.Equals loaded from parent loader (parentFirst)
  109. 14:59:27.256 Condition false; not setting live.build
  110. 14:59:27.256 Adding reference: asset.fileset
  111. 14:59:27.256 [available] Found: C:\Program Files (x86)\Corona Labs\Corona\Native\Corona\android
  112. 14:59:27.256 Condition true; setting corona.native.android to C:\Program Files (x86)\Corona Labs\Corona\Resources/../Native/Corona/android
  113. 14:59:27.256 Setting project property: corona.native.android -> C:\Program Files (x86)\Corona Labs\Corona\Resources/../Native/Corona/android
  114. 14:59:27.256 [available] Unable to find C:\Program Files (x86)\Native\Corona\android
  115. 14:59:27.256 Condition false; not setting corona.native.android
  116. 14:59:27.256 [available] Unable to find ..\..\..\..\..\android
  117. 14:59:27.256 Condition false; not setting corona.native.android
  118. 14:59:27.256 [available] Unable to find C:\Users\pradeep6588\Library\Application Support\Corona\Native\Corona\android
  119. 14:59:27.256 Condition false; not setting corona.native.android
  120. 14:59:27.256 +Datatype copy-res-file org.apache.tools.ant.taskdefs.MacroInstance
  121. 14:59:27.256 [macrodef] creating macro copy-res-file
  122. 14:59:27.256 +Datatype copy-drawable-file org.apache.tools.ant.taskdefs.MacroInstance
  123. 14:59:27.257 [macrodef] creating macro copy-drawable-file
  124. 14:59:27.257 +Datatype copy-mipmap-file org.apache.tools.ant.taskdefs.MacroInstance
  125. 14:59:27.257 [macrodef] creating macro copy-mipmap-file
  126. 14:59:27.257 +Datatype copy-notification-icon org.apache.tools.ant.taskdefs.MacroInstance
  127. 14:59:27.257 [macrodef] creating macro copy-notification-icon
  128. 14:59:27.257 Setting ro project property: ant.project.invoked-targets -> build-input-zip
  129. 14:59:27.257 Attempting to create object of type org.apache.tools.ant.helper.DefaultExecutor
  130. 14:59:27.257 Adding reference: ant.executor
  131. 14:59:27.257 Build sequence for target(s) `build-input-zip' is [generate-live-build-manifest, check-gradle-bundle, setup-gradle-builds, build-input-zip]
  132. 14:59:27.257 Complete build sequence is [generate-live-build-manifest, check-gradle-bundle, setup-gradle-builds, build-input-zip, can-delete-file, unzip-apk-template, build-unsigned-apk, sign-apk-md5, sign-apk-sha1, can-copy-file, build-signed-apk, copy-files-to-apk, copy-apk-assets, test-sign, find-ouya-xiaomi-application-icon, insert-ouya-xiaomi-application-icon, copy-apk-to, sign-apk-auto, sign-apk, find-main-application-banner, insert-main-application-banner, find-main-application-icons, insert-main-application-icons, find-default-notification-icons, insert-default-notification-icons, insert-assets-multi-icon, build-expansion-file, copy-to, build, find-ouya-application-icon, insert-ouya-application-icon, copy-file, , delete-file]
  133. 14:59:27.257
  134. 14:59:27.257 generate-live-build-manifest:
  135. 14:59:27.257 Skipped because property 'live.build' not set.
  136. 14:59:27.257
  137. 14:59:27.257 check-gradle-bundle:
  138. 14:59:27.257 [available] Found: C:\Program Files (x86)\Corona Labs\Corona\Native\Corona\android\resource\android-template.zip
  139. 14:59:27.257 Setting project property: gradle.bundle.exists -> true
  140. 14:59:27.257
  141. 14:59:27.257 setup-gradle-builds:
  142. 14:59:27.257 [unzip] Expanding: C:\Program Files (x86)\Corona Labs\Corona\Native\Corona\android\resource\android-template.zip into C:\Users\PRADEE~1\AppData\Local\Temp\Corona Labs\CLtmpa10836
  143. 14:59:27.257 [unzip] extracting template/gradlew.bat
  144. 14:59:27.257 [unzip] expanding template/gradlew.bat to C:\Users\PRADEE~1\AppData\Local\Temp\Corona Labs\CLtmpa10836\template\gradlew.bat
  145. 14:59:27.257 [unzip] extracting template/setup.sh
  146. 14:59:27.257 [unzip] expanding template/setup.sh to C:\Users\PRADEE~1\AppData\Local\Temp\Corona Labs\CLtmpa10836\template\setup.sh
  147. 14:59:27.257 [unzip] extracting template/gradle.properties
  148. 14:59:27.257 [unzip] expanding template/gradle.properties to C:\Users\PRADEE~1\AppData\Local\Temp\Corona Labs\CLtmpa10836\template\gradle.properties
  149. 14:59:27.257 [unzip] extracting template/app/
  150. 14:59:27.257 [unzip] expanding template/app/ to C:\Users\PRADEE~1\AppData\Local\Temp\Corona Labs\CLtmpa10836\template\app
  151. 14:59:27.257 [unzip] extracting template/app/build.gradle.kts
  152. 14:59:27.257 [unzip] expanding template/app/build.gradle.kts to C:\Users\PRADEE~1\AppData\Local\Temp\Corona Labs\CLtmpa10836\template\app\build.gradle.kts
  153. 14:59:27.257 [unzip] extracting template/gradle/wrapper/gradle-wrapper.properties
  154. 14:59:27.257 [unzip] expanding template/gradle/wrapper/gradle-wrapper.properties to C:\Users\PRADEE~1\AppData\Local\Temp\Corona Labs\CLtmpa10836\template\gradle\wrapper\gradle-wrapper.properties
  155. 14:59:27.257 [unzip] extracting template/app/src/main/
  156. 14:59:27.257 [unzip] expanding template/app/src/main/ to C:\Users\PRADEE~1\AppData\Local\Temp\Corona Labs\CLtmpa10836\template\app\src\main
  157. 14:59:27.257 [unzip] extracting sdk/licenses/android-sdk-license
  158. 14:59:27.257 [unzip] expanding sdk/licenses/android-sdk-license to C:\Users\PRADEE~1\AppData\Local\Temp\Corona Labs\CLtmpa10836\sdk\licenses\android-sdk-license
  159. 14:59:27.257 [unzip] extracting template/app/buildTools/strings.xml
  160. 14:59:27.257 [unzip] expanding template/app/buildTools/strings.xml to C:\Users\PRADEE~1\AppData\Local\Temp\Corona Labs\CLtmpa10836\template\app\buildTools\strings.xml
  161. 14:59:27.257 [unzip] extracting template/app/_corona_splash_screen.png
  162. 14:59:27.257 [unzip] expanding template/app/_corona_splash_screen.png to C:\Users\PRADEE~1\AppData\Local\Temp\Corona Labs\CLtmpa10836\template\app\_corona_splash_screen.png
  163. 14:59:27.257 [unzip] extracting template/app/src/main/res/values/
  164. 14:59:27.257 [unzip] expanding template/app/src/main/res/values/ to C:\Users\PRADEE~1\AppData\Local\Temp\Corona Labs\CLtmpa10836\template\app\src\main\res\values
  165. 14:59:27.257 [unzip] extracting template/
  166. 14:59:27.257 [unzip] expanding template/ to C:\Users\PRADEE~1\AppData\Local\Temp\Corona Labs\CLtmpa10836\template
  167. 14:59:27.257 [unzip] extracting sdk/
  168. 14:59:27.257 [unzip] expanding sdk/ to C:\Users\PRADEE~1\AppData\Local\Temp\Corona Labs\CLtmpa10836\sdk
  169. 14:59:27.257 [unzip] extracting template/gradlew
  170. 14:59:27.257 [unzip] expanding template/gradlew to C:\Users\PRADEE~1\AppData\Local\Temp\Corona Labs\CLtmpa10836\template\gradlew
  171. 14:59:27.257 [unzip] extracting template/app/proguard-rules.pro
  172. 14:59:27.257 [unzip] expanding template/app/proguard-rules.pro to C:\Users\PRADEE~1\AppData\Local\Temp\Corona Labs\CLtmpa10836\template\app\proguard-rules.pro
  173. 14:59:27.257 [unzip] extracting template/app/buildTools/update_manifest.lua
  174. 14:59:27.257 [unzip] expanding template/app/buildTools/update_manifest.lua to C:\Users\PRADEE~1\AppData\Local\Temp\Corona Labs\CLtmpa10836\template\app\buildTools\update_manifest.lua
  175. 14:59:27.257 [unzip] extracting template/app/buildTools/convert_metadata.lua
  176. 14:59:27.257 [unzip] expanding template/app/buildTools/convert_metadata.lua to C:\Users\PRADEE~1\AppData\Local\Temp\Corona Labs\CLtmpa10836\template\app\buildTools\convert_metadata.lua
  177. 14:59:27.257 [unzip] extracting template/app/src/main/res/
  178. 14:59:27.257 [unzip] expanding template/app/src/main/res/ to C:\Users\PRADEE~1\AppData\Local\Temp\Corona Labs\CLtmpa10836\template\app\src\main\res
  179. 14:59:27.257 [unzip] extracting template/gradle/wrapper/
  180. 14:59:27.257 [unzip] expanding template/gradle/wrapper/ to C:\Users\PRADEE~1\AppData\Local\Temp\Corona Labs\CLtmpa10836\template\gradle\wrapper
  181. 14:59:27.257 [unzip] extracting template/gradle/wrapper/gradle-wrapper.jar
  182. 14:59:27.257 [unzip] expanding template/gradle/wrapper/gradle-wrapper.jar to C:\Users\PRADEE~1\AppData\Local\Temp\Corona Labs\CLtmpa10836\template\gradle\wrapper\gradle-wrapper.jar
  183. 14:59:27.257 [unzip] extracting template/settings.gradle.kts
  184. 14:59:27.257 [unzip] expanding template/settings.gradle.kts to C:\Users\PRADEE~1\AppData\Local\Temp\Corona Labs\CLtmpa10836\template\settings.gradle.kts
  185. 14:59:27.257 [unzip] extracting template/app/src/
  186. 14:59:27.257 [unzip] expanding template/app/src/ to C:\Users\PRADEE~1\AppData\Local\Temp\Corona Labs\CLtmpa10836\template\app\src
  187. 14:59:27.257 [unzip] extracting template/gradle/
  188. 14:59:27.257 [unzip] expanding template/gradle/ to C:\Users\PRADEE~1\AppData\Local\Temp\Corona Labs\CLtmpa10836\template\gradle
  189. 14:59:27.257 [unzip] extracting template/app/src/main/res/values/strings.xml
  190. 14:59:27.257 [unzip] expanding template/app/src/main/res/values/strings.xml to C:\Users\PRADEE~1\AppData\Local\Temp\Corona Labs\CLtmpa10836\template\app\src\main\res\values\strings.xml
  191. 14:59:27.257 [unzip] extracting template/app/buildTools/
  192. 14:59:27.257 [unzip] expanding template/app/buildTools/ to C:\Users\PRADEE~1\AppData\Local\Temp\Corona Labs\CLtmpa10836\template\app\buildTools
  193. 14:59:27.257 [unzip] extracting template/build.gradle.kts
  194. 14:59:27.257 [unzip] expanding template/build.gradle.kts to C:\Users\PRADEE~1\AppData\Local\Temp\Corona Labs\CLtmpa10836\template\build.gradle.kts
  195. 14:59:27.257 [unzip] extracting template/app/libs/licensing-google.jar
  196. 14:59:27.257 [unzip] expanding template/app/libs/licensing-google.jar to C:\Users\PRADEE~1\AppData\Local\Temp\Corona Labs\CLtmpa10836\template\app\libs\licensing-google.jar
  197. 14:59:27.257 [unzip] extracting template/app/buildTools/AndroidManifest.template.xml
  198. 14:59:27.257 [unzip] expanding template/app/buildTools/AndroidManifest.template.xml to C:\Users\PRADEE~1\AppData\Local\Temp\Corona Labs\CLtmpa10836\template\app\buildTools\AndroidManifest.template.xml
  199. 14:59:27.257 [unzip] extracting template/app/libs/
  200. 14:59:27.257 [unzip] expanding template/app/libs/ to C:\Users\PRADEE~1\AppData\Local\Temp\Corona Labs\CLtmpa10836\template\app\libs
  201. 14:59:27.257 [unzip] extracting sdk/licenses/
  202. 14:59:27.257 [unzip] expanding sdk/licenses/ to C:\Users\PRADEE~1\AppData\Local\Temp\Corona Labs\CLtmpa10836\sdk\licenses
  203. 14:59:27.257 [unzip] extracting template/setup.bat
  204. 14:59:27.257 [unzip] expanding template/setup.bat to C:\Users\PRADEE~1\AppData\Local\Temp\Corona Labs\CLtmpa10836\template\setup.bat
  205. 14:59:27.257 [unzip] extracting template/app/src/main/AndroidManifest.xml
  206. 14:59:27.257 [unzip] expanding template/app/src/main/AndroidManifest.xml to C:\Users\PRADEE~1\AppData\Local\Temp\Corona Labs\CLtmpa10836\template\app\src\main\AndroidManifest.xml
  207. 14:59:27.257 [unzip] expand complete
  208. 14:59:27.257 fileset: Setup scanner in dir C:\Program Files (x86)\Corona Labs\Corona\Native\Corona\android\lib\gradle with patternSet{ includes: [] excludes: [] }
  209. 14:59:27.257 [copy] Corona.aar added as Corona.aar doesn't exist.
  210. 14:59:27.257 [copy] added as is outdated.
  211. 14:59:27.257 [copy] Copying 1 file to C:\Users\PRADEE~1\AppData\Local\Temp\Corona Labs\CLtmpa10836\template\app\libs
  212. 14:59:27.257 [copy] Copying C:\Program Files (x86)\Corona Labs\Corona\Native\Corona\android\lib\gradle\Corona.aar to C:\Users\PRADEE~1\AppData\Local\Temp\Corona Labs\CLtmpa10836\template\app\libs\Corona.aar
  213. 14:59:27.257
  214. 14:59:27.257 build-input-zip:
  215. 14:59:27.257 Setting project property: USER_ZIP -> C:\Users\PRADEE~1\AppData\Local\Temp\Corona Labs\CLtmpa10836/input.zip
  216. 14:59:27.257 fileset: Setup scanner in dir C:\Users\PRADEE~1\AppData\Local\Temp\Corona Labs\CLtmpa10836 with patternSet{ includes: [] excludes: [resource.car] }
  217. 14:59:27.257 [zip] Building zip: C:\Users\PRADEE~1\AppData\Local\Temp\Corona Labs\CLtmpa10836\input.zip
  218. 14:59:27.257 [zip] adding directory sdk/
  219. 14:59:27.257 [zip] adding directory sdk/licenses/
  220. 14:59:27.257 [zip] adding directory template/
  221. 14:59:27.257 [zip] adding directory template/app/
  222. 14:59:27.257 [zip] adding directory template/app/buildTools/
  223. 14:59:27.257 [zip] adding directory template/app/libs/
  224. 14:59:27.257 [zip] adding directory template/app/src/
  225. 14:59:27.257 [zip] adding directory template/app/src/main/
  226. 14:59:27.257 [zip] adding directory template/app/src/main/res/
  227. 14:59:27.257 [zip] adding directory template/app/src/main/res/values/
  228. 14:59:27.257 [zip] adding directory template/gradle/
  229. 14:59:27.257 [zip] adding directory template/gradle/wrapper/
  230. 14:59:27.257 [zip] adding entry BoxChoose.lu
  231. 14:59:27.257 [zip] adding entry BoxChoose_ConvertPower.lu
  232. 14:59:27.257 [zip] adding entry BoxChoose_Destroy.lu
  233. 14:59:27.257 [zip] adding entry BoxChoose_Moves.lu
  234. 14:59:27.257 [zip] adding entry BoxChoose_Option.lu
  235. 14:59:27.257 [zip] adding entry BoxChoose_Shuffle.lu
  236. 14:59:27.257 [zip] adding entry BoxChoose_Swap.lu
  237. 14:59:27.257 [zip] adding entry BoxChoose_WonGold.lu
  238. 14:59:27.257 [zip] adding entry BoxChoose_WonGold_100.lu
  239. 14:59:27.257 [zip] adding entry BoxChoose_WonGold_1000.lu
  240. 14:59:27.257 [zip] adding entry BoxChoose_WonGold_200.lu
  241. 14:59:27.257 [zip] adding entry BoxChoose_WonGold_300.lu
  242. 14:59:27.257 [zip] adding entry BoxChoose_WonGold_400.lu
  243. 14:59:27.257 [zip] adding entry BoxChoose_WonGold_500.lu
  244. 14:59:27.257 [zip] adding entry BoxChoose_WonGold_600.lu
  245. 14:59:27.257 [zip] adding entry BoxChoose_WonGold_700.lu
  246. 14:59:27.257 [zip] adding entry BoxChoose_WonGold_800.lu
  247. 14:59:27.257 [zip] adding entry BoxChoose_WonGold_900.lu
  248. 14:59:27.257 [zip] adding entry BuyOverlay.lu
  249. 14:59:27.257 [zip] adding entry ConverterOverlay.lu
  250. 14:59:27.257 [zip] adding entry EnergyOverlay.lu
  251. 14:59:27.257 [zip] adding entry Fake_Overlay.lu
  252. 14:59:27.257 [zip] adding entry FreeGoldOverlay.lu
  253. 14:59:27.257 [zip] adding entry GoldOverlay.lu
  254. 14:59:27.257 [zip] adding entry MovingLevel_Overlay.lu
  255. 14:59:27.257 [zip] adding entry NoGoldOverlay.lu
  256. 14:59:27.257 [zip] adding entry NoLivesOverlay.lu
  257. 14:59:27.257 [zip] adding entry ShuffleOverlay.lu
  258. 14:59:27.257 [zip] adding entry SkyblueOverlay.lu
  259. 14:59:27.257 [zip] adding entry SkyblueOverlay_Battle.lu
  260. 14:59:27.257 [zip] adding entry SkyblueOverlay_Survival.lu
  261. 14:59:27.257 [zip] adding entry SkyblueOverlay_Upgrade.lu
  262. 14:59:27.257 [zip] adding entry SkyblueOverlay_quest.lu
  263. 14:59:27.257 [zip] adding entry SpellOverlay.lu
  264. 14:59:27.257 [zip] adding entry UpgradeLevelOverlay.lu
  265. 14:59:27.257 [zip] adding entry alert_campaign.lu
  266. 14:59:27.257 [zip] adding entry animationlevelfailed.lu
  267. 14:59:27.257 [zip] adding entry animationlevelupgrade.lu
  268. 14:59:27.257 [zip] adding entry build.properties
  269. 14:59:27.257 [zip] adding entry cavelayout.lu
  270. 14:59:27.257 [zip] adding entry caveoverlay.lu
  271. 14:59:27.257 [zip] adding entry caveoverlay_img.lu
  272. 14:59:27.257 [zip] adding entry chamber.lu
  273. 14:59:27.257 [zip] adding entry change.lu
  274. 14:59:27.257 [zip] adding entry change1.lu
  275. 14:59:27.257 [zip] adding entry change2.lu
  276. 14:59:27.257 [zip] adding entry change3.lu
  277. 14:59:27.257 [zip] adding entry config.lu
  278. 14:59:27.257 [zip] adding entry empty_overlay.lu
  279. 14:59:27.257 [zip] adding entry excludesfile.properties
  280. 14:59:27.257 [zip] adding entry help.lu
  281. 14:59:27.257 [zip] adding entry help1.lu
  282. 14:59:27.257 [zip] adding entry help2.lu
  283. 14:59:27.257 [zip] adding entry help3.lu
  284. 14:59:27.257 [zip] adding entry help4.lu
  285. 14:59:27.257 [zip] adding entry help5.lu
  286. 14:59:27.257 [zip] adding entry help6.lu
  287. 14:59:27.257 [zip] adding entry help7.lu
  288. 14:59:27.257 [zip] adding entry help8.lu
  289. 14:59:27.257 [zip] adding entry help9.lu
  290. 14:59:27.257 [zip] adding entry helpprofile.lu
  291. 14:59:27.257 [zip] adding entry hero.lu
  292. 14:59:27.257 [zip] adding entry level1.lu
  293. 14:59:27.257 [zip] adding entry level_finish.lu
  294. 14:59:27.257 [zip] adding entry level_finish1.lu
  295. 14:59:27.257 [zip] adding entry levelcomplete.lu
  296. 14:59:27.257 [zip] adding entry levelfailed.lu
  297. 14:59:27.257 [zip] adding entry logo.lu
  298. 14:59:27.257 [zip] adding entry main.lu
  299. 14:59:27.257 [zip] adding entry mapoverlay.lu
  300. 14:59:27.257 [zip] adding entry menu 1.lu
  301. 14:59:27.257 [zip] adding entry menu 2.lu
  302. 14:59:27.257 [zip] adding entry menu 3.lu
  303. 14:59:27.257 [zip] adding entry menu.lu
  304. 14:59:27.257 [zip] adding entry movieclip.lu
  305. 14:59:27.257 [zip] adding entry movieclip1.lu
  306. 14:59:27.257 [zip] adding entry netconnect.lu
  307. 14:59:27.257 [zip] adding entry newaudio.lu
  308. 14:59:27.257 [zip] adding entry nextlevel.lu
  309. 14:59:27.257 [zip] adding entry overlayimg1.lu
  310. 14:59:27.257 [zip] adding entry particle.lu
  311. 14:59:27.257 [zip] adding entry pauseoverlay menu pause.lu
  312. 14:59:27.257 [zip] adding entry pauseoverlay.lu
  313. 14:59:27.257 [zip] adding entry pauseoverlay1.lu
  314. 14:59:27.257 [zip] adding entry pauseoverlay2.lu
  315. 14:59:27.257 [zip] adding entry pauseoverlay3.lu
  316. 14:59:27.257 [zip] adding entry pauseoverlay4.lu
  317. 14:59:27.257 [zip] adding entry pauseoverlay5.lu
  318. 14:59:27.257 [zip] adding entry pauseoverlay6.lu
  319. 14:59:27.257 [zip] adding entry pauseoverlay61.lu
  320. 14:59:27.257 [zip] adding entry pauseoverlaycredit.lu
  321. 14:59:27.257 [zip] adding entry pauseoverlaysocialnet.lu
  322. 14:59:27.257 [zip] adding entry profile.lu
  323. 14:59:27.257 [zip] adding entry profilesettings.lu
  324. 14:59:27.257 [zip] adding entry retryumoverlay.lu
  325. 14:59:27.257 [zip] adding entry rightarrow.lu
  326. 14:59:27.257 [zip] adding entry rightarrow1.lu
  327. 14:59:27.257 [zip] adding entry rightarrow1profile.lu
  328. 14:59:27.257 [zip] adding entry rightarrowprofile.lu
  329. 14:59:27.257 [zip] adding entry rooki.lu
  330. 14:59:27.257 [zip] adding entry scene1.lu
  331. 14:59:27.257 [zip] adding entry sdk/licenses/android-sdk-license
  332. 14:59:27.257 [zip] adding entry settingscredit.lu
  333. 14:59:27.257 [zip] adding entry soldier.lu
  334. 14:59:27.257 [zip] adding entry storyboard.lu
  335. 14:59:27.257 [zip] adding entry template/app/_corona_splash_screen.png
  336. 14:59:27.257 [zip] adding entry template/app/build.gradle.kts
  337. 14:59:27.257 [zip] adding entry template/app/buildTools/AndroidManifest.template.xml
  338. 14:59:27.257 [zip] adding entry template/app/buildTools/convert_metadata.lua
  339. 14:59:27.257 [zip] adding entry template/app/buildTools/strings.xml
  340. 14:59:27.257 [zip] adding entry template/app/buildTools/update_manifest.lua
  341. 14:59:27.257 [zip] adding entry template/app/libs/Corona.aar
  342. 14:59:27.257 [zip] adding entry template/app/libs/licensing-google.jar
  343. 14:59:27.257 [zip] adding entry template/app/proguard-rules.pro
  344. 14:59:27.257 [zip] adding entry template/app/src/main/AndroidManifest.xml
  345. 14:59:27.257 [zip] adding entry template/app/src/main/res/values/strings.xml
  346. 14:59:27.257 [zip] adding entry template/build.gradle.kts
  347. 14:59:27.257 [zip] adding entry template/gradle.properties
  348. 14:59:27.257 [zip] adding entry template/gradle/wrapper/gradle-wrapper.jar
  349. 14:59:27.257 [zip] adding entry template/gradle/wrapper/gradle-wrapper.properties
  350. 14:59:27.257 [zip] adding entry template/gradlew
  351. 14:59:27.257 [zip] adding entry template/gradlew.bat
  352. 14:59:27.257 [zip] adding entry template/settings.gradle.kts
  353. 14:59:27.257 [zip] adding entry template/setup.bat
  354. 14:59:27.258 [zip] adding entry template/setup.sh
  355. 14:59:27.258 [zip] adding entry tile.lu
  356. 14:59:27.258 [zip] adding entry tryo.lu
  357. 14:59:27.258 [zip] adding entry tutom.lu
  358. 14:59:27.258 [zip] adding entry tutor.lu
  359. 14:59:27.258 [zip] adding entry tutorial.lu
  360. 14:59:27.258 [zip] adding entry tutorial_overlay.lu
  361. 14:59:27.258 [zip] adding entry tutorial_overlay1.lu
  362. 14:59:27.258 [zip] adding entry villager.lu
  363. 14:59:27.258 [zip] adding entry warrior.lu
  364. 14:59:27.258
  365. 14:59:27.258 BUILD SUCCESSFUL
  366. 14:59:27.258 Total time: 2 seconds
  367. 14:59:27.258 Picked up JAVA_TOOL_OPTIONS: -Duser.language=en
  368. 14:59:27.268 DeviceBuildData: {"isLaunchPadActive":false,"targetCertType":"distribution","targetPlatformVersion":140300,"debugBuildProcess":5,"targetDevice":0,"dailyBuildRevision":3582,"buildBucket":"ansca-templates","clientPlatform":"Win","targetAppStore":"google","targetPlatform":1,"clientDeviceId":"fb1afb3fd50b92f83c7549c8286e8703","plugins":{"plugin.google.play.services":{"supportedPlatforms":{"android":true},"publisherId":"com.coronalabs"},"plugin.google.iap.v3":{"supportedPlatforms":{"android":true},"publisherId":"com.coronalabs"},"plugin.advertisingId":{"publisherId":"com.coronalabs"},"plugin.facebook.v4":{"publisherId":"com.coronalabs"},"plugin.supersonic":{"publisherId":"com.coronalabs"},"CoronaProvider.gameNetwork.google":{"publisherId":"com.coronalabs"},"CoronaProvider.native.popup.social":{"publisherId":"com.coronalabs"}},"dailyBuildYear":2020,"clientProductId":"basic","appName":"z2h79"}
  369. 14:59:27.268 Build: running: cd /d "C:\Users\PRADEE~1\AppData\Local\Temp\Corona Labs\CLtmpa10836" && cd template && setup.bat && gradlew.bat buildCoronaApp --no-daemon -PconfigureCoronaPlugins=YES -PcoronaBuild=2020.3582 -PcoronaResourcesDir="C:\Program Files (x86)\Corona Labs\Corona\Resources" -PcoronaDstDir="C:\Users\pradeep6588\Documents\Corona Built Apps\one" -PcoronaTmpDir="C:\Users\PRADEE~1\AppData\Local\Temp\Corona Labs\CLtmpa10836" -PcoronaSrcDir="C:\sound_fused10" -PcoronaAppFileName="z2h79" -PcoronaAppPackage="com.outlook.fractals.Game_Final9" -PcoronaVersionCode=79 -PcoronaVersionName="79.0.0" -PcoronaKeystore="C:\Users\pradeep6588\Downloads\zerotohero.keystore" -PcoronaKeystorePassword="XXXXXX" -PcoronaKeyAlias="aliasname" -PcoronaTargetStore="google" -PcoronaKeyAliasPassword="XXXXXX" -PcoronaBuildData="C:\Users\PRADEE~1\AppData\Local\Temp\Corona Labs\CLtmpa10836\build.data" --console=plain
  370. 14:59:40.368 @ver > NUL
  371. 14:59:40.368 Exception in thread "DisconnectableInputStream source reader" org.gradle.api.UncheckedIOException: java.io.IOException: Access is denied
  372. 14:59:40.368 at org.gradle.internal.UncheckedException.throwAsUncheckedException(UncheckedException.java:61)
  373. 14:59:40.368 at org.gradle.internal.UncheckedException.throwAsUncheckedException(UncheckedException.java:41)
  374. 14:59:40.368 at org.gradle.util.DisconnectableInputStream$1.run(DisconnectableInputStream.java:125)
  375. 14:59:40.368 at java.lang.Thread.run(Thread.java:748)
  376. 14:59:40.368 Caused by: java.io.IOException: Access is denied
  377. 14:59:40.368 at java.io.FileInputStream.readBytes(Native Method)
  378. 14:59:40.368 at java.io.FileInputStream.read(FileInputStream.java:255)
  379. 14:59:40.368 at java.io.BufferedInputStream.fill(BufferedInputStream.java:246)
  380. 14:59:40.368 at java.io.BufferedInputStream.read1(BufferedInputStream.java:286)
  381. 14:59:40.368 at java.io.BufferedInputStream.read(BufferedInputStream.java:345)
  382. 14:59:40.368 at org.gradle.util.DisconnectableInputStream$1.run(DisconnectableInputStream.java:96)
  383. 14:59:40.368 ... 1 more
  384. 14:59:40.368
  385. 14:59:40.368 FAILURE: Build failed with an exception.
  386. 14:59:40.368
  387. 14:59:40.368 * Where:
  388. 14:59:40.368 Build file 'C:\Users\pradeep6588\AppData\Local\Temp\Corona Labs\CLtmpa10836\template\app\build.gradle.kts' line: 10
  389. 14:59:40.368
  390. 14:59:40.368 * What went wrong:
  391. 14:59:40.368 An exception occurred applying plugin request [id: 'com.android.application']
  392. 14:59:40.368 > Failed to apply plugin [id 'com.android.application']
  393. 14:59:40.368 > Could not create plugin of type 'AppPlugin'.
  394. 14:59:40.368 > Could not generate a decorated class for class com.android.build.gradle.AppPlugin.
  395. 14:59:40.368 > com/android/builder/model/BuildType
  396. 14:59:40.368
  397. 14:59:40.368 * Try:
  398. 14:59:40.368 Run with --stacktrace option to get the stack trace. Run with --info or --debug option to get more log output. Run with --scan to get full insights.
  399. 14:59:40.368
  400. 14:59:40.368 * Get more help at https://help.gradle.org
  401. 14:59:40.368
  402. 14:59:40.368 BUILD FAILED in 12s
  403. 14:59:40.368 Picked up JAVA_TOOL_OPTIONS: -Duser.language=en
  404. 14:59:40.875 Android build failed (1) after 16 seconds
RAW Paste Data