SHARE
TWEET

Untitled

a guest Nov 5th, 2012 162 Never
Not a member of Pastebin yet? Sign Up, it unlocks many cool features!
  1. 1>------ Rebuild All started: Project: OgreMain, Configuration: Debug Win32 ------
  2. 2>------ Rebuild All started: Project: LibMNG, Configuration: Debug Win32 ------
  3. 3>------ Rebuild All started: Project: zlib, Configuration: Debug Win32 ------
  4. 4>------ Rebuild All started: Project: LibJPEG, Configuration: Debug Win32 ------
  5. 5>------ Rebuild All started: Project: LibOpenJPEG, Configuration: Debug Win32 ------
  6. 6>------ Rebuild All started: Project: LibPNG, Configuration: Debug Win32 ------
  7. 7>------ Rebuild All started: Project: LibRawLite, Configuration: Debug Win32 ------
  8. 8>------ Rebuild All started: Project: LibTIFF, Configuration: Debug Win32 ------
  9. 1>  OgreTimer.cpp
  10. 1>  compile_OgreMain_0.cpp
  11. 1>  compile_OgreMain_1.cpp
  12. 1>  compile_OgreMain_2.cpp
  13. 1>  compile_OgreMain_3.cpp
  14. 2>  libmng_callback_xs.c
  15. 3>  zutil.c
  16. 7>  libraw_cxx.cpp
  17. 8>  tif_aux.c
  18. 3>  uncompr.c
  19. 3>  trees.c
  20. 4>  jaricom.c
  21. 6>  png.c
  22. 4>  jcapimin.c
  23. 5>  bio.c
  24. 3>  inftrees.c
  25. 8>  tif_close.c
  26. 2>  libmng_chunk_descr.c
  27. 3>  inflate.c
  28. 8>  tif_codec.c
  29. 4>  jcapistd.c
  30. 3>  inffast.c
  31. 8>  tif_color.c
  32. 5>  cio.c
  33. 6>  pngerror.c
  34. 4>  jcarith.c
  35. 3>  infback.c
  36. 8>  tif_compress.c
  37. 3>  gzio.c
  38. 4>  jccoefct.c
  39. 6>  pnggccrd.c
  40. 6>  pngget.c
  41. 5>  dwt.c
  42. 8>  tif_dir.c
  43. 3>h:\assaframan-ogre-dependencies-for-windows-phone-f16159239e75\src\zlib-1.2.3\gzio.c(131): warning C4996: 'strcpy': This function or variable may be unsafe. Consider using strcpy_s instead. To disable deprecation, use _CRT_SECURE_NO_WARNINGS. See online help for details.
  44. 3>          g:\microsoft visual studio 11.0\vc\wpsdk\wp80\include\string.h(110) : see declaration of 'strcpy'
  45. 3>h:\assaframan-ogre-dependencies-for-windows-phone-f16159239e75\src\zlib-1.2.3\gzio.c(181): warning C4996: 'fopen': This function or variable may be unsafe. Consider using fopen_s instead. To disable deprecation, use _CRT_SECURE_NO_WARNINGS. See online help for details.
  46. 3>          g:\microsoft visual studio 11.0\vc\wpsdk\wp80\include\stdio.h(218) : see declaration of 'fopen'
  47. 3>h:\assaframan-ogre-dependencies-for-windows-phone-f16159239e75\src\zlib-1.2.3\gzio.c(226): warning C4996: 'sprintf': This function or variable may be unsafe. Consider using sprintf_s instead. To disable deprecation, use _CRT_SECURE_NO_WARNINGS. See online help for details.
  48. 3>          g:\microsoft visual studio 11.0\vc\wpsdk\wp80\include\stdio.h(357) : see declaration of 'sprintf'
  49. 3>h:\assaframan-ogre-dependencies-for-windows-phone-f16159239e75\src\zlib-1.2.3\gzio.c(627): warning C4996: '_vsnprintf': This function or variable may be unsafe. Consider using _vsnprintf_s instead. To disable deprecation, use _CRT_SECURE_NO_WARNINGS. See online help for details.
  50. 3>          g:\microsoft visual studio 11.0\vc\wpsdk\wp80\include\stdio.h(349) : see declaration of '_vsnprintf'
  51. 2>  libmng_chunk_io.c
  52. 4>  jccolor.c
  53. 3>h:\assaframan-ogre-dependencies-for-windows-phone-f16159239e75\src\zlib-1.2.3\gzio.c(1001): warning C4996: 'strerror': This function or variable may be unsafe. Consider using strerror_s instead. To disable deprecation, use _CRT_SECURE_NO_WARNINGS. See online help for details.
  54. 3>          g:\microsoft visual studio 11.0\vc\wpsdk\wp80\include\string.h(164) : see declaration of 'strerror'
  55. 3>h:\assaframan-ogre-dependencies-for-windows-phone-f16159239e75\src\zlib-1.2.3\gzio.c(1008): warning C4996: 'strcpy': This function or variable may be unsafe. Consider using strcpy_s instead. To disable deprecation, use _CRT_SECURE_NO_WARNINGS. See online help for details.
  56. 3>          g:\microsoft visual studio 11.0\vc\wpsdk\wp80\include\string.h(110) : see declaration of 'strcpy'
  57. 3>h:\assaframan-ogre-dependencies-for-windows-phone-f16159239e75\src\zlib-1.2.3\gzio.c(1009): warning C4996: 'strcat': This function or variable may be unsafe. Consider using strcat_s instead. To disable deprecation, use _CRT_SECURE_NO_WARNINGS. See online help for details.
  58. 3>          g:\microsoft visual studio 11.0\vc\wpsdk\wp80\include\string.h(115) : see declaration of 'strcat'
  59. 3>h:\assaframan-ogre-dependencies-for-windows-phone-f16159239e75\src\zlib-1.2.3\gzio.c(1010): warning C4996: 'strcat': This function or variable may be unsafe. Consider using strcat_s instead. To disable deprecation, use _CRT_SECURE_NO_WARNINGS. See online help for details.
  60. 3>          g:\microsoft visual studio 11.0\vc\wpsdk\wp80\include\string.h(115) : see declaration of 'strcat'
  61. 3>  deflate.c
  62. 6>  pngmem.c
  63. 4>  jcdctmgr.c
  64. 8>  tif_dirinfo.c
  65. 7>  libraw_c_api.cpp
  66. 5>  event.c
  67. 3>  crc32.c
  68. 8>h:\assaframan-ogre-dependencies-for-windows-phone-f16159239e75\src\freeimage-3.13.1\source\libtiff\tif_dirinfo.c(799): warning C4996: '_lfind': The POSIX name for this item is deprecated. Instead, use the ISO C++ conformant name: _lfind. See online help for details.
  69. 8>          g:\microsoft visual studio 11.0\vc\wpsdk\wp80\include\search.h(53) : see declaration of '_lfind'
  70. 6>  pngpread.c
  71. 2>  libmng_chunk_prc.c
  72. 5>  image.c
  73. 8>  tif_dirread.c
  74. 3>  compress.c
  75. 4>  jchuff.c
  76. 3>  adler32.c
  77. 7>  dcraw_fileio.cpp
  78. 3>  Generating Code...
  79. 2>  libmng_chunk_xs.c
  80. 4>  jcinit.c
  81. 5>  j2k.c
  82. 6>  pngread.c
  83. 8>  tif_dirwrite.c
  84. 4>  jcmainct.c
  85. 8>  tif_dumpmode.c
  86. 6>  pngrio.c
  87. 4>  jcmarker.c
  88. 3>  zlib.2012.WinRT.vcxproj -> H:\assaframan-ogre-dependencies-for-windows-phone-f16159239e75\src\zlib-1.2.3\projects\visualc6\.\Win32_LIB_Debug\zlibd.lib
  89. 3>  The system cannot find the path specified.
  90. 3>          0 file(s) copied.
  91. 3>          1 file(s) copied.
  92. 3>          1 file(s) copied.
  93. 8>  tif_error.c
  94. 7>  dcraw_common.cpp
  95. 2>  libmng_cms.c
  96. 6>  pngrtran.c
  97. 4>  jcmaster.c
  98. 5>  j2k_lib.c
  99. 5>  jp2.c
  100. 8>  tif_extension.c
  101. 4>  jcomapi.c
  102. 2>  libmng_display.c
  103. 8>  tif_fax3.c
  104. 6>  pngrutil.c
  105. 5>  jpt.c
  106. 4>  jcparam.c
  107. 9>------ Rebuild All started: Project: OpenEXR, Configuration: Debug Win32 ------
  108. 8>  tif_fax3sm.c
  109. 5>  mct.c
  110. 4>  jcprepct.c
  111. 6>  pngset.c
  112. 8>  tif_flush.c
  113. 2>  libmng_dither.c
  114. 4>  jcsample.c
  115. 8>  tif_getimage.c
  116. 6>  pngtrans.c
  117. 5>  mqc.c
  118. 9>  ImfAttribute.cpp
  119. 2>  libmng_error.c
  120. 4>  jctrans.c
  121. 6>  pngvcrd.c
  122. 6>  pngwio.c
  123. 5>  openjpeg.c
  124. 4>  jdapimin.c
  125. 8>  tif_jpeg.c
  126. 2>  libmng_filter.c
  127. 7>  Generating Code...
  128. 6>  pngwrite.c
  129. 4>  jdapistd.c
  130. 2>  libmng_hlapi.c
  131. 5>  pi.c
  132. 7>C:\Program Files (x86)\MSBuild\Microsoft.Cpp\v4.0\V110\Microsoft.CppBuild.targets(1299,5): warning MSB8012: TargetPath(H:\ogre\Debug\LibRawLite.lib) does not match the Library's OutputFile property value (H:\assaframan-ogre-dependencies-for-windows-phone-f16159239e75\src\FreeImage-3.13.1\Source\LibRawLite\Debug\LibRawLite.lib). This may cause your project to build incorrectly. To correct this, please make sure that $(OutDir), $(TargetName) and $(TargetExt) property values match the value specified in %(Lib.OutputFile).
  133. 4>  jdarith.c
  134. 7>  LibRawLite.2012.WinRT.vcxproj -> H:\ogre\Debug\LibRawLite.lib
  135. 6>  pngwtran.c
  136. 4>  Generating Code...
  137. 5>  raw.c
  138. 2>  libmng_jpeg.c
  139. 8>  tif_luv.c
  140. 6>  pngwutil.c
  141. 5>  t1.c
  142. 2>  libmng_object_prc.c
  143. 4>  Compiling...
  144. 4>  jdatadst.c
  145. 6>  Generating Code...
  146. 10>------ Rebuild All started: Project: ZLib-freeImage, Configuration: Debug Win32 ------
  147. 8>  tif_lzw.c
  148. 8>  tif_next.c
  149. 5>  t2.c
  150. 4>  jdatasrc.c
  151. 10>  adler32.c
  152. 8>  Generating Code...
  153. 10>  compress.c
  154. 6>  LibPNG.2012.WinRT.vcxproj -> H:\assaframan-ogre-dependencies-for-windows-phone-f16159239e75\src\FreeImage-3.13.1\Source\LibPNG\.\Debug\LibPNG.lib
  155. 2>  libmng_pixels.c
  156. 10>  crc32.c
  157. 4>  jdcoefct.c
  158. 5>  tcd.c
  159. 10>  deflate.c
  160. 8>  Compiling...
  161. 8>  tif_ojpeg.c
  162. 4>  jdcolor.c
  163. 11>------ Rebuild All started: Project: freetype, Configuration: Debug Win32 ------
  164. 2>  libmng_prop_xs.c
  165. 5>  tgt.c
  166. 10>  gzio.c
  167. 4>  jddctmgr.c
  168. 8>h:\assaframan-ogre-dependencies-for-windows-phone-f16159239e75\src\freeimage-3.13.1\source\libtiff\tif_ojpeg.c(651): warning C4244: '=' : conversion from 'tsample_t' to 'uint8', possible loss of data
  169. 8>h:\assaframan-ogre-dependencies-for-windows-phone-f16159239e75\src\freeimage-3.13.1\source\libtiff\tif_ojpeg.c(1009): warning C4244: '=' : conversion from 'uint16' to 'uint8', possible loss of data
  170. 5>  Generating Code...
  171. 2>  libmng_read.c
  172. 4>  jdhuff.c
  173. 10>  infback.c
  174. 2>  libmng_trace.c
  175. 4>  jdinput.c
  176. 10>  inffast.c
  177. 8>  tif_open.c
  178. 10>  inflate.c
  179. 4>  jdmainct.c
  180. 2>  libmng_write.c
  181. 11>  autofit.c
  182. 11>C:\Program Files (x86)\Windows Phone Kits\8.0\Include\sal.h(172): warning C4001: nonstandard extension 'single line comment' was used
  183. 8>  tif_packbits.c
  184. 4>  jdmarker.c
  185. 10>  inftrees.c
  186. 2>  libmng_zlib.c
  187. 10>  trees.c
  188. 8>  tif_pixarlog.c
  189. 4>  jdmaster.c
  190. 2>  Generating Code...
  191. 10>  uncompr.c
  192. 11>h:\assaframan-ogre-dependencies-for-windows-phone-f16159239e75\src\freetype-2.3.11\src\autofit\afhints.c(555): warning C4100: 'get_inflections' : unreferenced formal parameter
  193. 10>  zutil.c
  194. 4>  jdmerge.c
  195. 8>  tif_predict.c
  196. 10>  Generating Code...
  197. 8>  tif_print.c
  198. 4>  jdpostct.c
  199. 11>  bdf.c
  200. 11>C:\Program Files (x86)\Windows Phone Kits\8.0\Include\sal.h(172): warning C4001: nonstandard extension 'single line comment' was used
  201. 4>  jdsample.c
  202. 8>  tif_read.c
  203. 10>C:\Program Files (x86)\MSBuild\Microsoft.Cpp\v4.0\V110\Microsoft.CppBuild.targets(1299,5): warning MSB8012: TargetPath(H:\assaframan-ogre-dependencies-for-windows-phone-f16159239e75\src\FreeImage-3.13.1\Source\ZLib\.\Debug\ZLib-freeImage.lib) does not match the Library's OutputFile property value (H:\assaframan-ogre-dependencies-for-windows-phone-f16159239e75\src\FreeImage-3.13.1\Source\ZLib\Debug\ZLib.lib). This may cause your project to build incorrectly. To correct this, please make sure that $(OutDir), $(TargetName) and $(TargetExt) property values match the value specified in %(Lib.OutputFile).
  204. 10>C:\Program Files (x86)\MSBuild\Microsoft.Cpp\v4.0\V110\Microsoft.CppBuild.targets(1301,5): warning MSB8012: TargetName(ZLib-freeImage) does not match the Library's OutputFile property value (ZLib). This may cause your project to build incorrectly. To correct this, please make sure that $(OutDir), $(TargetName) and $(TargetExt) property values match the value specified in %(Lib.OutputFile).
  205. 4>  jdtrans.c
  206. 10>  ZLib.FreeImage.2012.WinRT.vcxproj -> H:\assaframan-ogre-dependencies-for-windows-phone-f16159239e75\src\FreeImage-3.13.1\Source\ZLib\.\Debug\ZLib-freeImage.lib
  207. 8>  tif_strip.c
  208. 12>------ Rebuild All started: Project: zziplib, Configuration: Debug Win32 ------
  209. 4>  jerror.c
  210. 11>  cff.c
  211. 11>C:\Program Files (x86)\Windows Phone Kits\8.0\Include\sal.h(172): warning C4001: nonstandard extension 'single line comment' was used
  212. 8>  tif_swab.c
  213. 4>  jfdctflt.c
  214. 8>  tif_thunder.c
  215. 4>  jfdctfst.c
  216. 8>  tif_tile.c
  217. 12>  zip.c
  218. 4>  jfdctint.c
  219. 8>  tif_version.c
  220. 8>  tif_warning.c
  221. 12>h:\assaframan-ogre-dependencies-for-windows-phone-f16159239e75\src\zziplib-0.13.57\zzip\zip.c(412): warning C4244: 'function' : conversion from 'zzip_off64_t' to 'size_t', possible loss of data
  222. 12>h:\assaframan-ogre-dependencies-for-windows-phone-f16159239e75\src\zziplib-0.13.57\zzip\zip.c(458): warning C4244: 'function' : conversion from 'zzip_off64_t' to 'zzip_off_t', possible loss of data
  223. 12>h:\assaframan-ogre-dependencies-for-windows-phone-f16159239e75\src\zziplib-0.13.57\zzip\zip.c(501): warning C4244: '=' : conversion from 'uint16_t' to 'uint8_t', possible loss of data
  224. 4>  jidctflt.c
  225. 8>  tif_write.c
  226. 12>  stat.c
  227. 4>  jidctfst.c
  228. 8>h:\assaframan-ogre-dependencies-for-windows-phone-f16159239e75\src\freeimage-3.13.1\source\libtiff\tif_write.c(633): warning C4018: '>=' : signed/unsigned mismatch
  229. 8>  tif_zip.c
  230. 11>  ftbase.c
  231. 12>  plugin.c
  232. 11>C:\Program Files (x86)\Windows Phone Kits\8.0\Include\sal.h(172): warning C4001: nonstandard extension 'single line comment' was used
  233. 4>  Generating Code...
  234. 8>  Generating Code...
  235. 12>h:\assaframan-ogre-dependencies-for-windows-phone-f16159239e75\src\zziplib-0.13.57\zzip\plugin.c(47): warning C4996: 'open': The POSIX name for this item is deprecated. Instead, use the ISO C++ conformant name: _open. See online help for details.
  236. 12>          g:\microsoft visual studio 11.0\vc\wpsdk\wp80\include\io.h(315) : see declaration of 'open'
  237. 12>h:\assaframan-ogre-dependencies-for-windows-phone-f16159239e75\src\zziplib-0.13.57\zzip\plugin.c(48): warning C4996: 'close': The POSIX name for this item is deprecated. Instead, use the ISO C++ conformant name: _close. See online help for details.
  238. 12>          g:\microsoft visual studio 11.0\vc\wpsdk\wp80\include\io.h(305) : see declaration of 'close'
  239. 12>  info.c
  240. 4>  Compiling...
  241. 4>  jidctint.c
  242. 12>  file.c
  243. 12>h:\assaframan-ogre-dependencies-for-windows-phone-f16159239e75\src\zziplib-0.13.57\zzip\file.c(845): warning C4996: 'strdup': The POSIX name for this item is deprecated. Instead, use the ISO C++ conformant name: _strdup. See online help for details.
  244. 12>          g:\microsoft visual studio 11.0\vc\wpsdk\wp80\include\string.h(241) : see declaration of 'strdup'
  245. 12>  fetch.c
  246. 4>  jmemmgr.c
  247. 2>  LibMNG.2012.WinRT.vcxproj -> H:\assaframan-ogre-dependencies-for-windows-phone-f16159239e75\src\FreeImage-3.13.1\Source\LibMNG\.\Debug\LibMNG.lib
  248. 12>  err.c
  249. 11>  ftbitmap.c
  250. 11>C:\Program Files (x86)\Windows Phone Kits\8.0\Include\sal.h(172): warning C4001: nonstandard extension 'single line comment' was used
  251. 4>h:\assaframan-ogre-dependencies-for-windows-phone-f16159239e75\src\freeimage-3.13.1\source\libjpeg\jmemmgr.c(1106): warning C4013: 'getenv' undefined; assuming extern returning int
  252. 4>h:\assaframan-ogre-dependencies-for-windows-phone-f16159239e75\src\freeimage-3.13.1\source\libjpeg\jmemmgr.c(1106): warning C4047: '=' : 'char *' differs in levels of indirection from 'int'
  253. 12>  dir.c
  254. 4>  jmemnobs.c
  255. 11>  ftcache.c
  256. 11>C:\Program Files (x86)\Windows Phone Kits\8.0\Include\sal.h(172): warning C4001: nonstandard extension 'single line comment' was used
  257. 4>  jquant1.c
  258. 8>  LibTIFF.2012.WinRT.vcxproj -> H:\assaframan-ogre-dependencies-for-windows-phone-f16159239e75\src\FreeImage-3.13.1\Source\LibTIFF\.\Debug\LibTIFF.lib
  259. 12>h:\assaframan-ogre-dependencies-for-windows-phone-f16159239e75\src\zziplib-0.13.57\zzip\dir.c(267): warning C4996: 'strdup': The POSIX name for this item is deprecated. Instead, use the ISO C++ conformant name: _strdup. See online help for details.
  260. 12>          g:\microsoft visual studio 11.0\vc\wpsdk\wp80\include\string.h(241) : see declaration of 'strdup'
  261. 13>------ Rebuild All started: Project: OIS, Configuration: Debug Win32 ------
  262. 4>  jquant2.c
  263. 12>  Generating Code...
  264. 4>  jutils.c
  265. 13>  The system cannot find the path specified.
  266. 13>  H:\assaframan-ogre-dependencies-for-windows-phone-f16159239e75\src\ois-1.2.0\Win32\..\includes\OIS.h
  267. 13>  The system cannot find the path specified.
  268. 13>          0 file(s) copied.
  269. 13>C:\Program Files (x86)\MSBuild\Microsoft.Cpp\v4.0\V110\Microsoft.CppCommon.targets(134,5): error MSB3073: The command "mkdir "H:\ogre\..\include\OIS"
  270. 13>C:\Program Files (x86)\MSBuild\Microsoft.Cpp\v4.0\V110\Microsoft.CppCommon.targets(134,5): error MSB3073: copy "H:\assaframan-ogre-dependencies-for-windows-phone-f16159239e75\src\ois-1.2.0\Win32\..\includes\*.*" "H:\ogre\..\include\OIS" /y
  271. 13>C:\Program Files (x86)\MSBuild\Microsoft.Cpp\v4.0\V110\Microsoft.CppCommon.targets(134,5): error MSB3073:
  272. 13>C:\Program Files (x86)\MSBuild\Microsoft.Cpp\v4.0\V110\Microsoft.CppCommon.targets(134,5): error MSB3073: :VCEnd" exited with code 1.
  273. 4>  transupp.c
  274. 11>  ftfstype.c
  275. 11>C:\Program Files (x86)\Windows Phone Kits\8.0\Include\sal.h(172): warning C4001: nonstandard extension 'single line comment' was used
  276. 12>  zziplib.2012.WinRT.vcxproj -> H:\assaframan-ogre-dependencies-for-windows-phone-f16159239e75\src\zziplib-0.13.57\msvc8\Debug\zziplibd.lib
  277. 12>          1 file(s) copied.
  278. 12>  A subdirectory or file H:\assaframan-ogre-dependencies-for-windows-phone-f16159239e75\src\zziplib-0.13.57\msvc8\..\..\..\include\zzip already exists.
  279. 12>          1 file(s) copied.
  280. 12>          1 file(s) copied.
  281. 12>          1 file(s) copied.
  282. 12>          1 file(s) copied.
  283. 12>          1 file(s) copied.
  284. 11>  ftgasp.c
  285. 4>  Generating Code...
  286. 11>C:\Program Files (x86)\Windows Phone Kits\8.0\Include\sal.h(172): warning C4001: nonstandard extension 'single line comment' was used
  287. 11>  ftglyph.c
  288. 11>C:\Program Files (x86)\Windows Phone Kits\8.0\Include\sal.h(172): warning C4001: nonstandard extension 'single line comment' was used
  289. 11>  ftgzip.c
  290. 11>C:\Program Files (x86)\Windows Phone Kits\8.0\Include\sal.h(172): warning C4001: nonstandard extension 'single line comment' was used
  291. 9>  ImfB44Compressor.cpp
  292. 4>  LibJPEG.2012.WinRT.vcxproj -> H:\assaframan-ogre-dependencies-for-windows-phone-f16159239e75\src\FreeImage-3.13.1\Source\LibJPEG\.\Debug\LibJPEG.lib
  293. 11>  ftinit.c
  294. 11>C:\Program Files (x86)\Windows Phone Kits\8.0\Include\sal.h(172): warning C4001: nonstandard extension 'single line comment' was used
  295. 11>  ftlzw.c
  296. 11>C:\Program Files (x86)\Windows Phone Kits\8.0\Include\sal.h(172): warning C4001: nonstandard extension 'single line comment' was used
  297. 11>  ftstroke.c
  298. 11>C:\Program Files (x86)\Windows Phone Kits\8.0\Include\sal.h(172): warning C4001: nonstandard extension 'single line comment' was used
  299. 11>  ftsystem.c
  300. 11>C:\Program Files (x86)\Windows Phone Kits\8.0\Include\sal.h(172): warning C4001: nonstandard extension 'single line comment' was used
  301. 11>  smooth.c
  302. 11>C:\Program Files (x86)\Windows Phone Kits\8.0\Include\sal.h(172): warning C4001: nonstandard extension 'single line comment' was used
  303. 11>  ftbbox.c
  304. 11>C:\Program Files (x86)\Windows Phone Kits\8.0\Include\sal.h(172): warning C4001: nonstandard extension 'single line comment' was used
  305. 11>  ftmm.c
  306. 11>C:\Program Files (x86)\Windows Phone Kits\8.0\Include\sal.h(172): warning C4001: nonstandard extension 'single line comment' was used
  307. 11>  ftpfr.c
  308. 11>C:\Program Files (x86)\Windows Phone Kits\8.0\Include\sal.h(172): warning C4001: nonstandard extension 'single line comment' was used
  309. 11>  ftsynth.c
  310. 11>C:\Program Files (x86)\Windows Phone Kits\8.0\Include\sal.h(172): warning C4001: nonstandard extension 'single line comment' was used
  311. 9>h:\assaframan-ogre-dependencies-for-windows-phone-f16159239e75\src\freeimage-3.13.1\source\openexr\ilmimf\imfb44compressor.cpp(322): warning C4244: '=' : conversion from 'unsigned short' to 'unsigned char', possible loss of data
  312. 9>h:\assaframan-ogre-dependencies-for-windows-phone-f16159239e75\src\freeimage-3.13.1\source\openexr\ilmimf\imfb44compressor.cpp(343): warning C4244: '=' : conversion from 'unsigned short' to 'unsigned char', possible loss of data
  313. 11>  fttype1.c
  314. 11>C:\Program Files (x86)\Windows Phone Kits\8.0\Include\sal.h(172): warning C4001: nonstandard extension 'single line comment' was used
  315. 11>  Generating Code...
  316. 11>  Compiling...
  317. 11>  ftwinfnt.c
  318. 11>C:\Program Files (x86)\Windows Phone Kits\8.0\Include\sal.h(172): warning C4001: nonstandard extension 'single line comment' was used
  319. 9>  ImfBoxAttribute.cpp
  320. 11>  pcf.c
  321. 11>C:\Program Files (x86)\Windows Phone Kits\8.0\Include\sal.h(172): warning C4001: nonstandard extension 'single line comment' was used
  322. 11>  pfr.c
  323. 11>C:\Program Files (x86)\Windows Phone Kits\8.0\Include\sal.h(172): warning C4001: nonstandard extension 'single line comment' was used
  324. 11>  psaux.c
  325. 11>C:\Program Files (x86)\Windows Phone Kits\8.0\Include\sal.h(172): warning C4001: nonstandard extension 'single line comment' was used
  326. 11>  pshinter.c
  327. 11>C:\Program Files (x86)\Windows Phone Kits\8.0\Include\sal.h(172): warning C4001: nonstandard extension 'single line comment' was used
  328. 11>  psmodule.c
  329. 11>C:\Program Files (x86)\Windows Phone Kits\8.0\Include\sal.h(172): warning C4001: nonstandard extension 'single line comment' was used
  330. 9>  ImfChannelList.cpp
  331. 11>  raster.c
  332. 11>C:\Program Files (x86)\Windows Phone Kits\8.0\Include\sal.h(172): warning C4001: nonstandard extension 'single line comment' was used
  333. 11>  sfnt.c
  334. 11>C:\Program Files (x86)\Windows Phone Kits\8.0\Include\sal.h(172): warning C4001: nonstandard extension 'single line comment' was used
  335. 11>h:\assaframan-ogre-dependencies-for-windows-phone-f16159239e75\src\freetype-2.3.11\src\sfnt\ttload.c(204): warning C4244: '=' : conversion from 'FT_UInt' to 'FT_UShort', possible loss of data
  336. 11>h:\assaframan-ogre-dependencies-for-windows-phone-f16159239e75\src\freetype-2.3.11\src\sfnt\ttload.c(264): warning C4244: '=' : conversion from 'FT_UInt' to 'FT_UShort', possible loss of data
  337. 11>  truetype.c
  338. 11>C:\Program Files (x86)\Windows Phone Kits\8.0\Include\sal.h(172): warning C4001: nonstandard extension 'single line comment' was used
  339. 11>h:\assaframan-ogre-dependencies-for-windows-phone-f16159239e75\src\freetype-2.3.11\src\truetype\ttgxvar.c(237): warning C4018: '<=' : signed/unsigned mismatch
  340. 11>h:\assaframan-ogre-dependencies-for-windows-phone-f16159239e75\src\freetype-2.3.11\src\truetype\ttgxvar.c(245): warning C4018: '<=' : signed/unsigned mismatch
  341. 11>h:\assaframan-ogre-dependencies-for-windows-phone-f16159239e75\src\freetype-2.3.11\src\truetype\ttgxvar.c(253): warning C4018: '<=' : signed/unsigned mismatch
  342. 11>h:\assaframan-ogre-dependencies-for-windows-phone-f16159239e75\src\freetype-2.3.11\src\truetype\ttgxvar.c(258): warning C4018: '<=' : signed/unsigned mismatch
  343. 11>  type1.c
  344. 11>C:\Program Files (x86)\Windows Phone Kits\8.0\Include\sal.h(172): warning C4001: nonstandard extension 'single line comment' was used
  345. 9>  ImfChannelListAttribute.cpp
  346. 11>  type1cid.c
  347. 11>C:\Program Files (x86)\Windows Phone Kits\8.0\Include\sal.h(172): warning C4001: nonstandard extension 'single line comment' was used
  348. 11>  type42.c
  349. 11>C:\Program Files (x86)\Windows Phone Kits\8.0\Include\sal.h(172): warning C4001: nonstandard extension 'single line comment' was used
  350. 11>  winfnt.c
  351. 11>C:\Program Files (x86)\Windows Phone Kits\8.0\Include\sal.h(172): warning C4001: nonstandard extension 'single line comment' was used
  352. 11>  Generating Code...
  353. 5>  LibOpenJPEG.2012.WinRT.vcxproj -> H:\assaframan-ogre-dependencies-for-windows-phone-f16159239e75\src\FreeImage-3.13.1\Source\LibOpenJPEG\.\Debug\LibOpenJPEG.lib
  354. 9>  ImfChromaticities.cpp
  355. 11>  ftdebug.c
  356. 11>..\ftdebug.c(129): warning C4013: 'getenv' undefined; assuming extern returning int
  357. 11>..\ftdebug.c(129): warning C4047: 'initializing' : 'const char *' differs in levels of indirection from 'int'
  358. 11>  freetype.2012.WinRT.vcxproj -> H:\assaframan-ogre-dependencies-for-windows-phone-f16159239e75\src\freetype-2.3.11\builds\win32\vc2005\.\..\..\..\objs\debug\freetype2311_d.lib
  359. 11>  The system cannot find the path specified.
  360. 11>          0 file(s) copied.
  361. 11>  H:\assaframan-ogre-dependencies-for-windows-phone-f16159239e75\src\freetype-2.3.11\builds\win32\vc2005\..\..\..\include\ft2build.h
  362. 11>  H:\assaframan-ogre-dependencies-for-windows-phone-f16159239e75\src\freetype-2.3.11\builds\win32\vc2005\..\..\..\include\freetype\freetype.h
  363. 11>  H:\assaframan-ogre-dependencies-for-windows-phone-f16159239e75\src\freetype-2.3.11\builds\win32\vc2005\..\..\..\include\freetype\ftadvanc.h
  364. 11>  H:\assaframan-ogre-dependencies-for-windows-phone-f16159239e75\src\freetype-2.3.11\builds\win32\vc2005\..\..\..\include\freetype\ftbbox.h
  365. 11>  H:\assaframan-ogre-dependencies-for-windows-phone-f16159239e75\src\freetype-2.3.11\builds\win32\vc2005\..\..\..\include\freetype\ftbdf.h
  366. 11>  H:\assaframan-ogre-dependencies-for-windows-phone-f16159239e75\src\freetype-2.3.11\builds\win32\vc2005\..\..\..\include\freetype\ftbitmap.h
  367. 11>  H:\assaframan-ogre-dependencies-for-windows-phone-f16159239e75\src\freetype-2.3.11\builds\win32\vc2005\..\..\..\include\freetype\ftcache.h
  368. 11>  H:\assaframan-ogre-dependencies-for-windows-phone-f16159239e75\src\freetype-2.3.11\builds\win32\vc2005\..\..\..\include\freetype\ftchapters.h
  369. 11>  H:\assaframan-ogre-dependencies-for-windows-phone-f16159239e75\src\freetype-2.3.11\builds\win32\vc2005\..\..\..\include\freetype\ftcid.h
  370. 11>  H:\assaframan-ogre-dependencies-for-windows-phone-f16159239e75\src\freetype-2.3.11\builds\win32\vc2005\..\..\..\include\freetype\fterrdef.h
  371. 11>  H:\assaframan-ogre-dependencies-for-windows-phone-f16159239e75\src\freetype-2.3.11\builds\win32\vc2005\..\..\..\include\freetype\fterrors.h
  372. 11>  H:\assaframan-ogre-dependencies-for-windows-phone-f16159239e75\src\freetype-2.3.11\builds\win32\vc2005\..\..\..\include\freetype\ftgasp.h
  373. 11>  H:\assaframan-ogre-dependencies-for-windows-phone-f16159239e75\src\freetype-2.3.11\builds\win32\vc2005\..\..\..\include\freetype\ftglyph.h
  374. 11>  H:\assaframan-ogre-dependencies-for-windows-phone-f16159239e75\src\freetype-2.3.11\builds\win32\vc2005\..\..\..\include\freetype\ftgxval.h
  375. 11>  H:\assaframan-ogre-dependencies-for-windows-phone-f16159239e75\src\freetype-2.3.11\builds\win32\vc2005\..\..\..\include\freetype\ftgzip.h
  376. 11>  H:\assaframan-ogre-dependencies-for-windows-phone-f16159239e75\src\freetype-2.3.11\builds\win32\vc2005\..\..\..\include\freetype\ftimage.h
  377. 11>  H:\assaframan-ogre-dependencies-for-windows-phone-f16159239e75\src\freetype-2.3.11\builds\win32\vc2005\..\..\..\include\freetype\ftincrem.h
  378. 11>  H:\assaframan-ogre-dependencies-for-windows-phone-f16159239e75\src\freetype-2.3.11\builds\win32\vc2005\..\..\..\include\freetype\ftlcdfil.h
  379. 11>  H:\assaframan-ogre-dependencies-for-windows-phone-f16159239e75\src\freetype-2.3.11\builds\win32\vc2005\..\..\..\include\freetype\ftlist.h
  380. 11>  H:\assaframan-ogre-dependencies-for-windows-phone-f16159239e75\src\freetype-2.3.11\builds\win32\vc2005\..\..\..\include\freetype\ftlzw.h
  381. 11>  H:\assaframan-ogre-dependencies-for-windows-phone-f16159239e75\src\freetype-2.3.11\builds\win32\vc2005\..\..\..\include\freetype\ftmac.h
  382. 11>  H:\assaframan-ogre-dependencies-for-windows-phone-f16159239e75\src\freetype-2.3.11\builds\win32\vc2005\..\..\..\include\freetype\ftmm.h
  383. 11>  H:\assaframan-ogre-dependencies-for-windows-phone-f16159239e75\src\freetype-2.3.11\builds\win32\vc2005\..\..\..\include\freetype\ftmodapi.h
  384. 11>  H:\assaframan-ogre-dependencies-for-windows-phone-f16159239e75\src\freetype-2.3.11\builds\win32\vc2005\..\..\..\include\freetype\ftmoderr.h
  385. 11>  H:\assaframan-ogre-dependencies-for-windows-phone-f16159239e75\src\freetype-2.3.11\builds\win32\vc2005\..\..\..\include\freetype\ftotval.h
  386. 11>  H:\assaframan-ogre-dependencies-for-windows-phone-f16159239e75\src\freetype-2.3.11\builds\win32\vc2005\..\..\..\include\freetype\ftoutln.h
  387. 11>  H:\assaframan-ogre-dependencies-for-windows-phone-f16159239e75\src\freetype-2.3.11\builds\win32\vc2005\..\..\..\include\freetype\ftpfr.h
  388. 11>  H:\assaframan-ogre-dependencies-for-windows-phone-f16159239e75\src\freetype-2.3.11\builds\win32\vc2005\..\..\..\include\freetype\ftrender.h
  389. 11>  H:\assaframan-ogre-dependencies-for-windows-phone-f16159239e75\src\freetype-2.3.11\builds\win32\vc2005\..\..\..\include\freetype\ftsizes.h
  390. 11>  H:\assaframan-ogre-dependencies-for-windows-phone-f16159239e75\src\freetype-2.3.11\builds\win32\vc2005\..\..\..\include\freetype\ftsnames.h
  391. 11>  H:\assaframan-ogre-dependencies-for-windows-phone-f16159239e75\src\freetype-2.3.11\builds\win32\vc2005\..\..\..\include\freetype\ftstroke.h
  392. 11>  H:\assaframan-ogre-dependencies-for-windows-phone-f16159239e75\src\freetype-2.3.11\builds\win32\vc2005\..\..\..\include\freetype\ftsynth.h
  393. 11>  H:\assaframan-ogre-dependencies-for-windows-phone-f16159239e75\src\freetype-2.3.11\builds\win32\vc2005\..\..\..\include\freetype\ftsystem.h
  394. 11>  H:\assaframan-ogre-dependencies-for-windows-phone-f16159239e75\src\freetype-2.3.11\builds\win32\vc2005\..\..\..\include\freetype\fttrigon.h
  395. 11>  H:\assaframan-ogre-dependencies-for-windows-phone-f16159239e75\src\freetype-2.3.11\builds\win32\vc2005\..\..\..\include\freetype\fttypes.h
  396. 11>  H:\assaframan-ogre-dependencies-for-windows-phone-f16159239e75\src\freetype-2.3.11\builds\win32\vc2005\..\..\..\include\freetype\ftwinfnt.h
  397. 11>  H:\assaframan-ogre-dependencies-for-windows-phone-f16159239e75\src\freetype-2.3.11\builds\win32\vc2005\..\..\..\include\freetype\ftxf86.h
  398. 11>  H:\assaframan-ogre-dependencies-for-windows-phone-f16159239e75\src\freetype-2.3.11\builds\win32\vc2005\..\..\..\include\freetype\t1tables.h
  399. 11>  H:\assaframan-ogre-dependencies-for-windows-phone-f16159239e75\src\freetype-2.3.11\builds\win32\vc2005\..\..\..\include\freetype\ttnameid.h
  400. 11>  H:\assaframan-ogre-dependencies-for-windows-phone-f16159239e75\src\freetype-2.3.11\builds\win32\vc2005\..\..\..\include\freetype\tttables.h
  401. 11>  H:\assaframan-ogre-dependencies-for-windows-phone-f16159239e75\src\freetype-2.3.11\builds\win32\vc2005\..\..\..\include\freetype\tttags.h
  402. 11>  H:\assaframan-ogre-dependencies-for-windows-phone-f16159239e75\src\freetype-2.3.11\builds\win32\vc2005\..\..\..\include\freetype\ttunpat.h
  403. 11>  H:\assaframan-ogre-dependencies-for-windows-phone-f16159239e75\src\freetype-2.3.11\builds\win32\vc2005\..\..\..\include\freetype\config\ftconfig.h
  404. 11>  H:\assaframan-ogre-dependencies-for-windows-phone-f16159239e75\src\freetype-2.3.11\builds\win32\vc2005\..\..\..\include\freetype\config\ftheader.h
  405. 11>  H:\assaframan-ogre-dependencies-for-windows-phone-f16159239e75\src\freetype-2.3.11\builds\win32\vc2005\..\..\..\include\freetype\config\ftmodule.h
  406. 11>  H:\assaframan-ogre-dependencies-for-windows-phone-f16159239e75\src\freetype-2.3.11\builds\win32\vc2005\..\..\..\include\freetype\config\ftoption.h
  407. 11>  H:\assaframan-ogre-dependencies-for-windows-phone-f16159239e75\src\freetype-2.3.11\builds\win32\vc2005\..\..\..\include\freetype\config\ftstdlib.h
  408. 11>  H:\assaframan-ogre-dependencies-for-windows-phone-f16159239e75\src\freetype-2.3.11\builds\win32\vc2005\..\..\..\include\freetype\internal\autohint.h
  409. 11>  H:\assaframan-ogre-dependencies-for-windows-phone-f16159239e75\src\freetype-2.3.11\builds\win32\vc2005\..\..\..\include\freetype\internal\ftcalc.h
  410. 11>  H:\assaframan-ogre-dependencies-for-windows-phone-f16159239e75\src\freetype-2.3.11\builds\win32\vc2005\..\..\..\include\freetype\internal\ftdebug.h
  411. 11>  H:\assaframan-ogre-dependencies-for-windows-phone-f16159239e75\src\freetype-2.3.11\builds\win32\vc2005\..\..\..\include\freetype\internal\ftdriver.h
  412. 11>  H:\assaframan-ogre-dependencies-for-windows-phone-f16159239e75\src\freetype-2.3.11\builds\win32\vc2005\..\..\..\include\freetype\internal\ftgloadr.h
  413. 11>  H:\assaframan-ogre-dependencies-for-windows-phone-f16159239e75\src\freetype-2.3.11\builds\win32\vc2005\..\..\..\include\freetype\internal\ftmemory.h
  414. 11>  H:\assaframan-ogre-dependencies-for-windows-phone-f16159239e75\src\freetype-2.3.11\builds\win32\vc2005\..\..\..\include\freetype\internal\ftobjs.h
  415. 11>  H:\assaframan-ogre-dependencies-for-windows-phone-f16159239e75\src\freetype-2.3.11\builds\win32\vc2005\..\..\..\include\freetype\internal\ftpic.h
  416. 11>  H:\assaframan-ogre-dependencies-for-windows-phone-f16159239e75\src\freetype-2.3.11\builds\win32\vc2005\..\..\..\include\freetype\internal\ftrfork.h
  417. 11>  H:\assaframan-ogre-dependencies-for-windows-phone-f16159239e75\src\freetype-2.3.11\builds\win32\vc2005\..\..\..\include\freetype\internal\ftserv.h
  418. 11>  H:\assaframan-ogre-dependencies-for-windows-phone-f16159239e75\src\freetype-2.3.11\builds\win32\vc2005\..\..\..\include\freetype\internal\ftstream.h
  419. 11>  H:\assaframan-ogre-dependencies-for-windows-phone-f16159239e75\src\freetype-2.3.11\builds\win32\vc2005\..\..\..\include\freetype\internal\fttrace.h
  420. 11>  H:\assaframan-ogre-dependencies-for-windows-phone-f16159239e75\src\freetype-2.3.11\builds\win32\vc2005\..\..\..\include\freetype\internal\ftvalid.h
  421. 11>  H:\assaframan-ogre-dependencies-for-windows-phone-f16159239e75\src\freetype-2.3.11\builds\win32\vc2005\..\..\..\include\freetype\internal\internal.h
  422. 11>  H:\assaframan-ogre-dependencies-for-windows-phone-f16159239e75\src\freetype-2.3.11\builds\win32\vc2005\..\..\..\include\freetype\internal\pcftypes.h
  423. 11>  H:\assaframan-ogre-dependencies-for-windows-phone-f16159239e75\src\freetype-2.3.11\builds\win32\vc2005\..\..\..\include\freetype\internal\psaux.h
  424. 11>  H:\assaframan-ogre-dependencies-for-windows-phone-f16159239e75\src\freetype-2.3.11\builds\win32\vc2005\..\..\..\include\freetype\internal\pshints.h
  425. 11>  H:\assaframan-ogre-dependencies-for-windows-phone-f16159239e75\src\freetype-2.3.11\builds\win32\vc2005\..\..\..\include\freetype\internal\sfnt.h
  426. 11>  H:\assaframan-ogre-dependencies-for-windows-phone-f16159239e75\src\freetype-2.3.11\builds\win32\vc2005\..\..\..\include\freetype\internal\t1types.h
  427. 11>  H:\assaframan-ogre-dependencies-for-windows-phone-f16159239e75\src\freetype-2.3.11\builds\win32\vc2005\..\..\..\include\freetype\internal\tttypes.h
  428. 11>  H:\assaframan-ogre-dependencies-for-windows-phone-f16159239e75\src\freetype-2.3.11\builds\win32\vc2005\..\..\..\include\freetype\internal\services\svbdf.h
  429. 11>  H:\assaframan-ogre-dependencies-for-windows-phone-f16159239e75\src\freetype-2.3.11\builds\win32\vc2005\..\..\..\include\freetype\internal\services\svcid.h
  430. 11>  H:\assaframan-ogre-dependencies-for-windows-phone-f16159239e75\src\freetype-2.3.11\builds\win32\vc2005\..\..\..\include\freetype\internal\services\svgldict.h
  431. 11>  H:\assaframan-ogre-dependencies-for-windows-phone-f16159239e75\src\freetype-2.3.11\builds\win32\vc2005\..\..\..\include\freetype\internal\services\svgxval.h
  432. 11>  H:\assaframan-ogre-dependencies-for-windows-phone-f16159239e75\src\freetype-2.3.11\builds\win32\vc2005\..\..\..\include\freetype\internal\services\svkern.h
  433. 11>  H:\assaframan-ogre-dependencies-for-windows-phone-f16159239e75\src\freetype-2.3.11\builds\win32\vc2005\..\..\..\include\freetype\internal\services\svmm.h
  434. 11>  H:\assaframan-ogre-dependencies-for-windows-phone-f16159239e75\src\freetype-2.3.11\builds\win32\vc2005\..\..\..\include\freetype\internal\services\svotval.h
  435. 11>  H:\assaframan-ogre-dependencies-for-windows-phone-f16159239e75\src\freetype-2.3.11\builds\win32\vc2005\..\..\..\include\freetype\internal\services\svpfr.h
  436. 11>  H:\assaframan-ogre-dependencies-for-windows-phone-f16159239e75\src\freetype-2.3.11\builds\win32\vc2005\..\..\..\include\freetype\internal\services\svpostnm.h
  437. 11>  H:\assaframan-ogre-dependencies-for-windows-phone-f16159239e75\src\freetype-2.3.11\builds\win32\vc2005\..\..\..\include\freetype\internal\services\svpscmap.h
  438. 11>  H:\assaframan-ogre-dependencies-for-windows-phone-f16159239e75\src\freetype-2.3.11\builds\win32\vc2005\..\..\..\include\freetype\internal\services\svpsinfo.h
  439. 11>  H:\assaframan-ogre-dependencies-for-windows-phone-f16159239e75\src\freetype-2.3.11\builds\win32\vc2005\..\..\..\include\freetype\internal\services\svsfnt.h
  440. 11>  H:\assaframan-ogre-dependencies-for-windows-phone-f16159239e75\src\freetype-2.3.11\builds\win32\vc2005\..\..\..\include\freetype\internal\services\svttcmap.h
  441. 11>  H:\assaframan-ogre-dependencies-for-windows-phone-f16159239e75\src\freetype-2.3.11\builds\win32\vc2005\..\..\..\include\freetype\internal\services\svtteng.h
  442. 11>  H:\assaframan-ogre-dependencies-for-windows-phone-f16159239e75\src\freetype-2.3.11\builds\win32\vc2005\..\..\..\include\freetype\internal\services\svttglyf.h
  443. 11>  H:\assaframan-ogre-dependencies-for-windows-phone-f16159239e75\src\freetype-2.3.11\builds\win32\vc2005\..\..\..\include\freetype\internal\services\svwinfnt.h
  444. 11>  H:\assaframan-ogre-dependencies-for-windows-phone-f16159239e75\src\freetype-2.3.11\builds\win32\vc2005\..\..\..\include\freetype\internal\services\svxf86nm.h
  445. 11>  84 File(s) copied
  446. 9>  ImfChromaticitiesAttribute.cpp
  447. 9>  ImfCompressionAttribute.cpp
  448. 9>  ImfCompressor.cpp
  449. 9>  ImfConvert.cpp
  450. 9>h:\assaframan-ogre-dependencies-for-windows-phone-f16159239e75\src\freeimage-3.13.1\source\openexr\ilmimf\imfconvert.cpp(119): warning C4244: 'argument' : conversion from 'unsigned int' to 'float', possible loss of data
  451. 9>  ImfCRgbaFile.cpp
  452. 9>h:\assaframan-ogre-dependencies-for-windows-phone-f16159239e75\src\freeimage-3.13.1\source\openexr\ilmimf\imfcrgbafile.cpp(292): warning C4244: '=' : conversion from 'const int' to 'float', possible loss of data
  453. 9>h:\assaframan-ogre-dependencies-for-windows-phone-f16159239e75\src\freeimage-3.13.1\source\openexr\ilmimf\imfcrgbafile.cpp(293): warning C4244: '=' : conversion from 'const int' to 'float', possible loss of data
  454. 9>  ImfDoubleAttribute.cpp
  455. 9>  ImfEnvmap.cpp
  456. 9>h:\assaframan-ogre-dependencies-for-windows-phone-f16159239e75\src\freeimage-3.13.1\source\openexr\ilmimf\imfenvmap.cpp(77): warning C4244: '=' : conversion from 'double' to 'float', possible loss of data
  457. 9>h:\assaframan-ogre-dependencies-for-windows-phone-f16159239e75\src\freeimage-3.13.1\source\openexr\ilmimf\imfenvmap.cpp(88): warning C4244: '=' : conversion from 'double' to 'float', possible loss of data
  458. 9>h:\assaframan-ogre-dependencies-for-windows-phone-f16159239e75\src\freeimage-3.13.1\source\openexr\ilmimf\imfenvmap.cpp(102): warning C4244: 'initializing' : conversion from 'double' to 'float', possible loss of data
  459. 9>h:\assaframan-ogre-dependencies-for-windows-phone-f16159239e75\src\freeimage-3.13.1\source\openexr\ilmimf\imfenvmap.cpp(103): warning C4244: 'initializing' : conversion from 'double' to 'float', possible loss of data
  460. 9>  ImfEnvmapAttribute.cpp
  461. 1>H:\sinbad-ogre-dc4874552a2b\OgreMain\src/OgreQuaternion.cpp(45): warning C4305: 'initializing' : truncation from 'double' to 'const Ogre::Real' (compile_OgreMain_2.cpp)
  462. 1>H:\sinbad-ogre-dc4874552a2b\OgreMain\src/OgreColourValue.cpp(374): warning C4305: 'argument' : truncation from 'double' to 'Ogre::Real' (compile_OgreMain_0.cpp)
  463. 9>  ImfFloatAttribute.cpp
  464. 9>  ImfFrameBuffer.cpp
  465. 9>  ImfFramesPerSecond.cpp
  466. 9>  ImfHeader.cpp
  467. 9>h:\assaframan-ogre-dependencies-for-windows-phone-f16159239e75\src\freeimage-3.13.1\source\openexr\ilmimf\imfheader.cpp(582): warning C4305: 'initializing' : truncation from 'double' to 'const float'
  468. 9>h:\assaframan-ogre-dependencies-for-windows-phone-f16159239e75\src\freeimage-3.13.1\source\openexr\ilmimf\imfheader.cpp(627): warning C4018: '<' : signed/unsigned mismatch
  469. 9>h:\assaframan-ogre-dependencies-for-windows-phone-f16159239e75\src\freeimage-3.13.1\source\openexr\ilmimf\imfheader.cpp(634): warning C4018: '<' : signed/unsigned mismatch
  470. 9>  ImfHuf.cpp
  471. 1>H:\sinbad-ogre-dc4874552a2b\OgreMain\src/OgreMath.cpp(259): warning C4305: 'argument' : truncation from 'double' to 'Ogre::Real' (compile_OgreMain_1.cpp)
  472. 1>H:\sinbad-ogre-dc4874552a2b\OgreMain\src/OgreMath.cpp(266): warning C4305: 'argument' : truncation from 'double' to 'Ogre::Real' (compile_OgreMain_1.cpp)
  473. 1>H:\sinbad-ogre-dc4874552a2b\OgreMain\src/OgreMath.cpp(279): warning C4305: 'argument' : truncation from 'double' to 'Ogre::Real' (compile_OgreMain_1.cpp)
  474. 1>H:\sinbad-ogre-dc4874552a2b\OgreMain\src/OgreMath.cpp(307): warning C4305: 'argument' : truncation from 'double' to 'Ogre::Real' (compile_OgreMain_1.cpp)
  475. 1>H:\sinbad-ogre-dc4874552a2b\OgreMain\src/OgreMath.cpp(314): warning C4305: 'argument' : truncation from 'double' to 'Ogre::Real' (compile_OgreMain_1.cpp)
  476. 1>H:\sinbad-ogre-dc4874552a2b\OgreMain\src/OgreMath.cpp(327): warning C4305: 'argument' : truncation from 'double' to 'Ogre::Real' (compile_OgreMain_1.cpp)
  477. 9>h:\assaframan-ogre-dependencies-for-windows-phone-f16159239e75\src\freeimage-3.13.1\source\openexr\ilmimf\imfhuf.cpp(168): warning C4244: '=' : conversion from 'Imath::Int64' to 'char', possible loss of data
  478. 9>h:\assaframan-ogre-dependencies-for-windows-phone-f16159239e75\src\freeimage-3.13.1\source\openexr\ilmimf\imfhuf.cpp(247): warning C4244: 'initializing' : conversion from 'Imath::Int64' to 'int', possible loss of data
  479. 1>H:\sinbad-ogre-dc4874552a2b\OgreMain\src/OgreMatrix3.cpp(37): warning C4305: 'initializing' : truncation from 'double' to 'const Ogre::Real' (compile_OgreMain_1.cpp)
  480. 1>H:\sinbad-ogre-dc4874552a2b\OgreMain\src/OgreMatrix3.cpp(40): warning C4305: 'initializing' : truncation from 'double' to 'const Ogre::Real' (compile_OgreMain_1.cpp)
  481. 9>h:\assaframan-ogre-dependencies-for-windows-phone-f16159239e75\src\freeimage-3.13.1\source\openexr\ilmimf\imfhuf.cpp(478): warning C4244: 'initializing' : conversion from 'Imath::Int64' to 'int', possible loss of data
  482. 9>h:\assaframan-ogre-dependencies-for-windows-phone-f16159239e75\src\freeimage-3.13.1\source\openexr\ilmimf\imfhuf.cpp(547): warning C4244: 'initializing' : conversion from 'Imath::Int64' to 'int', possible loss of data
  483. 9>h:\assaframan-ogre-dependencies-for-windows-phone-f16159239e75\src\freeimage-3.13.1\source\openexr\ilmimf\imfhuf.cpp(559): warning C4244: 'initializing' : conversion from 'Imath::Int64' to 'int', possible loss of data
  484. 9>h:\assaframan-ogre-dependencies-for-windows-phone-f16159239e75\src\freeimage-3.13.1\source\openexr\ilmimf\imfhuf.cpp(606): warning C4244: 'initializing' : conversion from 'Imath::Int64' to 'int', possible loss of data
  485. 9>h:\assaframan-ogre-dependencies-for-windows-phone-f16159239e75\src\freeimage-3.13.1\source\openexr\ilmimf\imfhuf.cpp(709): warning C4244: 'argument' : conversion from 'Imath::Int64' to 'int', possible loss of data
  486. 9>h:\assaframan-ogre-dependencies-for-windows-phone-f16159239e75\src\freeimage-3.13.1\source\openexr\ilmimf\imfhuf.cpp(877): warning C4244: 'initializing' : conversion from 'Imath::Int64' to 'unsigned char', possible loss of data
  487. 9>h:\assaframan-ogre-dependencies-for-windows-phone-f16159239e75\src\freeimage-3.13.1\source\openexr\ilmimf\imfhuf.cpp(892): warning C4244: 'initializing' : conversion from 'Imath::Int64' to 'int', possible loss of data
  488. 1>H:\sinbad-ogre-dc4874552a2b\OgreMain\src/OgreMatrix3.cpp(807): warning C4305: 'initializing' : truncation from 'double' to 'const Ogre::Real' (compile_OgreMain_1.cpp)
  489. 1>H:\sinbad-ogre-dc4874552a2b\OgreMain\src/OgreMatrix3.cpp(808): warning C4305: 'initializing' : truncation from 'double' to 'const Ogre::Real' (compile_OgreMain_1.cpp)
  490. 9>h:\assaframan-ogre-dependencies-for-windows-phone-f16159239e75\src\freeimage-3.13.1\source\openexr\ilmimf\imfhuf.cpp(907): warning C4244: 'initializing' : conversion from 'Imath::Int64' to 'unsigned char', possible loss of data
  491. 9>h:\assaframan-ogre-dependencies-for-windows-phone-f16159239e75\src\freeimage-3.13.1\source\openexr\ilmimf\imfhuf.cpp(934): warning C4244: 'initializing' : conversion from 'Imath::Int64' to 'unsigned char', possible loss of data
  492. 1>H:\sinbad-ogre-dc4874552a2b\OgreMain\src/OgreConvexBody.cpp(519): warning C4305: 'argument' : truncation from 'double' to 'Ogre::Real' (compile_OgreMain_0.cpp)
  493. 9>  ImfInputFile.cpp
  494. 1>H:\sinbad-ogre-dc4874552a2b\OgreMain\src/OgreMeshManager.cpp(59): warning C4305: 'initializing' : truncation from 'double' to 'Ogre::Real' (compile_OgreMain_1.cpp)
  495. 9>h:\assaframan-ogre-dependencies-for-windows-phone-f16159239e75\src\freeimage-3.13.1\source\openexr\ilmimf\imfinputfile.cpp(296): warning C4018: '<' : signed/unsigned mismatch
  496. 9>  Generating Code...
  497. 1>H:\sinbad-ogre-dc4874552a2b\OgreMain\src/OgreNode.cpp(890): warning C4305: '=' : truncation from 'double' to 'float' (compile_OgreMain_1.cpp)
  498. 1>H:\sinbad-ogre-dc4874552a2b\OgreMain\src/OgreNode.cpp(895): warning C4305: '=' : truncation from 'double' to 'float' (compile_OgreMain_1.cpp)
  499. 1>H:\sinbad-ogre-dc4874552a2b\OgreMain\src/OgreNode.cpp(900): warning C4305: '=' : truncation from 'double' to 'float' (compile_OgreMain_1.cpp)
  500. 1>H:\sinbad-ogre-dc4874552a2b\OgreMain\src/OgreNode.cpp(905): warning C4305: 'argument' : truncation from 'double' to 'const Ogre::Real' (compile_OgreMain_1.cpp)
  501. 1>H:\sinbad-ogre-dc4874552a2b\OgreMain\src/OgreNode.cpp(906): warning C4305: 'argument' : truncation from 'double' to 'const Ogre::Real' (compile_OgreMain_1.cpp)
  502. 1>H:\sinbad-ogre-dc4874552a2b\OgreMain\src/OgreNode.cpp(907): warning C4305: 'argument' : truncation from 'double' to 'const Ogre::Real' (compile_OgreMain_1.cpp)
  503. 1>H:\sinbad-ogre-dc4874552a2b\OgreMain\src/OgreNode.cpp(908): warning C4305: 'argument' : truncation from 'double' to 'const Ogre::Real' (compile_OgreMain_1.cpp)
  504. 1>H:\sinbad-ogre-dc4874552a2b\OgreMain\src/OgreNode.cpp(910): warning C4305: 'argument' : truncation from 'double' to 'const Ogre::Real' (compile_OgreMain_1.cpp)
  505. 1>H:\sinbad-ogre-dc4874552a2b\OgreMain\src/OgreNode.cpp(912): warning C4305: 'argument' : truncation from 'double' to 'const Ogre::Real' (compile_OgreMain_1.cpp)
  506. 9>  Compiling...
  507. 9>  ImfIntAttribute.cpp
  508. 1>H:\sinbad-ogre-dc4874552a2b\OgreMain\src/OgreFrustum.cpp(48): warning C4305: 'initializing' : truncation from 'double' to 'const Ogre::Real' (compile_OgreMain_0.cpp)
  509. 9>  ImfIO.cpp
  510. 1>H:\sinbad-ogre-dc4874552a2b\OgreMain\src/OgrePass.cpp(205): warning C4305: 'initializing' : truncation from 'double' to 'Ogre::Real' (compile_OgreMain_1.cpp)
  511. 9>  ImfKeyCode.cpp
  512. 9>  ImfKeyCodeAttribute.cpp
  513. 9>  ImfLineOrderAttribute.cpp
  514. 9>  ImfLut.cpp
  515. 1>H:\sinbad-ogre-dc4874552a2b\OgreMain\src/OgreSceneManager.cpp(158): warning C4305: 'initializing' : truncation from 'double' to 'Ogre::Real' (compile_OgreMain_2.cpp)
  516. 9>h:\assaframan-ogre-dependencies-for-windows-phone-f16159239e75\src\freeimage-3.13.1\source\openexr\ilmimf\imflut.cpp(155): warning C4244: 'initializing' : conversion from 'double' to 'const float', possible loss of data
  517. 9>h:\assaframan-ogre-dependencies-for-windows-phone-f16159239e75\src\freeimage-3.13.1\source\openexr\ilmimf\imflut.cpp(173): warning C4244: 'argument' : conversion from 'double' to 'float', possible loss of data
  518. 9>  ImfMatrixAttribute.cpp
  519. 1>H:\sinbad-ogre-dc4874552a2b\OgreMain\src/OgreSceneManager.cpp(4651): warning C4305: 'argument' : truncation from 'double' to 'float' (compile_OgreMain_2.cpp)
  520. 1>H:\sinbad-ogre-dc4874552a2b\OgreMain\src/OgreSceneManager.cpp(5639): warning C4305: 'argument' : truncation from 'double' to 'float' (compile_OgreMain_2.cpp)
  521. 9>  ImfMisc.cpp
  522. 9>h:\assaframan-ogre-dependencies-for-windows-phone-f16159239e75\src\freeimage-3.13.1\source\openexr\ilmimf\imfmisc.cpp(141): warning C4018: '<' : signed/unsigned mismatch
  523. 9>h:\assaframan-ogre-dependencies-for-windows-phone-f16159239e75\src\freeimage-3.13.1\source\openexr\ilmimf\imfmisc.cpp(221): warning C4244: 'argument' : conversion from 'double' to 'float', possible loss of data
  524. 9>h:\assaframan-ogre-dependencies-for-windows-phone-f16159239e75\src\freeimage-3.13.1\source\openexr\ilmimf\imfmisc.cpp(567): warning C4018: '<' : signed/unsigned mismatch
  525. 9>h:\assaframan-ogre-dependencies-for-windows-phone-f16159239e75\src\freeimage-3.13.1\source\openexr\ilmimf\imfmisc.cpp(576): warning C4018: '<' : signed/unsigned mismatch
  526. 9>h:\assaframan-ogre-dependencies-for-windows-phone-f16159239e75\src\freeimage-3.13.1\source\openexr\ilmimf\imfmisc.cpp(585): warning C4018: '<' : signed/unsigned mismatch
  527. 9>h:\assaframan-ogre-dependencies-for-windows-phone-f16159239e75\src\freeimage-3.13.1\source\openexr\ilmimf\imfmisc.cpp(717): warning C4018: '<' : signed/unsigned mismatch
  528. 9>h:\assaframan-ogre-dependencies-for-windows-phone-f16159239e75\src\freeimage-3.13.1\source\openexr\ilmimf\imfmisc.cpp(724): warning C4018: '<' : signed/unsigned mismatch
  529. 9>h:\assaframan-ogre-dependencies-for-windows-phone-f16159239e75\src\freeimage-3.13.1\source\openexr\ilmimf\imfmisc.cpp(731): warning C4018: '<' : signed/unsigned mismatch
  530. 9>h:\assaframan-ogre-dependencies-for-windows-phone-f16159239e75\src\freeimage-3.13.1\source\openexr\ilmimf\imfmisc.cpp(751): warning C4018: '<' : signed/unsigned mismatch
  531. 9>h:\assaframan-ogre-dependencies-for-windows-phone-f16159239e75\src\freeimage-3.13.1\source\openexr\ilmimf\imfmisc.cpp(762): warning C4018: '<' : signed/unsigned mismatch
  532. 9>h:\assaframan-ogre-dependencies-for-windows-phone-f16159239e75\src\freeimage-3.13.1\source\openexr\ilmimf\imfmisc.cpp(771): warning C4018: '<' : signed/unsigned mismatch
  533. 9>  ImfOpaqueAttribute.cpp
  534. 1>H:\sinbad-ogre-dc4874552a2b\OgreMain\src/OgreScriptTranslator.cpp(1870): warning C4305: 'initializing' : truncation from 'double' to 'Ogre::Real' (compile_OgreMain_2.cpp)
  535. 9>  ImfOutputFile.cpp
  536. 1>H:\sinbad-ogre-dc4874552a2b\OgreMain\src/OgreShadowCameraSetup.cpp(135): warning C4305: 'argument' : truncation from 'double' to 'Ogre::Real' (compile_OgreMain_2.cpp)
  537. 1>H:\sinbad-ogre-dc4874552a2b\OgreMain\src/OgreShadowCameraSetupFocused.cpp(176): warning C4305: 'argument' : truncation from 'double' to 'Ogre::Real' (compile_OgreMain_2.cpp)
  538. 1>H:\sinbad-ogre-dc4874552a2b\OgreMain\src/OgreShadowCameraSetupFocused.cpp(190): warning C4305: 'argument' : truncation from 'double' to 'Ogre::Real' (compile_OgreMain_2.cpp)
  539. 1>H:\sinbad-ogre-dc4874552a2b\OgreMain\src/OgreShadowCameraSetupLiSPSM.cpp(48): warning C4305: 'initializing' : truncation from 'double' to 'Ogre::Real' (compile_OgreMain_2.cpp)
  540. 9>h:\assaframan-ogre-dependencies-for-windows-phone-f16159239e75\src\freeimage-3.13.1\source\openexr\ilmimf\imfoutputfile.cpp(1107): warning C4018: '<' : signed/unsigned mismatch
  541. 9>  ImfPizCompressor.cpp
  542. 9>  ImfPreviewImage.cpp
  543. 9>  ImfPreviewImageAttribute.cpp
  544. 9>  ImfPxr24Compressor.cpp
  545. 9>h:\assaframan-ogre-dependencies-for-windows-phone-f16159239e75\src\freeimage-3.13.1\source\openexr\ilmimf\imfpxr24compressor.cpp(460): warning C4018: '>' : signed/unsigned mismatch
  546. 9>h:\assaframan-ogre-dependencies-for-windows-phone-f16159239e75\src\freeimage-3.13.1\source\openexr\ilmimf\imfpxr24compressor.cpp(486): warning C4018: '>' : signed/unsigned mismatch
  547. 9>h:\assaframan-ogre-dependencies-for-windows-phone-f16159239e75\src\freeimage-3.13.1\source\openexr\ilmimf\imfpxr24compressor.cpp(510): warning C4018: '>' : signed/unsigned mismatch
  548. 9>h:\assaframan-ogre-dependencies-for-windows-phone-f16159239e75\src\freeimage-3.13.1\source\openexr\ilmimf\imfpxr24compressor.cpp(535): warning C4018: '<' : signed/unsigned mismatch
  549. 9>  ImfRational.cpp
  550. 9>  ImfRationalAttribute.cpp
  551. 9>  ImfRgbaFile.cpp
  552. 9>  ImfRgbaYca.cpp
  553. 9>h:\assaframan-ogre-dependencies-for-windows-phone-f16159239e75\src\freeimage-3.13.1\source\openexr\ilmimf\imfrgbayca.cpp(161): warning C4244: 'argument' : conversion from 'double' to 'float', possible loss of data
  554. 9>h:\assaframan-ogre-dependencies-for-windows-phone-f16159239e75\src\freeimage-3.13.1\source\openexr\ilmimf\imfrgbayca.cpp(177): warning C4244: 'argument' : conversion from 'double' to 'float', possible loss of data
  555. 9>h:\assaframan-ogre-dependencies-for-windows-phone-f16159239e75\src\freeimage-3.13.1\source\openexr\ilmimf\imfrgbayca.cpp(209): warning C4244: 'argument' : conversion from 'double' to 'float', possible loss of data
  556. 9>h:\assaframan-ogre-dependencies-for-windows-phone-f16159239e75\src\freeimage-3.13.1\source\openexr\ilmimf\imfrgbayca.cpp(225): warning C4244: 'argument' : conversion from 'double' to 'float', possible loss of data
  557. 9>h:\assaframan-ogre-dependencies-for-windows-phone-f16159239e75\src\freeimage-3.13.1\source\openexr\ilmimf\imfrgbayca.cpp(284): warning C4244: 'argument' : conversion from 'double' to 'float', possible loss of data
  558. 9>h:\assaframan-ogre-dependencies-for-windows-phone-f16159239e75\src\freeimage-3.13.1\source\openexr\ilmimf\imfrgbayca.cpp(299): warning C4244: 'argument' : conversion from 'double' to 'float', possible loss of data
  559. 9>h:\assaframan-ogre-dependencies-for-windows-phone-f16159239e75\src\freeimage-3.13.1\source\openexr\ilmimf\imfrgbayca.cpp(333): warning C4244: 'argument' : conversion from 'double' to 'float', possible loss of data
  560. 9>h:\assaframan-ogre-dependencies-for-windows-phone-f16159239e75\src\freeimage-3.13.1\source\openexr\ilmimf\imfrgbayca.cpp(348): warning C4244: 'argument' : conversion from 'double' to 'float', possible loss of data
  561. 9>  ImfRleCompressor.cpp
  562. 9>  ImfScanLineInputFile.cpp
  563. 9>h:\assaframan-ogre-dependencies-for-windows-phone-f16159239e75\src\freeimage-3.13.1\source\openexr\ilmimf\imfscanlineinputfile.cpp(948): warning C4018: '<' : signed/unsigned mismatch
  564. 9>  Generating Code...
  565. 9>  Compiling...
  566. 9>  ImfStandardAttributes.cpp
  567. 9>  ImfStdIO.cpp
  568. 9>  ImfStringAttribute.cpp
  569. 9>  ImfTestFile.cpp
  570. 9>  ImfThreading.cpp
  571. 9>  ImfTileDescriptionAttribute.cpp
  572. 9>  ImfTiledInputFile.cpp
  573. 9>h:\assaframan-ogre-dependencies-for-windows-phone-f16159239e75\src\freeimage-3.13.1\source\openexr\ilmimf\imftiledinputfile.cpp(1029): warning C4018: '<' : signed/unsigned mismatch
  574. 9>  ImfTiledMisc.cpp
  575. 9>  ImfTiledOutputFile.cpp
  576. 9>h:\assaframan-ogre-dependencies-for-windows-phone-f16159239e75\src\freeimage-3.13.1\source\openexr\ilmimf\imftiledoutputfile.cpp(1267): warning C4018: '<' : signed/unsigned mismatch
  577. 9>h:\assaframan-ogre-dependencies-for-windows-phone-f16159239e75\src\freeimage-3.13.1\source\openexr\ilmimf\imftiledoutputfile.cpp(1383): warning C4018: '<' : signed/unsigned mismatch
  578. 9>h:\assaframan-ogre-dependencies-for-windows-phone-f16159239e75\src\freeimage-3.13.1\source\openexr\ilmimf\imftiledoutputfile.cpp(1390): warning C4018: '<' : signed/unsigned mismatch
  579. 9>h:\assaframan-ogre-dependencies-for-windows-phone-f16159239e75\src\freeimage-3.13.1\source\openexr\ilmimf\imftiledoutputfile.cpp(1391): warning C4018: '<' : signed/unsigned mismatch
  580. 9>  ImfTiledRgbaFile.cpp
  581. 9>  ImfTileOffsets.cpp
  582. 9>h:\assaframan-ogre-dependencies-for-windows-phone-f16159239e75\src\freeimage-3.13.1\source\openexr\ilmimf\imftileoffsets.cpp(80): warning C4018: '<' : signed/unsigned mismatch
  583. 9>h:\assaframan-ogre-dependencies-for-windows-phone-f16159239e75\src\freeimage-3.13.1\source\openexr\ilmimf\imftileoffsets.cpp(82): warning C4018: '<' : signed/unsigned mismatch
  584. 9>h:\assaframan-ogre-dependencies-for-windows-phone-f16159239e75\src\freeimage-3.13.1\source\openexr\ilmimf\imftileoffsets.cpp(262): warning C4018: '>' : signed/unsigned mismatch
  585. 9>h:\assaframan-ogre-dependencies-for-windows-phone-f16159239e75\src\freeimage-3.13.1\source\openexr\ilmimf\imftileoffsets.cpp(263): warning C4018: '>' : signed/unsigned mismatch
  586. 9>h:\assaframan-ogre-dependencies-for-windows-phone-f16159239e75\src\freeimage-3.13.1\source\openexr\ilmimf\imftileoffsets.cpp(274): warning C4018: '>' : signed/unsigned mismatch
  587. 9>h:\assaframan-ogre-dependencies-for-windows-phone-f16159239e75\src\freeimage-3.13.1\source\openexr\ilmimf\imftileoffsets.cpp(275): warning C4018: '>' : signed/unsigned mismatch
  588. 9>h:\assaframan-ogre-dependencies-for-windows-phone-f16159239e75\src\freeimage-3.13.1\source\openexr\ilmimf\imftileoffsets.cpp(276): warning C4018: '>' : signed/unsigned mismatch
  589. 9>h:\assaframan-ogre-dependencies-for-windows-phone-f16159239e75\src\freeimage-3.13.1\source\openexr\ilmimf\imftileoffsets.cpp(287): warning C4018: '>' : signed/unsigned mismatch
  590. 9>h:\assaframan-ogre-dependencies-for-windows-phone-f16159239e75\src\freeimage-3.13.1\source\openexr\ilmimf\imftileoffsets.cpp(288): warning C4018: '>' : signed/unsigned mismatch
  591. 9>h:\assaframan-ogre-dependencies-for-windows-phone-f16159239e75\src\freeimage-3.13.1\source\openexr\ilmimf\imftileoffsets.cpp(289): warning C4018: '>' : signed/unsigned mismatch
  592. 9>  ImfTimeCode.cpp
  593. 9>h:\assaframan-ogre-dependencies-for-windows-phone-f16159239e75\src\freeimage-3.13.1\source\openexr\ilmimf\imftimecode.cpp(236): warning C4800: 'unsigned int' : forcing value to bool 'true' or 'false' (performance warning)
  594. 9>h:\assaframan-ogre-dependencies-for-windows-phone-f16159239e75\src\freeimage-3.13.1\source\openexr\ilmimf\imftimecode.cpp(250): warning C4800: 'unsigned int' : forcing value to bool 'true' or 'false' (performance warning)
  595. 9>h:\assaframan-ogre-dependencies-for-windows-phone-f16159239e75\src\freeimage-3.13.1\source\openexr\ilmimf\imftimecode.cpp(264): warning C4800: 'unsigned int' : forcing value to bool 'true' or 'false' (performance warning)
  596. 9>h:\assaframan-ogre-dependencies-for-windows-phone-f16159239e75\src\freeimage-3.13.1\source\openexr\ilmimf\imftimecode.cpp(278): warning C4800: 'unsigned int' : forcing value to bool 'true' or 'false' (performance warning)
  597. 9>h:\assaframan-ogre-dependencies-for-windows-phone-f16159239e75\src\freeimage-3.13.1\source\openexr\ilmimf\imftimecode.cpp(292): warning C4800: 'unsigned int' : forcing value to bool 'true' or 'false' (performance warning)
  598. 9>h:\assaframan-ogre-dependencies-for-windows-phone-f16159239e75\src\freeimage-3.13.1\source\openexr\ilmimf\imftimecode.cpp(306): warning C4800: 'unsigned int' : forcing value to bool 'true' or 'false' (performance warning)
  599. 9>  ImfTimeCodeAttribute.cpp
  600. 9>  ImfVecAttribute.cpp
  601. 9>  ImfVersion.cpp
  602. 9>  ImfWav.cpp
  603. 9>  ImfZipCompressor.cpp
  604. 9>  ImathBox.cpp
  605. 9>  ImathColorAlgo.cpp
  606. 9>  ImathFun.cpp
  607. 9>  Generating Code...
  608. 9>  Compiling...
  609. 9>  ImathMatrixAlgo.cpp
  610. 9>  ImathRandom.cpp
  611. 9>h:\assaframan-ogre-dependencies-for-windows-phone-f16159239e75\src\freeimage-3.13.1\source\openexr\imath\imathrandom.cpp(94): warning C4244: '=' : conversion from 'Imath::Int64' to 'unsigned short', possible loss of data
  612. 9>h:\assaframan-ogre-dependencies-for-windows-phone-f16159239e75\src\freeimage-3.13.1\source\openexr\imath\imathrandom.cpp(95): warning C4244: '=' : conversion from 'Imath::Int64' to 'unsigned short', possible loss of data
  613. 9>h:\assaframan-ogre-dependencies-for-windows-phone-f16159239e75\src\freeimage-3.13.1\source\openexr\imath\imathrandom.cpp(96): warning C4244: '=' : conversion from 'Imath::Int64' to 'unsigned short', possible loss of data
  614. 9>h:\assaframan-ogre-dependencies-for-windows-phone-f16159239e75\src\freeimage-3.13.1\source\openexr\imath\imathrandom.cpp(166): warning C4244: '=' : conversion from 'long' to 'unsigned short', possible loss of data
  615. 9>  ImathShear.cpp
  616. 9>  ImathVec.cpp
  617. 9>h:\assaframan-ogre-dependencies-for-windows-phone-f16159239e75\src\freeimage-3.13.1\source\openexr\imath\imathvec.cpp(179): warning C4244: 'argument' : conversion from 'int' to 'float', possible loss of data
  618. 9>h:\assaframan-ogre-dependencies-for-windows-phone-f16159239e75\src\freeimage-3.13.1\source\openexr\imath\imathvec.cpp(317): warning C4244: 'argument' : conversion from 'int' to 'float', possible loss of data
  619. 9>  IexBaseExc.cpp
  620. 9>  IexThrowErrnoExc.cpp
  621. 9>  half.cpp
  622. 9>  IlmThread.cpp
  623. 9>  IlmThreadMutex.cpp
  624. 9>  IlmThreadPool.cpp
  625. 9>h:\assaframan-ogre-dependencies-for-windows-phone-f16159239e75\src\freeimage-3.13.1\source\openexr\ilmthread\ilmthreadpool.cpp(250): warning C4018: '<' : signed/unsigned mismatch
  626. 9>h:\assaframan-ogre-dependencies-for-windows-phone-f16159239e75\src\freeimage-3.13.1\source\openexr\ilmthread\ilmthreadpool.cpp(367): warning C4018: '>' : signed/unsigned mismatch
  627. 9>h:\assaframan-ogre-dependencies-for-windows-phone-f16159239e75\src\freeimage-3.13.1\source\openexr\ilmthread\ilmthreadpool.cpp(373): warning C4018: '<' : signed/unsigned mismatch
  628. 9>h:\assaframan-ogre-dependencies-for-windows-phone-f16159239e75\src\freeimage-3.13.1\source\openexr\ilmthread\ilmthreadpool.cpp(379): warning C4018: '<' : signed/unsigned mismatch
  629. 9>h:\assaframan-ogre-dependencies-for-windows-phone-f16159239e75\src\freeimage-3.13.1\source\openexr\ilmthread\ilmthreadpool.cpp(392): warning C4018: '<' : signed/unsigned mismatch
  630. 9>  IlmThreadSemaphore.cpp
  631. 9>  Generating Code...
  632. 9>ImathShear.obj : warning LNK4221: This object file does not define any previously undefined public symbols, so it will not be used by any link operation that consumes this library
  633. 9>ImathBox.obj : warning LNK4221: This object file does not define any previously undefined public symbols, so it will not be used by any link operation that consumes this library
  634. 9>  OpenEXR.2012.WinRT.vcxproj -> H:\assaframan-ogre-dependencies-for-windows-phone-f16159239e75\src\FreeImage-3.13.1\Source\OpenEXR\.\Debug\OpenEXR.lib
  635. 14>------ Rebuild All started: Project: FreeImageLib, Configuration: Debug Win32 ------
  636. 1>  OgreMain.vcxproj -> H:\ogre\lib\Debug\OgreMainStatic_d.lib
  637. 15>------ Rebuild All started: Project: OgrePaging, Configuration: Debug Win32 ------
  638. 16>------ Rebuild All started: Project: Plugin_PCZSceneManager, Configuration: Debug Win32 ------
  639. 17>------ Rebuild All started: Project: OgreOverlay, Configuration: Debug Win32 ------
  640. 18>------ Rebuild All started: Project: OgreRTShaderSystem, Configuration: Debug Win32 ------
  641. 19>------ Rebuild All started: Project: OgreVolume, Configuration: Debug Win32 ------
  642. 20>------ Rebuild All started: Project: Plugin_BSPSceneManager, Configuration: Debug Win32 ------
  643. 21>------ Rebuild All started: Project: Plugin_OctreeSceneManager, Configuration: Debug Win32 ------
  644. 14>  BitmapAccess.cpp
  645. 20>  compile_Plugin_BSPSceneManager_0.cpp
  646. 17>  compile_OgreOverlay_0.cpp
  647. 16>  compile_Plugin_PCZSceneManager_0.cpp
  648. 18>  compile_OgreRTShaderSystem_0.cpp
  649. 19>  compile_OgreVolume_0.cpp
  650. 15>  compile_OgrePaging_0.cpp
  651. 21>  compile_Plugin_OctreeSceneManager_0.cpp
  652. 14>  ColorLookup.cpp
  653. 14>  FreeImage.cpp
  654. 14>  FreeImageIO.cpp
  655. 14>  GetType.cpp
  656. 14>  MemoryIO.cpp
  657. 14>  PixelAccess.cpp
  658. 14>  NNQuantizer.cpp
  659. 14>  WuQuantizer.cpp
  660. 14>  Conversion.cpp
  661. 14>  Conversion16_555.cpp
  662. 14>  Conversion16_565.cpp
  663. 14>  Conversion24.cpp
  664. 14>  Conversion32.cpp
  665. 20>H:\sinbad-ogre-dc4874552a2b\PlugIns\BSPSceneManager\src/OgreBspLevel.cpp(412): warning C4244: '=' : conversion from 'Ogre::ResourceHandle' to 'int', possible loss of data
  666. 20>H:\sinbad-ogre-dc4874552a2b\PlugIns\BSPSceneManager\src/OgreBspLevel.cpp(891): warning C4244: '=' : conversion from 'double' to 'Ogre::Real', possible loss of data
  667. 20>H:\sinbad-ogre-dc4874552a2b\PlugIns\BSPSceneManager\src/OgreBspLevel.cpp(892): warning C4244: '=' : conversion from 'double' to 'Ogre::Real', possible loss of data
  668. 20>H:\sinbad-ogre-dc4874552a2b\PlugIns\BSPSceneManager\src/OgreBspLevel.cpp(893): warning C4244: '=' : conversion from 'double' to 'Ogre::Real', possible loss of data
  669. 20>H:\sinbad-ogre-dc4874552a2b\PlugIns\BSPSceneManager\src/OgreBspLevel.cpp(897): warning C4244: 'argument' : conversion from 'double' to 'Ogre::Real', possible loss of data
  670. 14>  Conversion4.cpp
  671. 14>  Conversion8.cpp
  672. 16>H:\sinbad-ogre-dc4874552a2b\PlugIns\PCZSceneManager\src/OgrePCZCamera.cpp(48): warning C4305: 'argument' : truncation from 'double' to 'Ogre::Real'
  673. 14>  ConversionRGBF.cpp
  674. 17>H:\sinbad-ogre-dc4874552a2b\Components\Overlay\src/OgreTextAreaOverlayElement.cpp(71): warning C4305: '=' : truncation from 'double' to 'Ogre::Real'
  675. 16>H:\sinbad-ogre-dc4874552a2b\PlugIns\PCZSceneManager\src/OgreSegment.cpp(42): warning C4305: 'initializing' : truncation from 'double' to 'const Ogre::Real'
  676. 14>  ConversionType.cpp
  677. 14>  Halftoning.cpp
  678. 14>  tmoColorConvert.cpp
  679. 14>  Generating Code...
  680. 14>  Compiling...
  681. 14>  tmoDrago03.cpp
  682. 14>  tmoFattal02.cpp
  683. 14>  tmoReinhard05.cpp
  684. 18>H:\sinbad-ogre-dc4874552a2b\Components\RTShaderSystem\src/OgreShaderExTextureAtlasSampler.cpp(273): warning C4244: 'argument' : conversion from 'size_t' to 'const Ogre::Real', possible loss of data
  685. 14>  ToneMapping.cpp
  686. 14>  J2KHelper.cpp
  687. 14>  Plugin.cpp
  688. 14>  PluginBMP.cpp
  689. 14>  PluginCUT.cpp
  690. 14>  PluginDDS.cpp
  691. 14>  PluginEXR.cpp
  692. 19>  OgreVolume.vcxproj -> H:\ogre\lib\Debug\OgreVolumeStatic_d.lib
  693. 22>------ Rebuild All started: Project: Plugin_ParticleFX, Configuration: Debug Win32 ------
  694. 22>  compile_Plugin_ParticleFX_0.cpp
  695. 21>  Plugin_OctreeSceneManager.vcxproj -> H:\ogre\lib\Debug\Plugin_OctreeSceneManagerStatic_d.lib
  696. 23>------ Rebuild All started: Project: RenderSystem_Direct3D11, Configuration: Debug Win32 ------
  697. 23>  compile_RenderSystem_Direct3D11_0.cpp
  698. 14>  PluginG3.cpp
  699. 14>  PluginGIF.cpp
  700. 17>  OgreOverlay.vcxproj -> H:\ogre\lib\Debug\OgreOverlayStatic_d.lib
  701. 20>  Plugin_BSPSceneManager.vcxproj -> H:\ogre\lib\Debug\Plugin_BSPSceneManagerStatic_d.lib
  702. 14>  PluginHDR.cpp
  703. 16>  Plugin_PCZSceneManager.vcxproj -> H:\ogre\lib\Debug\Plugin_PCZSceneManagerStatic_d.lib
  704. 24>------ Rebuild All started: Project: Plugin_OctreeZone, Configuration: Debug Win32 ------
  705. 24>  compile_Plugin_OctreeZone_0.cpp
  706. 14>  PluginICO.cpp
  707. 14>  PluginIFF.cpp
  708. 22>H:\sinbad-ogre-dc4874552a2b\PlugIns\ParticleFX\src/OgreDeflectorPlaneAffector.cpp(95): warning C4244: 'argument' : conversion from 'double' to 'const Ogre::Real', possible loss of data
  709. 14>  PluginJ2K.cpp
  710. 14>  PluginJP2.cpp
  711. 14>  PluginJPEG.cpp
  712. 14>  PluginKOALA.cpp
  713. 14>  PluginMNG.cpp
  714. 14>  Generating Code...
  715. 14>  Compiling...
  716. 14>  PluginPCD.cpp
  717. 14>  PluginPCX.cpp
  718. 14>  PluginPFM.cpp
  719. 14>  PluginPICT.cpp
  720. 18>  OgreRTShaderSystem.vcxproj -> H:\ogre\lib\Debug\OgreRTShaderSystemStatic_d.lib
  721. 14>  PluginPNG.cpp
  722. 14>  PluginPNM.cpp
  723. 14>  PluginPSD.cpp
  724. 14>  PluginRAS.cpp
  725. 23>H:\sinbad-ogre-dc4874552a2b\RenderSystems\Direct3D11\src/OgreD3D11HardwareOcclusionQuery.cpp(105): warning C4244: '=' : conversion from 'UINT64' to 'unsigned int', possible loss of data
  726. 23>H:\sinbad-ogre-dc4874552a2b\RenderSystems\Direct3D11\src/OgreD3D11HardwareOcclusionQuery.cpp(106): warning C4244: '=' : conversion from 'UINT64' to 'unsigned int', possible loss of data
  727. 23>H:\sinbad-ogre-dc4874552a2b\RenderSystems\Direct3D11\src/OgreD3D11HardwareOcclusionQuery.cpp(151): warning C4244: '=' : conversion from 'UINT64' to 'unsigned int', possible loss of data
  728. 23>H:\sinbad-ogre-dc4874552a2b\RenderSystems\Direct3D11\src/OgreD3D11HardwarePixelBuffer.cpp(912): warning C4018: '<=' : signed/unsigned mismatch
  729. 14>  PluginRAW.cpp
  730. 23>H:\sinbad-ogre-dc4874552a2b\RenderSystems\Direct3D11\src/OgreD3D11HLSLProgram.cpp(264): warning C4018: '<' : signed/unsigned mismatch
  731. 23>H:\sinbad-ogre-dc4874552a2b\RenderSystems\Direct3D11\src/OgreD3D11HLSLProgram.cpp(273): warning C4018: '<' : signed/unsigned mismatch
  732. 23>H:\sinbad-ogre-dc4874552a2b\RenderSystems\Direct3D11\src/OgreD3D11HLSLProgram.cpp(282): warning C4018: '<' : signed/unsigned mismatch
  733. 23>H:\sinbad-ogre-dc4874552a2b\RenderSystems\Direct3D11\src/OgreD3D11HLSLProgram.cpp(291): warning C4018: '<' : signed/unsigned mismatch
  734. 23>H:\sinbad-ogre-dc4874552a2b\RenderSystems\Direct3D11\src/OgreD3D11HLSLProgram.cpp(300): warning C4018: '<' : signed/unsigned mismatch
  735. 23>H:\sinbad-ogre-dc4874552a2b\RenderSystems\Direct3D11\src/OgreD3D11HLSLProgram.cpp(309): warning C4018: '<' : signed/unsigned mismatch
  736. 23>H:\sinbad-ogre-dc4874552a2b\RenderSystems\Direct3D11\src/OgreD3D11HLSLProgram.cpp(318): warning C4018: '<' : signed/unsigned mismatch
  737. 23>H:\sinbad-ogre-dc4874552a2b\RenderSystems\Direct3D11\src/OgreD3D11HLSLProgram.cpp(327): warning C4018: '<' : signed/unsigned mismatch
  738. 23>H:\sinbad-ogre-dc4874552a2b\RenderSystems\Direct3D11\src/OgreD3D11HLSLProgram.cpp(336): warning C4018: '<' : signed/unsigned mismatch
  739. 23>H:\sinbad-ogre-dc4874552a2b\RenderSystems\Direct3D11\src/OgreD3D11HLSLProgram.cpp(351): warning C4018: '<' : signed/unsigned mismatch
  740. 14>  PluginSGI.cpp
  741. 14>  PluginTARGA.cpp
  742. 14>  PluginTIFF.cpp
  743. 14>  PluginWBMP.cpp
  744. 14>  PluginXBM.cpp
  745. 14>  PluginXPM.cpp
  746. 15>  OgrePaging.vcxproj -> H:\ogre\lib\Debug\OgrePagingStatic_d.lib
  747. 14>  PSDParser.cpp
  748. 22>  Plugin_ParticleFX.vcxproj -> H:\ogre\lib\Debug\Plugin_ParticleFXStatic_d.lib
  749. 25>------ Rebuild All started: Project: OgreTerrain, Configuration: Debug Win32 ------
  750. 25>  compile_OgreTerrain_0.cpp
  751. 14>h:\assaframan-ogre-dependencies-for-windows-phone-f16159239e75\src\freeimage-3.13.1\source\freeimage\psdparser.cpp(1009): warning C4244: 'initializing' : conversion from 'double' to 'float', possible loss of data
  752. 14>h:\assaframan-ogre-dependencies-for-windows-phone-f16159239e75\src\freeimage-3.13.1\source\freeimage\psdparser.cpp(1069): warning C4244: 'initializing' : conversion from 'double' to 'float', possible loss of data
  753. 14>  TIFFLogLuv.cpp
  754. 14>  Deprecated.cpp
  755. 14>  DeprecationMgr.cpp
  756. 14>  CacheFile.cpp
  757. 24>  Plugin_OctreeZone.vcxproj -> H:\ogre\lib\Debug\Plugin_OctreeZoneStatic_d.lib
  758. 14>  Generating Code...
  759. 14>  Compiling...
  760. 14>  MultiPage.cpp
  761. 14>  ZLibInterface.cpp
  762. 14>  Exif.cpp
  763. 14>  FIRational.cpp
  764. 23>RenderSystem_Direct3D11.dir\Debug\compile_RenderSystem_Direct3D11_0.obj : warning LNK4264: archiving object file compiled with /ZW into a static library; note that when authoring Windows Runtime types it is not recommended to link with a static library that contains Windows Runtime metadata
  765. 23>  RenderSystem_Direct3D11.vcxproj -> H:\ogre\lib\Debug\RenderSystem_Direct3D11Static_d.lib
  766. 14>  FreeImageTag.cpp
  767. 14>  IPTC.cpp
  768. 14>  TagConversion.cpp
  769. 14>  TagLib.cpp
  770. 25>H:\sinbad-ogre-dc4874552a2b\Components\Terrain\src/OgreTerrain.cpp(4155): warning C4305: 'argument' : truncation from 'double' to 'Ogre::Real'
  771. 14>  XTIFF.cpp
  772. 25>H:\sinbad-ogre-dc4874552a2b\Components\Terrain\src/OgreTerrainMaterialGeneratorA.cpp(654): warning C4305: 'argument' : truncation from 'double' to 'const Ogre::Real'
  773. 14>  Background.cpp
  774. 14>  BSplineRotate.cpp
  775. 14>  Channels.cpp
  776. 14>  ClassicRotate.cpp
  777. 14>  Colors.cpp
  778. 14>  CopyPaste.cpp
  779. 14>  Display.cpp
  780. 14>  Flip.cpp
  781. 14>  JPEGTransform.cpp
  782. 14>  MultigridPoissonSolver.cpp
  783. 14>  Rescale.cpp
  784. 14>  Generating Code...
  785. 14>  Compiling...
  786. 14>  Resize.cpp
  787. 14>  Generating Code...
  788. 14>OpenEXR.lib(ImathBox.obj) : warning LNK4221: This object file does not define any previously undefined public symbols, so it will not be used by any link operation that consumes this library
  789. 14>OpenEXR.lib(ImathShear.obj) : warning LNK4221: This object file does not define any previously undefined public symbols, so it will not be used by any link operation that consumes this library
  790. 14>  FreeImageLib.2012.WinRT.vcxproj -> H:\assaframan-ogre-dependencies-for-windows-phone-f16159239e75\src\FreeImage-3.13.1\Source\FreeImageLib\.\Debug\FreeImaged.lib
  791. 14>  The system cannot find the path specified.
  792. 14>          0 file(s) copied.
  793. 14>          1 file(s) copied.
  794. 25>  OgreTerrain.vcxproj -> H:\ogre\lib\Debug\OgreTerrainStatic_d.lib
  795. 26>------ Rebuild All started: Project: Sample_DualQuaternion, Configuration: Debug Win32 ------
  796. 27>------ Rebuild All started: Project: Sample_DynTex, Configuration: Debug Win32 ------
  797. 28>------ Rebuild All started: Project: Sample_EndlessWorld, Configuration: Debug Win32 ------
  798. 29>------ Rebuild All started: Project: Sample_FacialAnimation, Configuration: Debug Win32 ------
  799. 30>------ Rebuild All started: Project: Sample_Fresnel, Configuration: Debug Win32 ------
  800. 31>------ Rebuild All started: Project: Sample_Grass, Configuration: Debug Win32 ------
  801. 32>------ Rebuild All started: Project: Sample_Instancing, Configuration: Debug Win32 ------
  802. 33>------ Rebuild All started: Project: Sample_Isosurf, Configuration: Debug Win32 ------
  803. 32>  Instancing.cpp
  804. 31>  Grass.cpp
  805. 26>  DualQuaternion.cpp
  806. 33>  ProceduralTools.cpp
  807. 28>  EndlessWorld.cpp
  808. 29>  FacialAnimation.cpp
  809. 27>  DynTex.cpp
  810. 28>  PerlinNoiseTerrainGenerator.cpp
  811. 33>  Isosurf.cpp
  812. 30>  Fresnel.cpp
  813. 27>H:\sinbad-ogre-dc4874552a2b\Samples\DynTex\include\DynTex.h(43): warning C4305: '-=' : truncation from 'double' to 'Ogre::Real'
  814. 30>H:\sinbad-ogre-dc4874552a2b\Samples\Fresnel\include\Fresnel.h(170): warning C4305: 'argument' : truncation from 'double' to 'Ogre::Real'
  815. 30>H:\sinbad-ogre-dc4874552a2b\Samples\Fresnel\include\Fresnel.h(184): warning C4305: 'argument' : truncation from 'double' to 'Ogre::Real'
  816. 26>H:\sinbad-ogre-dc4874552a2b\Samples\DualQuaternion\include\DualQuaternion.h(32): warning C4305: 'argument' : truncation from 'double' to 'const Ogre::Real'
  817. 26>H:\sinbad-ogre-dc4874552a2b\Samples\DualQuaternion\include\DualQuaternion.h(69): warning C4305: 'argument' : truncation from 'double' to 'float'
  818. 26>H:\sinbad-ogre-dc4874552a2b\Samples\DualQuaternion\include\DualQuaternion.h(73): warning C4305: 'argument' : truncation from 'double' to 'float'
  819. 26>H:\sinbad-ogre-dc4874552a2b\Samples\DualQuaternion\include\DualQuaternion.h(121): warning C4305: 'argument' : truncation from 'double' to 'const Ogre::Real'
  820. 26>H:\sinbad-ogre-dc4874552a2b\Samples\DualQuaternion\include\DualQuaternion.h(131): warning C4305: 'argument' : truncation from 'double' to 'const Ogre::Real'
  821. 31>H:\sinbad-ogre-dc4874552a2b\Samples\Grass\include\Grass.h(126): warning C4305: 'argument' : truncation from 'double' to 'Ogre::Real'
  822. 31>H:\sinbad-ogre-dc4874552a2b\Samples\Grass\include\Grass.h(231): warning C4305: 'argument' : truncation from 'double' to 'float'
  823. 31>H:\sinbad-ogre-dc4874552a2b\Samples\Grass\include\Grass.h(236): warning C4305: 'argument' : truncation from 'double' to 'Ogre::Real'
  824. 31>H:\sinbad-ogre-dc4874552a2b\Samples\Grass\include\Grass.h(237): warning C4305: 'argument' : truncation from 'double' to 'Ogre::Real'
  825. 33>H:\sinbad-ogre-dc4874552a2b\Samples\Isosurf\src\Isosurf.cpp(66): warning C4305: 'argument' : truncation from 'double' to 'Ogre::Real'
  826. 33>H:\sinbad-ogre-dc4874552a2b\Samples\Isosurf\src\Isosurf.cpp(89): warning C4305: 'argument' : truncation from 'double' to 'const Ogre::Real'
  827. 33>H:\sinbad-ogre-dc4874552a2b\Samples\Isosurf\src\Isosurf.cpp(93): warning C4305: 'argument' : truncation from 'double' to 'const Ogre::Real'
  828. 28>H:\sinbad-ogre-dc4874552a2b\Samples\EndlessWorld\include\EndlessWorld.h(141): warning C4305: 'argument' : truncation from 'double' to 'Ogre::Real' (H:\sinbad-ogre-dc4874552a2b\Samples\EndlessWorld\src\EndlessWorld.cpp)
  829. 28>H:\sinbad-ogre-dc4874552a2b\Samples\EndlessWorld\include\EndlessWorld.h(332): warning C4305: 'argument' : truncation from 'double' to 'Ogre::Real' (H:\sinbad-ogre-dc4874552a2b\Samples\EndlessWorld\src\EndlessWorld.cpp)
  830. 28>H:\sinbad-ogre-dc4874552a2b\Samples\EndlessWorld\include\EndlessWorld.h(394): warning C4305: 'argument' : truncation from 'double' to 'float' (H:\sinbad-ogre-dc4874552a2b\Samples\EndlessWorld\src\EndlessWorld.cpp)
  831. 28>H:\sinbad-ogre-dc4874552a2b\Samples\EndlessWorld\include\EndlessWorld.h(398): warning C4305: 'argument' : truncation from 'double' to 'const Ogre::Real' (H:\sinbad-ogre-dc4874552a2b\Samples\EndlessWorld\src\EndlessWorld.cpp)
  832. 28>H:\sinbad-ogre-dc4874552a2b\Samples\EndlessWorld\include\EndlessWorld.h(406): warning C4305: 'argument' : truncation from 'double' to 'float' (H:\sinbad-ogre-dc4874552a2b\Samples\EndlessWorld\src\EndlessWorld.cpp)
  833. 28>H:\sinbad-ogre-dc4874552a2b\Samples\EndlessWorld\include\EndlessWorld.h(408): warning C4305: 'argument' : truncation from 'double' to 'float' (H:\sinbad-ogre-dc4874552a2b\Samples\EndlessWorld\src\EndlessWorld.cpp)
  834. 32>H:\sinbad-ogre-dc4874552a2b\Samples\Instancing\include\Instancing.h(379): warning C4305: 'argument' : truncation from 'double' to 'float'
  835. 27>  Sample_DynTex.vcxproj -> H:\ogre\lib\Debug\Sample_DynTex_d.lib
  836. 29>  Sample_FacialAnimation.vcxproj -> H:\ogre\lib\Debug\Sample_FacialAnimation_d.lib
  837. 34>------ Rebuild All started: Project: Sample_Lighting, Configuration: Debug Win32 ------
  838. 26>  Sample_DualQuaternion.vcxproj -> H:\ogre\lib\Debug\Sample_DualQuaternion_d.lib
  839. 35>------ Rebuild All started: Project: Sample_NewInstancing, Configuration: Debug Win32 ------
  840. 36>------ Rebuild All started: Project: Sample_Ocean, Configuration: Debug Win32 ------
  841. 34>  Lighting.cpp
  842. 35>  NewInstancing.cpp
  843. 36>  OceanDemo.cpp
  844. 36>  MaterialControls.cpp
  845. 30>  Sample_Fresnel.vcxproj -> H:\ogre\lib\Debug\Sample_Fresnel_d.lib
  846. 37>------ Rebuild All started: Project: Sample_ParticleFX, Configuration: Debug Win32 ------
  847. 33>  Sample_Isosurf.vcxproj -> H:\ogre\lib\Debug\Sample_Isosurf_d.lib
  848. 37>  ParticleFX.cpp
  849. 38>------ Rebuild All started: Project: Sample_ParticleGS, Configuration: Debug Win32 ------
  850. 31>  Sample_Grass.vcxproj -> H:\ogre\lib\Debug\Sample_Grass_d.lib
  851. 38>  ParticleGS.cpp
  852. 38>  ProceduralManualObject.cpp
  853. 38>  RandomTools.cpp
  854. 39>------ Rebuild All started: Project: Sample_SSAO, Configuration: Debug Win32 ------
  855. 39>  SSAO.cpp
  856. 32>  Sample_Instancing.vcxproj -> H:\ogre\lib\Debug\Sample_Instancing_d.lib
  857. 40>------ Rebuild All started: Project: Sample_ShaderSystem, Configuration: Debug Win32 ------
  858. 40>  ShaderSystem.cpp
  859. 40>  ShaderExReflectionMap.cpp
  860. 40>  OgreShaderExInstancedViewports.cpp
  861. 40>H:\sinbad-ogre-dc4874552a2b\Samples\ShaderSystem\src\OgreShaderExInstancedViewports.cpp(258): warning C4305: 'argument' : truncation from 'double' to 'const Ogre::Real'
  862. 40>H:\sinbad-ogre-dc4874552a2b\Samples\ShaderSystem\src\OgreShaderExInstancedViewports.cpp(259): warning C4305: 'argument' : truncation from 'double' to 'const Ogre::Real'
  863. 34>H:\sinbad-ogre-dc4874552a2b\Samples\Lighting\include\Lighting.h(108): warning C4305: 'argument' : truncation from 'double' to 'float'
  864. 34>H:\sinbad-ogre-dc4874552a2b\Samples\Lighting\include\Lighting.h(184): warning C4305: 'argument' : truncation from 'double' to 'Ogre::Real'
  865. 34>H:\sinbad-ogre-dc4874552a2b\Samples\Lighting\include\Lighting.h(243): warning C4305: 'argument' : truncation from 'double' to 'Ogre::Real'
  866. 36>H:\sinbad-ogre-dc4874552a2b\Samples\OceanDemo\include\OceanDemo.h(111): warning C4305: 'argument' : truncation from 'double' to 'float' (H:\sinbad-ogre-dc4874552a2b\Samples\OceanDemo\src\OceanDemo.cpp)
  867. 36>H:\sinbad-ogre-dc4874552a2b\Samples\OceanDemo\include\OceanDemo.h(199): warning C4305: 'argument' : truncation from 'double' to 'float' (H:\sinbad-ogre-dc4874552a2b\Samples\OceanDemo\src\OceanDemo.cpp)
  868. 35>H:\sinbad-ogre-dc4874552a2b\Samples\NewInstancing\src\NewInstancing.cpp(176): warning C4305: 'argument' : truncation from 'double' to 'float'
  869. 35>H:\sinbad-ogre-dc4874552a2b\Samples\NewInstancing\src\NewInstancing.cpp(182): warning C4305: 'argument' : truncation from 'double' to 'Ogre::Real'
  870. 35>H:\sinbad-ogre-dc4874552a2b\Samples\NewInstancing\src\NewInstancing.cpp(183): warning C4305: 'argument' : truncation from 'double' to 'Ogre::Real'
  871. 35>H:\sinbad-ogre-dc4874552a2b\Samples\NewInstancing\src\NewInstancing.cpp(192): warning C4305: 'argument' : truncation from 'double' to 'Ogre::Real'
  872. 35>H:\sinbad-ogre-dc4874552a2b\Samples\NewInstancing\src\NewInstancing.cpp(193): warning C4305: 'argument' : truncation from 'double' to 'Ogre::Real'
  873. 38>H:\sinbad-ogre-dc4874552a2b\Samples\ParticleGS\src\ParticleGS.cpp(34): warning C4305: 'argument' : truncation from 'double' to 'const Ogre::Real'
  874. 38>H:\sinbad-ogre-dc4874552a2b\Samples\ParticleGS\src\ParticleGS.cpp(140): warning C4305: 'argument' : truncation from 'double' to 'Ogre::Real'
  875. 37>H:\sinbad-ogre-dc4874552a2b\Samples\ParticleFX\include\ParticleFX.h(40): warning C4305: 'argument' : truncation from 'double' to 'float'
  876. 39>H:\sinbad-ogre-dc4874552a2b\Samples\SSAO\include\SSAO.h(435): warning C4305: 'argument' : truncation from 'double' to 'Ogre::Real'
  877. 40>H:\sinbad-ogre-dc4874552a2b\Samples\ShaderSystem\src\ShaderSystem.cpp(164): warning C4305: 'argument' : truncation from 'double' to 'Ogre::Real'
  878. 40>H:\sinbad-ogre-dc4874552a2b\Samples\ShaderSystem\src\ShaderSystem.cpp(300): warning C4305: 'argument' : truncation from 'double' to 'float'
  879. 40>H:\sinbad-ogre-dc4874552a2b\Samples\ShaderSystem\src\ShaderSystem.cpp(835): warning C4305: '=' : truncation from 'double' to 'Ogre::Real'
  880. 40>H:\sinbad-ogre-dc4874552a2b\Samples\ShaderSystem\src\ShaderSystem.cpp(838): warning C4305: 'argument' : truncation from 'double' to 'Ogre::Real'
  881. 40>H:\sinbad-ogre-dc4874552a2b\Samples\ShaderSystem\src\ShaderSystem.cpp(868): warning C4305: 'argument' : truncation from 'double' to 'Ogre::Real'
  882. 40>H:\sinbad-ogre-dc4874552a2b\Samples\ShaderSystem\src\ShaderSystem.cpp(870): warning C4305: 'argument' : truncation from 'double' to 'Ogre::Real'
  883. 40>H:\sinbad-ogre-dc4874552a2b\Samples\ShaderSystem\src\ShaderSystem.cpp(900): warning C4305: 'argument' : truncation from 'double' to 'Ogre::Real'
  884. 40>H:\sinbad-ogre-dc4874552a2b\Samples\ShaderSystem\src\ShaderSystem.cpp(902): warning C4305: 'argument' : truncation from 'double' to 'Ogre::Real'
  885. 40>H:\sinbad-ogre-dc4874552a2b\Samples\ShaderSystem\src\ShaderSystem.cpp(904): warning C4305: 'argument' : truncation from 'double' to 'Ogre::Real'
  886. 34>  Sample_Lighting.vcxproj -> H:\ogre\lib\Debug\Sample_Lighting_d.lib
  887. 41>------ Rebuild All started: Project: Sample_ShaderSystemMultiLight, Configuration: Debug Win32 ------
  888. 28>  Sample_EndlessWorld.vcxproj -> H:\ogre\lib\Debug\Sample_EndlessWorld_d.lib
  889. 41>  ShaderSystemMultiLight.cpp
  890. 41>  SegmentedDynamicLightManager.cpp
  891. 41>  RTShaderSRSSegmentedLights.cpp
  892. 36>  Sample_Ocean.vcxproj -> H:\ogre\lib\Debug\Sample_Ocean_d.lib
  893. 42>------ Rebuild All started: Project: Sample_ShaderSystemTexturedFog, Configuration: Debug Win32 ------
  894. 43>------ Rebuild All started: Project: Sample_Shadows, Configuration: Debug Win32 ------
  895. 42>  ShaderSystemTexturedFog.cpp
  896. 42>  RTShaderSRSTexturedFog.cpp
  897. 43>  Shadows.cpp
  898. 37>  Sample_ParticleFX.vcxproj -> H:\ogre\lib\Debug\Sample_ParticleFX_d.lib
  899. 38>  Sample_ParticleGS.vcxproj -> H:\ogre\lib\Debug\Sample_ParticleGS_d.lib
  900. 44>------ Rebuild All started: Project: Sample_SkeletalAnimation, Configuration: Debug Win32 ------
  901. 44>  SkeletalAnimation.cpp
  902. 45>------ Rebuild All started: Project: Sample_SkyBox, Configuration: Debug Win32 ------
  903. 45>  SkyBox.cpp
  904. 39>  Sample_SSAO.vcxproj -> H:\ogre\lib\Debug\Sample_SSAO_d.lib
  905. 46>------ Rebuild All started: Project: Sample_SkyDome, Configuration: Debug Win32 ------
  906. 46>  SkyDome.cpp
  907. 40>  Sample_ShaderSystem.vcxproj -> H:\ogre\lib\Debug\Sample_ShaderSystem_d.lib
  908. 47>------ Rebuild All started: Project: Sample_SkyPlane, Configuration: Debug Win32 ------
  909. 47>  SkyPlane.cpp
  910. 41>H:\sinbad-ogre-dc4874552a2b\Samples\ShaderSystemMultiLight\include\ShaderSystemMultiLight.h(186): warning C4305: 'argument' : truncation from 'double' to 'float' (H:\sinbad-ogre-dc4874552a2b\Samples\ShaderSystemMultiLight\src\ShaderSystemMultiLight.cpp)
  911. 41>H:\sinbad-ogre-dc4874552a2b\Samples\ShaderSystemMultiLight\include\ShaderSystemMultiLight.h(191): warning C4305: 'argument' : truncation from 'double' to 'float' (H:\sinbad-ogre-dc4874552a2b\Samples\ShaderSystemMultiLight\src\ShaderSystemMultiLight.cpp)
  912. 43>H:\sinbad-ogre-dc4874552a2b\Samples\Shadows\include\Shadows.h(160): warning C4305: 'argument' : truncation from 'double' to 'float'
  913. 43>H:\sinbad-ogre-dc4874552a2b\Samples\Shadows\include\Shadows.h(235): warning C4305: 'argument' : truncation from 'double' to 'Ogre::Real'
  914. 43>H:\sinbad-ogre-dc4874552a2b\Samples\Shadows\include\Shadows.h(236): warning C4305: 'argument' : truncation from 'double' to 'Ogre::Real'
  915. 43>H:\sinbad-ogre-dc4874552a2b\Samples\Shadows\include\Shadows.h(242): warning C4305: 'argument' : truncation from 'double' to 'Ogre::Real'
  916. 43>H:\sinbad-ogre-dc4874552a2b\Samples\Shadows\include\Shadows.h(432): warning C4305: 'argument' : truncation from 'double' to 'Ogre::Real'
  917. 43>H:\sinbad-ogre-dc4874552a2b\Samples\Shadows\include\Shadows.h(446): warning C4305: 'argument' : truncation from 'double' to 'Ogre::Real'
  918. 43>H:\sinbad-ogre-dc4874552a2b\Samples\Shadows\include\Shadows.h(460): warning C4305: 'argument' : truncation from 'double' to 'Ogre::Real'
  919. 43>H:\sinbad-ogre-dc4874552a2b\Samples\Shadows\include\Shadows.h(514): warning C4305: 'argument' : truncation from 'double' to 'Ogre::Real'
  920. 43>H:\sinbad-ogre-dc4874552a2b\Samples\Shadows\include\Shadows.h(515): warning C4305: 'argument' : truncation from 'double' to 'Ogre::Real'
  921. 43>H:\sinbad-ogre-dc4874552a2b\Samples\Shadows\include\Shadows.h(518): warning C4305: 'argument' : truncation from 'double' to 'Ogre::Real'
  922. 43>H:\sinbad-ogre-dc4874552a2b\Samples\Shadows\include\Shadows.h(519): warning C4305: 'argument' : truncation from 'double' to 'Ogre::Real'
  923. 43>H:\sinbad-ogre-dc4874552a2b\Samples\Shadows\include\Shadows.h(523): warning C4305: 'argument' : truncation from 'double' to 'Ogre::Real'
  924. 44>H:\sinbad-ogre-dc4874552a2b\Samples\SkeletalAnimation\include\SkeletalAnimation.h(84): warning C4305: 'argument' : truncation from 'double' to 'float'
  925. 45>H:\sinbad-ogre-dc4874552a2b\Samples\SkyBox\include\SkyBox.h(26): warning C4305: 'argument' : truncation from 'double' to 'float'
  926. 46>H:\sinbad-ogre-dc4874552a2b\Samples\SkyDome\include\SkyDome.h(32): warning C4305: 'argument' : truncation from 'double' to 'float'
  927. 47>H:\sinbad-ogre-dc4874552a2b\Samples\SkyPlane\include\SkyPlane.h(26): warning C4305: 'argument' : truncation from 'double' to 'float'
  928. 35>  Sample_NewInstancing.vcxproj -> H:\ogre\lib\Debug\Sample_NewInstancing_d.lib
  929. 48>------ Rebuild All started: Project: Sample_Smoke, Configuration: Debug Win32 ------
  930. 42>  Sample_ShaderSystemTexturedFog.vcxproj -> H:\ogre\lib\Debug\Sample_ShaderSystemTexturedFog_d.lib
  931. 43>  Sample_Shadows.vcxproj -> H:\ogre\lib\Debug\Sample_Shadows_d.lib
  932. 49>------ Rebuild All started: Project: Sample_SphereMapping, Configuration: Debug Win32 ------
  933. 50>------ Rebuild All started: Project: Sample_Terrain, Configuration: Debug Win32 ------
  934. 48>  Smoke.cpp
  935. 49>  SphereMapping.cpp
  936. 44>  Sample_SkeletalAnimation.vcxproj -> H:\ogre\lib\Debug\Sample_SkeletalAnimation_d.lib
  937. 50>  Terrain.cpp
  938. 51>------ Rebuild All started: Project: Sample_Tesselation, Configuration: Debug Win32 ------
  939. 45>  Sample_SkyBox.vcxproj -> H:\ogre\lib\Debug\Sample_SkyBox_d.lib
  940. 51>  Tesselation.cpp
  941. 52>------ Rebuild All started: Project: Sample_TextureArray, Configuration: Debug Win32 ------
  942. 52>  TextureArray.cpp
  943. 46>  Sample_SkyDome.vcxproj -> H:\ogre\lib\Debug\Sample_SkyDome_d.lib
  944. 53>------ Rebuild All started: Project: Sample_TextureFX, Configuration: Debug Win32 ------
  945. 53>  TextureFX.cpp
  946. 47>  Sample_SkyPlane.vcxproj -> H:\ogre\lib\Debug\Sample_SkyPlane_d.lib
  947. 54>------ Rebuild All started: Project: Sample_Transparency, Configuration: Debug Win32 ------
  948. 54>  Transparency.cpp
  949. 48>H:\sinbad-ogre-dc4874552a2b\Samples\Smoke\include\Smoke.h(37): warning C4305: 'argument' : truncation from 'double' to 'float'
  950. 49>H:\sinbad-ogre-dc4874552a2b\Samples\SphereMapping\include\SphereMapping.h(33): warning C4305: 'argument' : truncation from 'double' to 'float'
  951. 50>H:\sinbad-ogre-dc4874552a2b\Samples\Terrain\include\Terrain.h(56): warning C4305: 'initializing' : truncation from 'double' to 'Ogre::Real'
  952. 50>H:\sinbad-ogre-dc4874552a2b\Samples\Terrain\include\Terrain.h(65): warning C4305: '=' : truncation from 'double' to 'Ogre::Real'
  953. 50>H:\sinbad-ogre-dc4874552a2b\Samples\Terrain\include\Terrain.h(714): warning C4305: 'argument' : truncation from 'double' to 'Ogre::Real'
  954. 50>H:\sinbad-ogre-dc4874552a2b\Samples\Terrain\include\Terrain.h(765): warning C4305: 'argument' : truncation from 'double' to 'Ogre::Real'
  955. 50>H:\sinbad-ogre-dc4874552a2b\Samples\Terrain\include\Terrain.h(776): warning C4305: 'argument' : truncation from 'double' to 'float'
  956. 50>H:\sinbad-ogre-dc4874552a2b\Samples\Terrain\include\Terrain.h(780): warning C4305: 'argument' : truncation from 'double' to 'const Ogre::Real'
  957. 50>H:\sinbad-ogre-dc4874552a2b\Samples\Terrain\include\Terrain.h(788): warning C4305: 'argument' : truncation from 'double' to 'float'
  958. 50>H:\sinbad-ogre-dc4874552a2b\Samples\Terrain\include\Terrain.h(790): warning C4305: 'argument' : truncation from 'double' to 'float'
  959. 50>H:\sinbad-ogre-dc4874552a2b\Samples\Terrain\include\Terrain.h(839): warning C4305: 'argument' : truncation from 'double' to 'const Ogre::Real'
  960. 50>H:\sinbad-ogre-dc4874552a2b\Samples\Terrain\include\Terrain.h(848): warning C4305: 'argument' : truncation from 'double' to 'const Ogre::Real'
  961. 50>H:\sinbad-ogre-dc4874552a2b\Samples\Terrain\include\Terrain.h(857): warning C4305: 'argument' : truncation from 'double' to 'const Ogre::Real'
  962. 48>  Sample_Smoke.vcxproj -> H:\ogre\lib\Debug\Sample_Smoke_d.lib
  963. 41>  Sample_ShaderSystemMultiLight.vcxproj -> H:\ogre\lib\Debug\Sample_ShaderSystemMultiLight_d.lib
  964. 55>------ Rebuild All started: Project: Sample_VolumeCSG, Configuration: Debug Win32 ------
  965. 56>------ Rebuild All started: Project: Sample_BSP, Configuration: Debug Win32 ------
  966. 55>  VolumeCSG.cpp
  967. 49>  Sample_SphereMapping.vcxproj -> H:\ogre\lib\Debug\Sample_SphereMapping_d.lib
  968. 56>  BSP.cpp
  969. 57>------ Rebuild All started: Project: Sample_VolumeTex, Configuration: Debug Win32 ------
  970. 51>  Sample_Tesselation.vcxproj -> H:\ogre\lib\Debug\Sample_Tesselation_d.lib
  971. 58>------ Rebuild All started: Project: Sample_Water, Configuration: Debug Win32 ------
  972. 57>  VolumeTex.cpp
  973. 57>  ThingRenderable.cpp
  974. 57>  VolumeRenderable.cpp
  975. 52>  Sample_TextureArray.vcxproj -> H:\ogre\lib\Debug\Sample_TextureArray_d.lib
  976. 58>  Water.cpp
  977. 58>  WaterMesh.cpp
  978. 59>------ Rebuild All started: Project: Sample_BezierPatch, Configuration: Debug Win32 ------
  979. 59>  BezierPatch.cpp
  980. 53>  Sample_TextureFX.vcxproj -> H:\ogre\lib\Debug\Sample_TextureFX_d.lib
  981. 60>------ Rebuild All started: Project: Sample_CameraTrack, Configuration: Debug Win32 ------
  982. 60>  CameraTrack.cpp
  983. 54>  Sample_Transparency.vcxproj -> H:\ogre\lib\Debug\Sample_Transparency_d.lib
  984. 61>------ Rebuild All started: Project: Sample_VolumeTerrain, Configuration: Debug Win32 ------
  985. 61>  VolumeTerrain.cpp
  986. 58>H:\sinbad-ogre-dc4874552a2b\Samples\Water\src\WaterMesh.cpp(300): warning C4244: 'initializing' : conversion from 'double' to 'Ogre::Real', possible loss of data
  987. 58>H:\sinbad-ogre-dc4874552a2b\Samples\Water\src\WaterMesh.cpp(301): warning C4244: 'initializing' : conversion from 'double' to 'Ogre::Real', possible loss of data
  988. 58>H:\sinbad-ogre-dc4874552a2b\Samples\Water\src\WaterMesh.cpp(302): warning C4244: 'initializing' : conversion from 'double' to 'Ogre::Real', possible loss of data
  989. 58>H:\sinbad-ogre-dc4874552a2b\Samples\Water\include\Water.h(389): warning C4305: 'argument' : truncation from 'double' to 'Ogre::Real' (H:\sinbad-ogre-dc4874552a2b\Samples\Water\src\Water.cpp)
  990. 58>H:\sinbad-ogre-dc4874552a2b\Samples\Water\include\Water.h(390): warning C4305: 'argument' : truncation from 'double' to 'Ogre::Real' (H:\sinbad-ogre-dc4874552a2b\Samples\Water\src\Water.cpp)
  991. 58>H:\sinbad-ogre-dc4874552a2b\Samples\Water\include\Water.h(391): warning C4305: 'argument' : truncation from 'double' to 'Ogre::Real' (H:\sinbad-ogre-dc4874552a2b\Samples\Water\src\Water.cpp)
  992. 58>H:\sinbad-ogre-dc4874552a2b\Samples\Water\include\Water.h(392): warning C4305: 'argument' : truncation from 'double' to 'Ogre::Real' (H:\sinbad-ogre-dc4874552a2b\Samples\Water\src\Water.cpp)
  993. 57>H:\sinbad-ogre-dc4874552a2b\Samples\VolumeTex\src\VolumeTex.cpp(87): warning C4305: 'argument' : truncation from 'double' to 'float'
  994. 57>H:\sinbad-ogre-dc4874552a2b\Samples\VolumeTex\src\VolumeTex.cpp(94): warning C4305: 'argument' : truncation from 'double' to 'Ogre::Real'
  995. 57>H:\sinbad-ogre-dc4874552a2b\Samples\VolumeTex\src\VolumeTex.cpp(95): warning C4305: 'argument' : truncation from 'double' to 'Ogre::Real'
  996. 60>H:\sinbad-ogre-dc4874552a2b\Samples\CameraTrack\include\CameraTrack.h(33): warning C4305: 'argument' : truncation from 'double' to 'float'
  997. 56>  Sample_BSP.vcxproj -> H:\ogre\lib\Debug\Sample_BSP_d.lib
  998. 62>------ Rebuild All started: Project: Sample_CelShading, Configuration: Debug Win32 ------
  999. 62>  CelShading.cpp
  1000. 50>  Sample_Terrain.vcxproj -> H:\ogre\lib\Debug\Sample_Terrain_d.lib
  1001. 57>  Sample_VolumeTex.vcxproj -> H:\ogre\lib\Debug\Sample_VolumeTex_d.lib
  1002. 63>------ Rebuild All started: Project: Sample_Character, Configuration: Debug Win32 ------
  1003. 64>------ Rebuild All started: Project: Sample_Compositor, Configuration: Debug Win32 ------
  1004. 58>  Sample_Water.vcxproj -> H:\ogre\lib\Debug\Sample_Water_d.lib
  1005. 63>  CharacterSample.cpp
  1006. 64>  Compositor.cpp
  1007. 64>  HelperLogics.cpp
  1008. 65>------ Rebuild All started: Project: Sample_CubeMapping, Configuration: Debug Win32 ------
  1009. 65>  CubeMapping.cpp
  1010. 59>  Sample_BezierPatch.vcxproj -> H:\ogre\lib\Debug\Sample_BezierPatch_d.lib
  1011. 66>------ Rebuild All started: Project: Sample_DeferredShading, Configuration: Debug Win32 ------
  1012. 60>  Sample_CameraTrack.vcxproj -> H:\ogre\lib\Debug\Sample_CameraTrack_d.lib
  1013. 66>  compile_Sample_DeferredShading_0.cpp
  1014. 67>------ Rebuild All started: Project: Sample_Dot3Bump, Configuration: Debug Win32 ------
  1015. 67>  Dot3Bump.cpp
  1016. 61>  Sample_VolumeTerrain.vcxproj -> H:\ogre\lib\Debug\Sample_VolumeTerrain_d.lib
  1017. 64>H:\sinbad-ogre-dc4874552a2b\Samples\Compositor\src\HelperLogics.cpp(126): warning C4305: 'argument' : truncation from 'double' to 'Ogre::Real'
  1018. 64>H:\sinbad-ogre-dc4874552a2b\Samples\Compositor\src\HelperLogics.cpp(186): warning C4244: 'argument' : conversion from 'int' to 'Ogre::Real', possible loss of data
  1019. 64>H:\sinbad-ogre-dc4874552a2b\Samples\Compositor\src\HelperLogics.cpp(287): warning C4244: 'argument' : conversion from 'int' to 'Ogre::Real', possible loss of data
  1020. 62>H:\sinbad-ogre-dc4874552a2b\Samples\CelShading\include\CelShading.h(76): warning C4305: 'argument' : truncation from 'double' to 'const Ogre::Real'
  1021. 62>H:\sinbad-ogre-dc4874552a2b\Samples\CelShading\include\CelShading.h(77): warning C4305: 'argument' : truncation from 'double' to 'const Ogre::Real'
  1022. 62>H:\sinbad-ogre-dc4874552a2b\Samples\CelShading\include\CelShading.h(82): warning C4305: 'argument' : truncation from 'double' to 'const Ogre::Real'
  1023. 62>H:\sinbad-ogre-dc4874552a2b\Samples\CelShading\include\CelShading.h(87): warning C4305: 'argument' : truncation from 'double' to 'const Ogre::Real'
  1024. 62>H:\sinbad-ogre-dc4874552a2b\Samples\CelShading\include\CelShading.h(91): warning C4305: 'argument' : truncation from 'double' to 'const Ogre::Real'
  1025. 63>h:\sinbad-ogre-dc4874552a2b\samples\character\include\SinbadCharacterController.h(189): warning C4305: 'argument' : truncation from 'double' to 'Ogre::Real'
  1026. 63>h:\sinbad-ogre-dc4874552a2b\samples\character\include\SinbadCharacterController.h(242): warning C4305: 'argument' : truncation from 'double' to 'Ogre::Real'
  1027. 63>H:\sinbad-ogre-dc4874552a2b\Samples\Character\include\CharacterSample.h(96): warning C4305: 'argument' : truncation from 'double' to 'float'
  1028. 65>H:\sinbad-ogre-dc4874552a2b\Samples\CubeMapping\include\CubeMapping.h(63): warning C4305: 'argument' : truncation from 'double' to 'float'
  1029. 64>H:\sinbad-ogre-dc4874552a2b\Samples\Compositor\include\Compositor.h(385): warning C4305: 'argument' : truncation from 'double' to 'float' (H:\sinbad-ogre-dc4874552a2b\Samples\Compositor\src\Compositor.cpp)
  1030. 64>H:\sinbad-ogre-dc4874552a2b\Samples\Compositor\include\Compositor.h(392): warning C4305: 'argument' : truncation from 'double' to 'Ogre::Real' (H:\sinbad-ogre-dc4874552a2b\Samples\Compositor\src\Compositor.cpp)
  1031. 67>H:\sinbad-ogre-dc4874552a2b\Samples\Dot3Bump\include\Dot3Bump.h(251): warning C4305: 'argument' : truncation from 'double' to 'Ogre::Real'
  1032. 66>H:\sinbad-ogre-dc4874552a2b\Samples\DeferredShading\include\DeferredShadingDemo.h(183): warning C4305: 'argument' : truncation from 'double' to 'const Ogre::Real'
  1033. 66>H:\sinbad-ogre-dc4874552a2b\Samples\DeferredShading\include\DeferredShadingDemo.h(204): warning C4305: 'argument' : truncation from 'double' to 'Ogre::Real'
  1034. 66>H:\sinbad-ogre-dc4874552a2b\Samples\DeferredShading\include\DeferredShadingDemo.h(214): warning C4305: 'argument' : truncation from 'double' to 'const Ogre::Real'
  1035. 66>H:\sinbad-ogre-dc4874552a2b\Samples\DeferredShading\include\DeferredShadingDemo.h(234): warning C4305: 'argument' : truncation from 'double' to 'const Ogre::Real'
  1036. 66>H:\sinbad-ogre-dc4874552a2b\Samples\DeferredShading\include\DeferredShadingDemo.h(243): warning C4305: 'argument' : truncation from 'double' to 'Ogre::Real'
  1037. 66>H:\sinbad-ogre-dc4874552a2b\Samples\DeferredShading\include\DeferredShadingDemo.h(273): warning C4305: 'argument' : truncation from 'double' to 'float'
  1038. 66>H:\sinbad-ogre-dc4874552a2b\Samples\DeferredShading\include\DeferredShadingDemo.h(280): warning C4305: 'argument' : truncation from 'double' to 'Ogre::Real'
  1039. 66>H:\sinbad-ogre-dc4874552a2b\Samples\DeferredShading\src/DLight.cpp(70): warning C4305: '*=' : truncation from 'double' to 'float'
  1040. 62>  Sample_CelShading.vcxproj -> H:\ogre\lib\Debug\Sample_CelShading_d.lib
  1041. 55>  Sample_VolumeCSG.vcxproj -> H:\ogre\lib\Debug\Sample_VolumeCSG_d.lib
  1042. 65>  Sample_CubeMapping.vcxproj -> H:\ogre\lib\Debug\Sample_CubeMapping_d.lib
  1043. 63>  Sample_Character.vcxproj -> H:\ogre\lib\Debug\Sample_Character_d.lib
  1044. 64>  Sample_Compositor.vcxproj -> H:\ogre\lib\Debug\Sample_Compositor_d.lib
  1045. 67>  Sample_Dot3Bump.vcxproj -> H:\ogre\lib\Debug\Sample_Dot3Bump_d.lib
  1046. 66>  Sample_DeferredShading.vcxproj -> H:\ogre\lib\Debug\Sample_DeferredShading_d.lib
  1047. 68>------ Rebuild All started: Project: SampleBrowserWP8, Configuration: Debug Win32 ------
  1048. 68>  FileSystemLayerImpl_WIN32.cpp
  1049. 68>  SampleBrowserWinRT.cpp
  1050. 68>h:\sinbad-ogre-dc4874552a2b\samples\dualquaternion\include\dualquaternion.h(32): warning C4305: 'argument' : truncation from 'double' to 'const Ogre::Real' (SampleBrowserWinRT.cpp)
  1051. 68>h:\sinbad-ogre-dc4874552a2b\samples\dualquaternion\include\dualquaternion.h(69): warning C4305: 'argument' : truncation from 'double' to 'float' (SampleBrowserWinRT.cpp)
  1052. 68>h:\sinbad-ogre-dc4874552a2b\samples\dualquaternion\include\dualquaternion.h(73): warning C4305: 'argument' : truncation from 'double' to 'float' (SampleBrowserWinRT.cpp)
  1053. 68>h:\sinbad-ogre-dc4874552a2b\samples\dualquaternion\include\dualquaternion.h(121): warning C4305: 'argument' : truncation from 'double' to 'const Ogre::Real' (SampleBrowserWinRT.cpp)
  1054. 68>h:\sinbad-ogre-dc4874552a2b\samples\dualquaternion\include\dualquaternion.h(131): warning C4305: 'argument' : truncation from 'double' to 'const Ogre::Real' (SampleBrowserWinRT.cpp)
  1055. 68>h:\sinbad-ogre-dc4874552a2b\samples\deferredshading\include\deferredshadingdemo.h(183): warning C4305: 'argument' : truncation from 'double' to 'const Ogre::Real' (SampleBrowserWinRT.cpp)
  1056. 68>h:\sinbad-ogre-dc4874552a2b\samples\deferredshading\include\deferredshadingdemo.h(204): warning C4305: 'argument' : truncation from 'double' to 'Ogre::Real' (SampleBrowserWinRT.cpp)
  1057. 68>h:\sinbad-ogre-dc4874552a2b\samples\deferredshading\include\deferredshadingdemo.h(214): warning C4305: 'argument' : truncation from 'double' to 'const Ogre::Real' (SampleBrowserWinRT.cpp)
  1058. 68>h:\sinbad-ogre-dc4874552a2b\samples\deferredshading\include\deferredshadingdemo.h(234): warning C4305: 'argument' : truncation from 'double' to 'const Ogre::Real' (SampleBrowserWinRT.cpp)
  1059. 68>h:\sinbad-ogre-dc4874552a2b\samples\deferredshading\include\deferredshadingdemo.h(243): warning C4305: 'argument' : truncation from 'double' to 'Ogre::Real' (SampleBrowserWinRT.cpp)
  1060. 68>h:\sinbad-ogre-dc4874552a2b\samples\deferredshading\include\deferredshadingdemo.h(273): warning C4305: 'argument' : truncation from 'double' to 'float' (SampleBrowserWinRT.cpp)
  1061. 68>h:\sinbad-ogre-dc4874552a2b\samples\deferredshading\include\deferredshadingdemo.h(280): warning C4305: 'argument' : truncation from 'double' to 'Ogre::Real' (SampleBrowserWinRT.cpp)
  1062. 68>h:\sinbad-ogre-dc4874552a2b\samples\instancing\include\instancing.h(379): warning C4305: 'argument' : truncation from 'double' to 'float' (SampleBrowserWinRT.cpp)
  1063. 68>h:\sinbad-ogre-dc4874552a2b\samples\ssao\include\ssao.h(435): warning C4305: 'argument' : truncation from 'double' to 'Ogre::Real' (SampleBrowserWinRT.cpp)
  1064. 68>h:\sinbad-ogre-dc4874552a2b\samples\oceandemo\include\oceandemo.h(111): warning C4305: 'argument' : truncation from 'double' to 'float' (SampleBrowserWinRT.cpp)
  1065. 68>h:\sinbad-ogre-dc4874552a2b\samples\oceandemo\include\oceandemo.h(199): warning C4305: 'argument' : truncation from 'double' to 'float' (SampleBrowserWinRT.cpp)
  1066. 68>h:\sinbad-ogre-dc4874552a2b\samples\celshading\include\celshading.h(76): warning C4305: 'argument' : truncation from 'double' to 'const Ogre::Real' (SampleBrowserWinRT.cpp)
  1067. 68>h:\sinbad-ogre-dc4874552a2b\samples\celshading\include\celshading.h(77): warning C4305: 'argument' : truncation from 'double' to 'const Ogre::Real' (SampleBrowserWinRT.cpp)
  1068. 68>h:\sinbad-ogre-dc4874552a2b\samples\celshading\include\celshading.h(82): warning C4305: 'argument' : truncation from 'double' to 'const Ogre::Real' (SampleBrowserWinRT.cpp)
  1069. 68>h:\sinbad-ogre-dc4874552a2b\samples\celshading\include\celshading.h(87): warning C4305: 'argument' : truncation from 'double' to 'const Ogre::Real' (SampleBrowserWinRT.cpp)
  1070. 68>h:\sinbad-ogre-dc4874552a2b\samples\celshading\include\celshading.h(91): warning C4305: 'argument' : truncation from 'double' to 'const Ogre::Real' (SampleBrowserWinRT.cpp)
  1071. 68>h:\sinbad-ogre-dc4874552a2b\samples\compositor\include\compositor.h(385): warning C4305: 'argument' : truncation from 'double' to 'float' (SampleBrowserWinRT.cpp)
  1072. 68>h:\sinbad-ogre-dc4874552a2b\samples\compositor\include\compositor.h(392): warning C4305: 'argument' : truncation from 'double' to 'Ogre::Real' (SampleBrowserWinRT.cpp)
  1073. 68>h:\sinbad-ogre-dc4874552a2b\samples\cubemapping\include\cubemapping.h(63): warning C4305: 'argument' : truncation from 'double' to 'float' (SampleBrowserWinRT.cpp)
  1074. 68>h:\sinbad-ogre-dc4874552a2b\samples\dot3bump\include\dot3bump.h(251): warning C4305: 'argument' : truncation from 'double' to 'Ogre::Real' (SampleBrowserWinRT.cpp)
  1075. 68>h:\sinbad-ogre-dc4874552a2b\samples\fresnel\include\fresnel.h(170): warning C4305: 'argument' : truncation from 'double' to 'Ogre::Real' (SampleBrowserWinRT.cpp)
  1076. 68>h:\sinbad-ogre-dc4874552a2b\samples\fresnel\include\fresnel.h(184): warning C4305: 'argument' : truncation from 'double' to 'Ogre::Real' (SampleBrowserWinRT.cpp)
  1077. 68>h:\sinbad-ogre-dc4874552a2b\samples\water\include\water.h(389): warning C4305: 'argument' : truncation from 'double' to 'Ogre::Real' (SampleBrowserWinRT.cpp)
  1078. 68>h:\sinbad-ogre-dc4874552a2b\samples\water\include\water.h(390): warning C4305: 'argument' : truncation from 'double' to 'Ogre::Real' (SampleBrowserWinRT.cpp)
  1079. 68>h:\sinbad-ogre-dc4874552a2b\samples\water\include\water.h(391): warning C4305: 'argument' : truncation from 'double' to 'Ogre::Real' (SampleBrowserWinRT.cpp)
  1080. 68>h:\sinbad-ogre-dc4874552a2b\samples\water\include\water.h(392): warning C4305: 'argument' : truncation from 'double' to 'Ogre::Real' (SampleBrowserWinRT.cpp)
  1081. 68>h:\sinbad-ogre-dc4874552a2b\samples\cameratrack\include\cameratrack.h(33): warning C4305: 'argument' : truncation from 'double' to 'float' (SampleBrowserWinRT.cpp)
  1082. 68>h:\sinbad-ogre-dc4874552a2b\samples\character\include\sinbadcharactercontroller.h(189): warning C4305: 'argument' : truncation from 'double' to 'Ogre::Real' (SampleBrowserWinRT.cpp)
  1083. 68>h:\sinbad-ogre-dc4874552a2b\samples\character\include\sinbadcharactercontroller.h(242): warning C4305: 'argument' : truncation from 'double' to 'Ogre::Real' (SampleBrowserWinRT.cpp)
  1084. 68>h:\sinbad-ogre-dc4874552a2b\samples\character\include\charactersample.h(96): warning C4305: 'argument' : truncation from 'double' to 'float' (SampleBrowserWinRT.cpp)
  1085. 68>h:\sinbad-ogre-dc4874552a2b\samples\dyntex\include\dyntex.h(43): warning C4305: '-=' : truncation from 'double' to 'Ogre::Real' (SampleBrowserWinRT.cpp)
  1086. 68>h:\sinbad-ogre-dc4874552a2b\samples\grass\include\grass.h(126): warning C4305: 'argument' : truncation from 'double' to 'Ogre::Real' (SampleBrowserWinRT.cpp)
  1087. 68>h:\sinbad-ogre-dc4874552a2b\samples\grass\include\grass.h(231): warning C4305: 'argument' : truncation from 'double' to 'float' (SampleBrowserWinRT.cpp)
  1088. 68>h:\sinbad-ogre-dc4874552a2b\samples\grass\include\grass.h(236): warning C4305: 'argument' : truncation from 'double' to 'Ogre::Real' (SampleBrowserWinRT.cpp)
  1089. 68>h:\sinbad-ogre-dc4874552a2b\samples\grass\include\grass.h(237): warning C4305: 'argument' : truncation from 'double' to 'Ogre::Real' (SampleBrowserWinRT.cpp)
  1090. 68>h:\sinbad-ogre-dc4874552a2b\samples\lighting\include\lighting.h(108): warning C4305: 'argument' : truncation from 'double' to 'float' (SampleBrowserWinRT.cpp)
  1091. 68>h:\sinbad-ogre-dc4874552a2b\samples\lighting\include\lighting.h(184): warning C4305: 'argument' : truncation from 'double' to 'Ogre::Real' (SampleBrowserWinRT.cpp)
  1092. 68>h:\sinbad-ogre-dc4874552a2b\samples\lighting\include\lighting.h(243): warning C4305: 'argument' : truncation from 'double' to 'Ogre::Real' (SampleBrowserWinRT.cpp)
  1093. 68>h:\sinbad-ogre-dc4874552a2b\samples\particlefx\include\particlefx.h(40): warning C4305: 'argument' : truncation from 'double' to 'float' (SampleBrowserWinRT.cpp)
  1094. 68>h:\sinbad-ogre-dc4874552a2b\samples\shadows\include\shadows.h(160): warning C4305: 'argument' : truncation from 'double' to 'float' (SampleBrowserWinRT.cpp)
  1095. 68>h:\sinbad-ogre-dc4874552a2b\samples\shadows\include\shadows.h(235): warning C4305: 'argument' : truncation from 'double' to 'Ogre::Real' (SampleBrowserWinRT.cpp)
  1096. 68>h:\sinbad-ogre-dc4874552a2b\samples\shadows\include\shadows.h(236): warning C4305: 'argument' : truncation from 'double' to 'Ogre::Real' (SampleBrowserWinRT.cpp)
  1097. 68>h:\sinbad-ogre-dc4874552a2b\samples\shadows\include\shadows.h(242): warning C4305: 'argument' : truncation from 'double' to 'Ogre::Real' (SampleBrowserWinRT.cpp)
  1098. 68>h:\sinbad-ogre-dc4874552a2b\samples\shadows\include\shadows.h(432): warning C4305: 'argument' : truncation from 'double' to 'Ogre::Real' (SampleBrowserWinRT.cpp)
  1099. 68>h:\sinbad-ogre-dc4874552a2b\samples\shadows\include\shadows.h(446): warning C4305: 'argument' : truncation from 'double' to 'Ogre::Real' (SampleBrowserWinRT.cpp)
  1100. 68>h:\sinbad-ogre-dc4874552a2b\samples\shadows\include\shadows.h(460): warning C4305: 'argument' : truncation from 'double' to 'Ogre::Real' (SampleBrowserWinRT.cpp)
  1101. 68>h:\sinbad-ogre-dc4874552a2b\samples\shadows\include\shadows.h(514): warning C4305: 'argument' : truncation from 'double' to 'Ogre::Real' (SampleBrowserWinRT.cpp)
  1102. 68>h:\sinbad-ogre-dc4874552a2b\samples\shadows\include\shadows.h(515): warning C4305: 'argument' : truncation from 'double' to 'Ogre::Real' (SampleBrowserWinRT.cpp)
  1103. 68>h:\sinbad-ogre-dc4874552a2b\samples\shadows\include\shadows.h(518): warning C4305: 'argument' : truncation from 'double' to 'Ogre::Real' (SampleBrowserWinRT.cpp)
  1104. 68>h:\sinbad-ogre-dc4874552a2b\samples\shadows\include\shadows.h(519): warning C4305: 'argument' : truncation from 'double' to 'Ogre::Real' (SampleBrowserWinRT.cpp)
  1105. 68>h:\sinbad-ogre-dc4874552a2b\samples\shadows\include\shadows.h(523): warning C4305: 'argument' : truncation from 'double' to 'Ogre::Real' (SampleBrowserWinRT.cpp)
  1106. 68>h:\sinbad-ogre-dc4874552a2b\samples\skeletalanimation\include\skeletalanimation.h(84): warning C4305: 'argument' : truncation from 'double' to 'float' (SampleBrowserWinRT.cpp)
  1107. 68>h:\sinbad-ogre-dc4874552a2b\samples\skybox\include\skybox.h(26): warning C4305: 'argument' : truncation from 'double' to 'float' (SampleBrowserWinRT.cpp)
  1108. 68>h:\sinbad-ogre-dc4874552a2b\samples\skydome\include\skydome.h(32): warning C4305: 'argument' : truncation from 'double' to 'float' (SampleBrowserWinRT.cpp)
  1109. 68>h:\sinbad-ogre-dc4874552a2b\samples\skyplane\include\skyplane.h(26): warning C4305: 'argument' : truncation from 'double' to 'float' (SampleBrowserWinRT.cpp)
  1110. 68>h:\sinbad-ogre-dc4874552a2b\samples\smoke\include\smoke.h(37): warning C4305: 'argument' : truncation from 'double' to 'float' (SampleBrowserWinRT.cpp)
  1111. 68>h:\sinbad-ogre-dc4874552a2b\samples\spheremapping\include\spheremapping.h(33): warning C4305: 'argument' : truncation from 'double' to 'float' (SampleBrowserWinRT.cpp)
  1112. 68>LINK : fatal error LNK1104: cannot open file 'H:\assaframan-ogre-dependencies-for-windows-phone-f16159239e75\src\ois-1.2.0\dll\OIS_d.lib'
  1113. ========== Rebuild All: 66 succeeded, 2 failed, 0 skipped ==========
RAW Paste Data
We use cookies for various purposes including analytics. By continuing to use Pastebin, you agree to our use of cookies as described in the Cookies Policy. OK, I Understand
 
Top