SHARE
TWEET

Untitled

arun_kpm Oct 11th, 2018 61 Never
Not a member of Pastebin yet? Sign Up, it unlocks many cool features!
  1. ==> Starting build()...
  2. checking for a BSD-compatible install... /usr/bin/install -c
  3. checking whether build environment is sane... yes
  4. checking for a thread-safe mkdir -p... /usr/bin/mkdir -p
  5. checking for gawk... gawk
  6. checking whether make sets $(MAKE)... yes
  7. checking whether make supports nested variables... yes
  8. checking whether to enable maintainer-specific portions of Makefiles... no
  9. checking for style of include used by make... GNU
  10. checking for gcc... gcc
  11. checking whether the C compiler works... yes
  12. checking for C compiler default output file name... a.out
  13. checking for suffix of executables...
  14. checking whether we are cross compiling... no
  15. checking for suffix of object files... o
  16. checking whether we are using the GNU C compiler... yes
  17. checking whether gcc accepts -g... yes
  18. checking for gcc option to accept ISO C89... none needed
  19. checking whether gcc understands -c and -o together... yes
  20. checking dependency style of gcc... gcc3
  21. checking for library containing strerror... none required
  22. checking for gcc... (cached) gcc
  23. checking whether we are using the GNU C compiler... (cached) yes
  24. checking whether gcc accepts -g... (cached) yes
  25. checking for gcc option to accept ISO C89... (cached) none needed
  26. checking whether gcc understands -c and -o together... (cached) yes
  27. checking dependency style of gcc... (cached) gcc3
  28. checking for gcc... (cached) gcc
  29. checking whether we are using the GNU C compiler... (cached) yes
  30. checking whether gcc accepts -g... (cached) yes
  31. checking for gcc option to accept ISO C89... (cached) none needed
  32. checking whether gcc understands -c and -o together... (cached) yes
  33. checking dependency style of gcc... (cached) gcc3
  34. checking how to run the C preprocessor... gcc -E
  35. checking for grep that handles long lines and -e... /usr/bin/grep
  36. checking for egrep... /usr/bin/grep -E
  37. checking for ANSI C header files... yes
  38. checking build system type... x86_64-unknown-linux-gnu
  39. checking host system type... x86_64-unknown-linux-gnu
  40. checking how to print strings... printf
  41. checking for a sed that does not truncate output... /usr/bin/sed
  42. checking for fgrep... /usr/bin/grep -F
  43. checking for ld used by gcc... /usr/bin/ld
  44. checking if the linker (/usr/bin/ld) is GNU ld... yes
  45. checking for BSD- or MS-compatible name lister (nm)... /usr/bin/nm -B
  46. checking the name lister (/usr/bin/nm -B) interface... BSD nm
  47. checking whether ln -s works... yes
  48. checking the maximum length of command line arguments... 1572864
  49. checking whether the shell understands some XSI constructs... yes
  50. checking whether the shell understands "+="... yes
  51. checking how to convert x86_64-unknown-linux-gnu file names to x86_64-unknown-linux-gnu format... func_convert_file_noop
  52. checking how to convert x86_64-unknown-linux-gnu file names to toolchain format... func_convert_file_noop
  53. checking for /usr/bin/ld option to reload object files... -r
  54. checking for objdump... objdump
  55. checking how to recognize dependent libraries... pass_all
  56. checking for dlltool... no
  57. checking how to associate runtime and link libraries... printf %s\n
  58. checking for ar... ar
  59. checking for archiver @FILE support... @
  60. checking for strip... strip
  61. checking for ranlib... ranlib
  62. checking command to parse /usr/bin/nm -B output from gcc object... ok
  63. checking for sysroot... no
  64. checking for mt... no
  65. checking if : is a manifest tool... no
  66. checking for sys/types.h... yes
  67. checking for sys/stat.h... yes
  68. checking for stdlib.h... yes
  69. checking for string.h... yes
  70. checking for memory.h... yes
  71. checking for strings.h... yes
  72. checking for inttypes.h... yes
  73. checking for stdint.h... yes
  74. checking for unistd.h... yes
  75. checking for dlfcn.h... yes
  76. checking for objdir... .libs
  77. checking if gcc supports -fno-rtti -fno-exceptions... no
  78. checking for gcc option to produce PIC... -fPIC -DPIC
  79. checking if gcc PIC flag -fPIC -DPIC works... yes
  80. checking if gcc static flag -static works... yes
  81. checking if gcc supports -c -o file.o... yes
  82. checking if gcc supports -c -o file.o... (cached) yes
  83. checking whether the gcc linker (/usr/bin/ld -m elf_x86_64) supports shared libraries... yes
  84. checking whether -lc should be explicitly linked in... no
  85. checking dynamic linker characteristics... GNU/Linux ld.so
  86. checking how to hardcode library paths into programs... immediate
  87. checking whether stripping libraries is possible... yes
  88. checking if libtool supports shared libraries... yes
  89. checking whether to build shared libraries... yes
  90. checking whether to build static libraries... no
  91. checking whether make sets $(MAKE)... (cached) yes
  92. checking whether ln -s works... yes
  93. checking for special C compiler options needed for large files... no
  94. checking for _FILE_OFFSET_BITS value needed for large files... no
  95. checking whether make supports nested variables... (cached) yes
  96. checking for xsltproc... /usr/bin/xsltproc
  97. checking for pkg-config... /usr/bin/pkg-config
  98. checking pkg-config is at least version 0.9.0... yes
  99. checking for gtk-doc... yes
  100. checking for gtkdoc-check... gtkdoc-check.test
  101. checking for gtkdoc-check... /usr/bin/gtkdoc-check
  102. checking for gtkdoc-rebase... /usr/bin/gtkdoc-rebase
  103. checking for gtkdoc-mkpdf... /usr/bin/gtkdoc-mkpdf
  104. checking whether to build gtk-doc documentation... no
  105. checking for GTKDOC_DEPS... yes
  106. checking for sg_ll_inquiry in -lsgutils2... yes
  107. checking for GUDEV... yes
  108. checking for GLIB... yes
  109. checking for GIO... yes
  110. checking for DBUS... yes
  111. checking for DBUS_GLIB... yes
  112. checking for POLKIT_GOBJECT_1... yes
  113. checking for LIBPARTED... yes
  114. checking for DEVMAPPER... yes
  115. checking for LIBATASMART... yes
  116. checking for LIBUDEV... yes
  117. checking whether NLS is requested... yes
  118. checking for intltool >= 0.36.0... 0.51.0 found
  119. checking for intltool-update... /usr/bin/intltool-update
  120. checking for intltool-merge... /usr/bin/intltool-merge
  121. checking for intltool-extract... /usr/bin/intltool-extract
  122. checking for xgettext... /usr/bin/xgettext
  123. checking for msgmerge... /usr/bin/msgmerge
  124. checking for msgfmt... /usr/bin/msgfmt
  125. checking for gmsgfmt... /usr/bin/msgfmt
  126. checking for perl... /usr/bin/perl
  127. checking for perl >= 5.8.1... 5.28.0
  128. checking for XML::Parser... ok
  129. checking locale.h usability... yes
  130. checking locale.h presence... yes
  131. checking for locale.h... yes
  132. checking for LC_MESSAGES... yes
  133. checking libintl.h usability... yes
  134. checking libintl.h presence... yes
  135. checking for libintl.h... yes
  136. checking for ngettext in libc... yes
  137. checking for dgettext in libc... yes
  138. checking for bind_textdomain_codeset... yes
  139. checking for msgfmt... (cached) /usr/bin/msgfmt
  140. checking for dcgettext... yes
  141. checking if msgfmt accepts -c... yes
  142. checking for gmsgfmt... (cached) /usr/bin/msgfmt
  143. checking for xgettext... (cached) /usr/bin/xgettext
  144. checking that generated files are newer than configure... done
  145. configure: creating ./config.status
  146. config.status: creating Makefile
  147. config.status: creating data/Makefile
  148. config.status: creating data/udisks.pc
  149. config.status: creating src/Makefile
  150. config.status: creating src/helpers/Makefile
  151. config.status: creating src/probers/Makefile
  152. config.status: creating tools/Makefile
  153. config.status: creating doc/Makefile
  154. config.status: creating doc/version.xml
  155. config.status: creating doc/man/Makefile
  156. config.status: creating doc/dbus/Makefile
  157. config.status: creating policy/Makefile
  158. config.status: creating po/Makefile.in
  159. config.status: creating tests/Makefile
  160. config.status: creating config.h
  161. config.status: executing depfiles commands
  162. config.status: executing libtool commands
  163. config.status: executing default-1 commands
  164. config.status: executing po/stamp-it commands
  165.  
  166.                udisks 1.0.5
  167.              ================
  168.  
  169.         prefix:                     /usr
  170.         libdir:                     ${exec_prefix}/lib
  171.         libexecdir:                 /usr/lib/udisks
  172.         bindir:                     ${exec_prefix}/bin
  173.         sbindir:                    ${exec_prefix}/sbin
  174.         datadir:                    ${datarootdir}
  175.         sysconfdir:                 /etc
  176.         localstatedir:              /var
  177.         docdir:                     ${datarootdir}/doc/${PACKAGE_TARNAME}
  178.         slashlibdir:                /lib
  179.         slashsbindir:               /sbin
  180.         systemdsystemunitdir:       /usr/lib/systemd/system
  181.  
  182.         compiler:                   gcc
  183.         cflags:                     -march=x86-64 -mtune=generic -O2 -pipe -fstack-protector-strong -fno-plt -Wall -Wchar-subscripts -Wmissing-declarations -Wnested-externs -Wpointer-arith -Wcast-align -Wsign-compare -Wformat -Wformat-security
  184.         cppflags:                   -D_FORTIFY_SOURCE=2
  185.         xsltproc:                   /usr/bin/xsltproc
  186.  
  187.         LVM2 support:               no
  188.         dm-multipath:               no
  189.         Remote Access:              yes
  190.  
  191.         Maintainer mode:            no
  192.         Profiling:                  no
  193.         Building api docs:          no
  194.         Building man pages:         yes
  195.  
  196. patching file data/80-udisks.rules
  197. make  all-recursive
  198. make[1]: Entering directory '/home/arun/.cache/yay/udisks/src/udisks-1.0.5'
  199. Making all in data
  200. make[2]: Entering directory '/home/arun/.cache/yay/udisks/src/udisks-1.0.5/data'
  201. cp org.freedesktop.UDisks.conf.in org.freedesktop.UDisks.conf
  202. make[2]: Leaving directory '/home/arun/.cache/yay/udisks/src/udisks-1.0.5/data'
  203. Making all in src
  204. make[2]: Entering directory '/home/arun/.cache/yay/udisks/src/udisks-1.0.5/src'
  205. dbus-binding-tool --prefix=daemon --mode=glib-server --output=daemon-glue.h ../data/org.freedesktop.UDisks.xml
  206. dbus-binding-tool --prefix=device --mode=glib-server --output=device-glue.h ../data/org.freedesktop.UDisks.Device.xml
  207. dbus-binding-tool --prefix=adapter --mode=glib-server --output=adapter-glue.h ../data/org.freedesktop.UDisks.Adapter.xml
  208. WARNING: Using --header and --body at the same time is deprecated; use --body --prototypes instead
  209. INFO: Reading /tmp/dbus-binding-tool-c-marshallers.MZOMQZ...
  210. WARNING: The token "NONE" is deprecated; use "VOID" instead
  211. WARNING: The token "NONE" is deprecated; use "VOID" instead
  212. WARNING: The token "NONE" is deprecated; use "VOID" instead
  213. WARNING: The token "NONE" is deprecated; use "VOID" instead
  214. WARNING: The token "NONE" is deprecated; use "VOID" instead
  215. WARNING: The token "NONE" is deprecated; use "VOID" instead
  216. WARNING: The token "NONE" is deprecated; use "VOID" instead
  217. WARNING: The token "NONE" is deprecated; use "VOID" instead
  218. WARNING: The token "NONE" is deprecated; use "VOID" instead
  219. WARNING: The token "NONE" is deprecated; use "VOID" instead
  220. WARNING: The token "NONE" is deprecated; use "VOID" instead
  221. WARNING: The token "NONE" is deprecated; use "VOID" instead
  222. WARNING: The token "NONE" is deprecated; use "VOID" instead
  223. dbus-binding-tool --prefix=port --mode=glib-server --output=port-glue.h ../data/org.freedesktop.UDisks.Port.xml
  224. WARNING: Using --header and --body at the same time is deprecated; use --body --prototypes instead
  225. INFO: Reading /tmp/dbus-binding-tool-c-marshallers.6ARMQZ...
  226. WARNING: Using --header and --body at the same time is deprecated; use --body --prototypes instead
  227. INFO: Reading /tmp/dbus-binding-tool-c-marshallers.PONMQZ...
  228. WARNING: The token "NONE" is deprecated; use "VOID" instead
  229. WARNING: The token "NONE" is deprecated; use "VOID" instead
  230. WARNING: The token "NONE" is deprecated; use "VOID" instead
  231. WARNING: The token "NONE" is deprecated; use "VOID" instead
  232. WARNING: The token "NONE" is deprecated; use "VOID" instead
  233. WARNING: The token "NONE" is deprecated; use "VOID" instead
  234. WARNING: The token "NONE" is deprecated; use "VOID" instead
  235. WARNING: The token "NONE" is deprecated; use "VOID" instead
  236. WARNING: The token "NONE" is deprecated; use "VOID" instead
  237. WARNING: The token "NONE" is deprecated; use "VOID" instead
  238. dbus-binding-tool --prefix=expander --mode=glib-server --output=expander-glue.h ../data/org.freedesktop.UDisks.Expander.xml
  239. WARNING: Using --header and --body at the same time is deprecated; use --body --prototypes instead
  240. INFO: Reading /tmp/dbus-binding-tool-c-marshallers.JENIQZ...
  241. WARNING: Using --header and --body at the same time is deprecated; use --body --prototypes instead
  242. INFO: Reading /tmp/dbus-binding-tool-c-marshallers.G7FJQZ...
  243. make  all-recursive
  244. make[3]: Entering directory '/home/arun/.cache/yay/udisks/src/udisks-1.0.5/src'
  245. Making all in helpers
  246. make[4]: Entering directory '/home/arun/.cache/yay/udisks/src/udisks-1.0.5/src/helpers'
  247.   CC       udisks_helper_mkfs-job-mkfs.o
  248.   CC       libpartutil_la-partutil.lo
  249.   CC       udisks_helper_delete_partition-job-delete-partition.o
  250.   CC       udisks_helper_create_partition-job-create-partition.o
  251.   CC       udisks_helper_modify_partition-job-modify-partition.o
  252.   CC       udisks_helper_create_partition_table-job-create-partition-table.o
  253.   CC       udisks_helper_change_filesystem_label-job-change-filesystem-label.o
  254.   CC       udisks_helper_linux_md_remove_component-job-linux-md-remove-component.o
  255.   CC       udisks_helper_fstab_mounter-job-fstab-mounter.o
  256.   CC       udisks_helper_ata_smart_collect-job-ata-smart-collect.o
  257.   CC       udisks_helper_ata_smart_selftest-job-ata-smart-selftest.o
  258. partutil.c: In function 'part_table_parse_msdos_extended':
  259. partutil.c:476:21: warning: passing argument 2 of 'read' discards 'const' qualifier from pointer target type [-Wdiscarded-array-qualifiers]
  260.        if (read (fd, &embr, sizeof(embr)) != sizeof(embr))
  261.                      ^~~~~
  262. In file included from /usr/include/unistd.h:1166,
  263.                  from partutil.c:30:
  264. /usr/include/bits/unistd.h:34:23: note: expected 'void *' but argument is of type 'const guint8 (*)[512]' {aka 'const unsigned char (*)[512]'}
  265.  read (int __fd, void *__buf, size_t __nbytes)
  266.                  ~~~~~~^~~~~
  267. partutil.c: In function 'part_table_parse_msdos':
  268. partutil.c:571:17: warning: passing argument 2 of 'read' discards 'const' qualifier from pointer target type [-Wdiscarded-array-qualifiers]
  269.    if (read (fd, &mbr, sizeof(mbr)) != sizeof(mbr))
  270.                  ^~~~
  271. In file included from /usr/include/unistd.h:1166,
  272.                  from partutil.c:30:
  273. /usr/include/bits/unistd.h:34:23: note: expected 'void *' but argument is of type 'const guint8 (*)[512]' {aka 'const unsigned char (*)[512]'}
  274.  read (int __fd, void *__buf, size_t __nbytes)
  275.                  ~~~~~~^~~~~
  276.   CC       udisks_helper_drive_detach-job-drive-detach.o
  277.   CC       udisks_helper_linux_md_check-job-linux-md-check.o
  278.   CC       udisks_helper_drive_poll-job-drive-poll.o
  279.   CC       udisks_helper_drive_benchmark-job-drive-benchmark.o
  280.   CCLD     libpartutil.la
  281.   CCLD     udisks-helper-mkfs
  282.   CCLD     udisks-helper-change-filesystem-label
  283. ar: `u' modifier ignored since `D' is the default (see `U')
  284.   CCLD     udisks-helper-linux-md-remove-component
  285.   CCLD     udisks-helper-fstab-mounter
  286.   CCLD     udisks-helper-ata-smart-collect
  287.   CCLD     udisks-helper-ata-smart-selftest
  288.   CCLD     udisks-helper-drive-detach
  289.   CCLD     udisks-helper-drive-poll
  290.   CCLD     udisks-helper-linux-md-check
  291.   CCLD     udisks-helper-drive-benchmark
  292.   CCLD     udisks-helper-delete-partition
  293.   CCLD     udisks-helper-create-partition
  294.   CCLD     udisks-helper-modify-partition
  295.   CCLD     udisks-helper-create-partition-table
  296. make[4]: Leaving directory '/home/arun/.cache/yay/udisks/src/udisks-1.0.5/src/helpers'
  297. Making all in probers
  298. make[4]: Entering directory '/home/arun/.cache/yay/udisks/src/udisks-1.0.5/src/probers'
  299.   CC       udisks_part_id-part-id.o
  300.   CC       udisks_dm_export-udisks-dm-export.o
  301.   CC       udisks_probe_ata_smart-udisks-probe-ata-smart.o
  302.   CC       udisks_probe_sas_expander-udisks-probe-sas-expander.o
  303.   CCLD     udisks-part-id
  304.   CCLD     udisks-probe-ata-smart
  305.   CCLD     udisks-dm-export
  306.   CCLD     udisks-probe-sas-expander
  307. make[4]: Leaving directory '/home/arun/.cache/yay/udisks/src/udisks-1.0.5/src/probers'
  308. make[4]: Entering directory '/home/arun/.cache/yay/udisks/src/udisks-1.0.5/src'
  309.   CC       udisks_daemon-daemon.o
  310.   CC       udisks_daemon-device.o
  311.   CC       udisks_daemon-device-private.o
  312. daemon.c: In function ‘get_property’:
  313. daemon.c:525:7: warning: ‘g_value_array_free’ is deprecated: Use 'GArray' instead [-Wdeprecated-declarations]
  314.        g_ptr_array_foreach (filesystems, (GFunc) g_value_array_free, NULL);
  315.        ^~~~~~~~~~~~~~~~~~~
  316. In file included from /usr/include/glib-2.0/glib-object.h:35,
  317.                  from daemon.c:54:
  318. /usr/include/glib-2.0/gobject/gvaluearray.h:70:7: note: declared here
  319.  void  g_value_array_free      (GValueArray *value_array);
  320.        ^~~~~~~~~~~~~~~~~~
  321. daemon.c: In function ‘daemon_class_init’:
  322. daemon.c:546:3: warning: ‘g_type_class_add_private’ is deprecated [-Wdeprecated-declarations]
  323.    g_type_class_add_private (klass, sizeof(DaemonPrivate));
  324.    ^~~~~~~~~~~~~~~~~~~~~~~~
  325. In file included from /usr/include/glib-2.0/gobject/gobject.h:24,
  326.                  from /usr/include/glib-2.0/gobject/gbinding.h:29,
  327.                  from /usr/include/glib-2.0/glib-object.h:23,
  328.                  from daemon.c:54:
  329. /usr/include/glib-2.0/gobject/gtype.h:1303:10: note: declared here
  330.  void     g_type_class_add_private       (gpointer                    g_class,
  331.           ^~~~~~~~~~~~~~~~~~~~~~~~
  332. daemon.c: In function ‘daemon_find_device_by_major_minor’:
  333. daemon.c:2717:9: warning: implicit declaration of function ‘makedev’ [-Wimplicit-function-declaration]
  334.    dev = makedev (major, minor);
  335.          ^~~~~~~
  336. daemon.c:2717:9: warning: nested extern declaration of ‘makedev’ [-Wnested-externs]
  337.   CC       udisks_daemon-adapter.o
  338. device.c: In function ‘get_property’:
  339. device.c:377:33: warning: implicit declaration of function ‘major’ [-Wimplicit-function-declaration]
  340.        g_value_set_int64 (value, major (device->priv->dev));
  341.                                  ^~~~~
  342. device.c:377:33: warning: nested extern declaration of ‘major’ [-Wnested-externs]
  343. device.c:380:33: warning: implicit declaration of function ‘minor’; did you mean ‘mknod’? [-Wimplicit-function-declaration]
  344.        g_value_set_int64 (value, minor (device->priv->dev));
  345.                                  ^~~~~
  346.                                  mknod
  347. device.c:380:33: warning: nested extern declaration of ‘minor’ [-Wnested-externs]
  348. device.c: In function ‘device_class_init’:
  349. device.c:837:3: warning: ‘g_type_class_add_private’ is deprecated [-Wdeprecated-declarations]
  350.    g_type_class_add_private (klass, sizeof(DevicePrivate));
  351.    ^~~~~~~~~~~~~~~~~~~~~~~~
  352. In file included from /usr/include/glib-2.0/gobject/gobject.h:24,
  353.                  from /usr/include/glib-2.0/gobject/gbinding.h:29,
  354.                  from /usr/include/glib-2.0/glib-object.h:23,
  355.                  from device.c:48:
  356. /usr/include/glib-2.0/gobject/gtype.h:1303:10: note: declared here
  357.  void     g_type_class_add_private       (gpointer                    g_class,
  358.           ^~~~~~~~~~~~~~~~~~~~~~~~
  359. device.c: In function ‘update_info’:
  360. device.c:4452:23: warning: implicit declaration of function ‘makedev’ [-Wimplicit-function-declaration]
  361.    device->priv->dev = makedev (major, minor);
  362.                        ^~~~~~~
  363. device.c:4452:23: warning: nested extern declaration of ‘makedev’ [-Wnested-externs]
  364. device.c: In function ‘filesystem_list_open_files_completed_cb’:
  365. device.c:6972:7: warning: ‘g_value_array_free’ is deprecated: Use 'GArray' instead [-Wdeprecated-declarations]
  366.        g_ptr_array_foreach (processes, (GFunc) g_value_array_free, NULL);
  367.        ^~~~~~~~~~~~~~~~~~~
  368. In file included from /usr/include/glib-2.0/glib-object.h:35,
  369.                  from device.c:48:
  370. /usr/include/glib-2.0/gobject/gvaluearray.h:70:7: note: declared here
  371.  void  g_value_array_free      (GValueArray *value_array);
  372.        ^~~~~~~~~~~~~~~~~~
  373. device.c: In function ‘drive_benchmark_completed_cb’:
  374. device.c:12361:7: warning: ‘g_value_array_free’ is deprecated: Use 'GArray' instead [-Wdeprecated-declarations]
  375.        read_transfer_rate_array = g_ptr_array_new_with_free_func ((GDestroyNotify) g_value_array_free);
  376.        ^~~~~~~~~~~~~~~~~~~~~~~~
  377. In file included from /usr/include/glib-2.0/glib-object.h:35,
  378.                  from device.c:48:
  379. /usr/include/glib-2.0/gobject/gvaluearray.h:70:7: note: declared here
  380.  void  g_value_array_free      (GValueArray *value_array);
  381.        ^~~~~~~~~~~~~~~~~~
  382. device.c:12362:7: warning: ‘g_value_array_free’ is deprecated: Use 'GArray' instead [-Wdeprecated-declarations]
  383.        write_transfer_rate_array = g_ptr_array_new_with_free_func ((GDestroyNotify) g_value_array_free);
  384.        ^~~~~~~~~~~~~~~~~~~~~~~~~
  385. In file included from /usr/include/glib-2.0/glib-object.h:35,
  386.                  from device.c:48:
  387. /usr/include/glib-2.0/gobject/gvaluearray.h:70:7: note: declared here
  388.  void  g_value_array_free      (GValueArray *value_array);
  389.        ^~~~~~~~~~~~~~~~~~
  390. device.c:12363:7: warning: ‘g_value_array_free’ is deprecated: Use 'GArray' instead [-Wdeprecated-declarations]
  391.        access_time_array = g_ptr_array_new_with_free_func ((GDestroyNotify) g_value_array_free);
  392.        ^~~~~~~~~~~~~~~~~
  393. In file included from /usr/include/glib-2.0/glib-object.h:35,
  394.                  from device.c:48:
  395. /usr/include/glib-2.0/gobject/gvaluearray.h:70:7: note: declared here
  396.  void  g_value_array_free      (GValueArray *value_array);
  397.        ^~~~~~~~~~~~~~~~~~
  398.   CC       udisks_daemon-adapter-private.o
  399.   CC       udisks_daemon-expander.o
  400. adapter.c: In function ‘adapter_class_init’:
  401. adapter.c:124:3: warning: ‘g_type_class_add_private’ is deprecated [-Wdeprecated-declarations]
  402.    g_type_class_add_private (klass, sizeof(AdapterPrivate));
  403.    ^~~~~~~~~~~~~~~~~~~~~~~~
  404. In file included from /usr/include/glib-2.0/gobject/gobject.h:24,
  405.                  from /usr/include/glib-2.0/gobject/gbinding.h:29,
  406.                  from /usr/include/glib-2.0/glib-object.h:23,
  407.                  from adapter.c:28:
  408. /usr/include/glib-2.0/gobject/gtype.h:1303:10: note: declared here
  409.  void     g_type_class_add_private       (gpointer                    g_class,
  410.           ^~~~~~~~~~~~~~~~~~~~~~~~
  411.   CC       udisks_daemon-expander-private.o
  412.   CC       udisks_daemon-port.o
  413. expander.c: In function ‘expander_class_init’:
  414. expander.c:145:3: warning: ‘g_type_class_add_private’ is deprecated [-Wdeprecated-declarations]
  415.    g_type_class_add_private (klass, sizeof(ExpanderPrivate));
  416.    ^~~~~~~~~~~~~~~~~~~~~~~~
  417. In file included from /usr/include/glib-2.0/gobject/gobject.h:24,
  418.                  from /usr/include/glib-2.0/gobject/gbinding.h:29,
  419.                  from /usr/include/glib-2.0/glib-object.h:23,
  420.                  from expander.c:32:
  421. /usr/include/glib-2.0/gobject/gtype.h:1303:10: note: declared here
  422.  void     g_type_class_add_private       (gpointer                    g_class,
  423.           ^~~~~~~~~~~~~~~~~~~~~~~~
  424.   CC       udisks_daemon-port-private.o
  425.   CC       udisks_daemon-mount-file.o
  426. port.c: In function ‘port_class_init’:
  427. port.c:130:3: warning: ‘g_type_class_add_private’ is deprecated [-Wdeprecated-declarations]
  428.    g_type_class_add_private (klass, sizeof(PortPrivate));
  429.    ^~~~~~~~~~~~~~~~~~~~~~~~
  430. In file included from /usr/include/glib-2.0/gobject/gobject.h:24,
  431.                  from /usr/include/glib-2.0/gobject/gbinding.h:29,
  432.                  from /usr/include/glib-2.0/glib-object.h:23,
  433.                  from port.c:28:
  434. /usr/include/glib-2.0/gobject/gtype.h:1303:10: note: declared here
  435.  void     g_type_class_add_private       (gpointer                    g_class,
  436.           ^~~~~~~~~~~~~~~~~~~~~~~~
  437.   CC       udisks_daemon-mount.o
  438.   CC       udisks_daemon-mount-monitor.o
  439. mount.c: In function ‘mount_class_init’:
  440. mount.c:77:3: warning: ‘g_type_class_add_private’ is deprecated [-Wdeprecated-declarations]
  441.    g_type_class_add_private (klass, sizeof(MountPrivate));
  442.    ^~~~~~~~~~~~~~~~~~~~~~~~
  443. In file included from /usr/include/glib-2.0/gobject/gobject.h:24,
  444.                  from /usr/include/glib-2.0/gobject/gbinding.h:29,
  445.                  from /usr/include/glib-2.0/glib-object.h:23,
  446.                  from mount.c:36:
  447. /usr/include/glib-2.0/gobject/gtype.h:1303:10: note: declared here
  448.  void     g_type_class_add_private       (gpointer                    g_class,
  449.           ^~~~~~~~~~~~~~~~~~~~~~~~
  450.   CC       udisks_daemon-inhibitor.o
  451.   CC       udisks_daemon-poller.o
  452. mount-monitor.c: In function ‘mount_monitor_class_init’:
  453. mount-monitor.c:99:3: warning: ‘g_type_class_add_private’ is deprecated [-Wdeprecated-declarations]
  454.    g_type_class_add_private (klass, sizeof(MountMonitorPrivate));
  455.    ^~~~~~~~~~~~~~~~~~~~~~~~
  456. In file included from /usr/include/glib-2.0/gobject/gobject.h:24,
  457.                  from /usr/include/glib-2.0/gobject/gbinding.h:29,
  458.                  from /usr/include/glib-2.0/glib-object.h:23,
  459.                  from mount-monitor.c:36:
  460. /usr/include/glib-2.0/gobject/gtype.h:1303:10: note: declared here
  461.  void     g_type_class_add_private       (gpointer                    g_class,
  462.           ^~~~~~~~~~~~~~~~~~~~~~~~
  463. mount-monitor.c: In function ‘mount_monitor_ensure’:
  464. mount-monitor.c:407:17: warning: implicit declaration of function ‘makedev’ [-Wimplicit-function-declaration]
  465.            dev = makedev (major, minor);
  466.                  ^~~~~~~
  467. mount-monitor.c:407:17: warning: nested extern declaration of ‘makedev’ [-Wnested-externs]
  468. inhibitor.c: In function ‘inhibitor_class_init’:
  469. inhibitor.c:76:3: warning: ‘g_type_class_add_private’ is deprecated [-Wdeprecated-declarations]
  470.    g_type_class_add_private (klass, sizeof(InhibitorPrivate));
  471.    ^~~~~~~~~~~~~~~~~~~~~~~~
  472. In file included from /usr/include/glib-2.0/gobject/gobject.h:24,
  473.                  from /usr/include/glib-2.0/gobject/gbinding.h:29,
  474.                  from /usr/include/glib-2.0/glib-object.h:23,
  475.                  from /usr/include/dbus-1.0/dbus/dbus-glib.h:27,
  476.                  from /usr/include/dbus-1.0/dbus/dbus-glib-lowlevel.h:27,
  477.                  from inhibitor.c:26:
  478. /usr/include/glib-2.0/gobject/gtype.h:1303:10: note: declared here
  479.  void     g_type_class_add_private       (gpointer                    g_class,
  480.           ^~~~~~~~~~~~~~~~~~~~~~~~
  481.   CC       udisks_daemon-marshal.o
  482.   CC       udisks_daemon-main.o
  483. main.c: In function ‘main’:
  484. main.c:158:3: warning: ‘g_type_init’ is deprecated [-Wdeprecated-declarations]
  485.    g_type_init ();
  486.    ^~~~~~~~~~~
  487. In file included from /usr/include/glib-2.0/gobject/gobject.h:24,
  488.                  from /usr/include/glib-2.0/gobject/gbinding.h:29,
  489.                  from /usr/include/glib-2.0/glib-object.h:23,
  490.                  from main.c:39:
  491. /usr/include/glib-2.0/gobject/gtype.h:688:23: note: declared here
  492.  void                  g_type_init                    (void);
  493.                        ^~~~~~~~~~~
  494.   CCLD     udisks-daemon
  495. /usr/bin/ld: udisks_daemon-daemon.o: in function `daemon_find_device_by_major_minor':
  496. daemon.c:(.text+0x1576): undefined reference to `makedev'
  497. /usr/bin/ld: udisks_daemon-device.o: in function `get_property':
  498. device.c:(.text+0x71cf): undefined reference to `minor'
  499. /usr/bin/ld: device.c:(.text+0x71f6): undefined reference to `major'
  500. /usr/bin/ld: udisks_daemon-device.o: in function `update_info':
  501. device.c:(.text+0x8684): undefined reference to `makedev'
  502. /usr/bin/ld: udisks_daemon-mount-monitor.o: in function `mount_monitor_ensure':
  503. mount-monitor.c:(.text+0x430): undefined reference to `makedev'
  504. collect2: error: ld returned 1 exit status
  505. make[4]: *** [Makefile:569: udisks-daemon] Error 1
  506. make[4]: Leaving directory '/home/arun/.cache/yay/udisks/src/udisks-1.0.5/src'
  507. make[3]: *** [Makefile:852: all-recursive] Error 1
  508. make[3]: Leaving directory '/home/arun/.cache/yay/udisks/src/udisks-1.0.5/src'
  509. make[2]: *** [Makefile:483: all] Error 2
  510. make[2]: Leaving directory '/home/arun/.cache/yay/udisks/src/udisks-1.0.5/src'
  511. make[1]: *** [Makefile:663: all-recursive] Error 1
  512. make[1]: Leaving directory '/home/arun/.cache/yay/udisks/src/udisks-1.0.5'
  513. make: *** [Makefile:593: all] Error 2
  514. ==> ERROR: A failure occurred in build().
  515.     Aborting...
  516. Error making: udisks
RAW Paste Data
We use cookies for various purposes including analytics. By continuing to use Pastebin, you agree to our use of cookies as described in the Cookies Policy. OK, I Understand
 
Top