Guest User

Untitled

a guest
Feb 11th, 2016
73
Never
Not a member of Pastebin yet? Sign Up, it unlocks many cool features!
  1.  
  2. Building Solution: UnifiedDrawingTest (Debug)
  3.  
  4. Building: UnifiedDrawingTest (Debug)
  5.  
  6. Build started 11/02/2016 18:35:08.
  7. __________________________________________________
  8. Project "/Users/johnconners/Projects/UnifiedDrawingTest/UnifiedDrawingTest.csproj" (Build target(s)):
  9.  
  10. Target _DetectAppManifest:
  11. FindItemWithLogicalName Task
  12. Items:
  13. Info.plist
  14. LogicalName: Info.plist
  15. ProjectDir: /Users/johnconners/Projects/UnifiedDrawingTest
  16. ResourcePrefix: Resources
  17.  
  18. Target _DetectSdkLocations:
  19. DetectSdkLocations Task
  20. SdkVersion: <null>
  21. XamarinSdkRoot: <null>
  22.  
  23. Target _CoreCompileInterfaceDefinitions:
  24. IBTool Task
  25. AppManifest: Info.plist
  26. InterfaceDefinitions:
  27. Main.storyboard
  28. IntermediateOutputPath: obj/Debug/
  29. IsWatchApp: False
  30. IsWatch2App: False
  31. ProjectDir: /Users/johnconners/Projects/UnifiedDrawingTest
  32. ResourcePrefix: Resources
  33. SdkBinPath: /Applications/Xcode.app/Contents/Developer/usr/bin
  34. SdkPlatform: MacOSX
  35. SdkRoot: /Applications/Xcode.app/Contents/Developer/Platforms/MacOSX.platform/Developer/SDKs/MacOSX10.10.sdk
  36. SdkVersion: 10.10
  37. Tool /Applications/Xcode.app/Contents/Developer/usr/bin/ibtool execution started with arguments: --errors --warnings --notices --output-format xml1 --minimum-deployment-target 10.10 --sdk /Applications/Xcode.app/Contents/Developer/Platforms/MacOSX.platform/Developer/SDKs/MacOSX10.10.sdk --compile /Users/johnconners/Projects/UnifiedDrawingTest/obj/Debug/ibtool/Main.storyboardc /Users/johnconners/Projects/UnifiedDrawingTest/Main.storyboard
  38. BundleResources Output:
  39. obj/Debug/ibtool/Main.storyboardc/Info.plist
  40. obj/Debug/ibtool/Main.storyboardc/MainMenu.nib
  41. obj/Debug/ibtool/Main.storyboardc/NSWindowController-B8D-0N-5wS.nib
  42. obj/Debug/ibtool/Main.storyboardc/XfG-lQ-9wD-view-m2S-Jp-Qdl.nib
  43. OutputManifests Output:
  44. obj/Debug/ibtool-manifests/Main.storyboardc
  45.  
  46. Target _CoreCompileSceneKitAssets:
  47. CompileSceneKitAssets Task
  48. IntermediateOutputPath: obj/Debug/
  49. ProjectDir: /Users/johnconners/Projects/UnifiedDrawingTest
  50. ResourcePrefix: Resources
  51. SceneKitAssets:
  52. SdkDevPath: /Applications/Xcode.app/Contents/Developer
  53. SdkRoot: /Applications/Xcode.app/Contents/Developer/Platforms/MacOSX.platform/Developer/SDKs/MacOSX10.10.sdk
  54. SdkVersion: 10.10
  55.  
  56. Target _CollectColladaAssets:
  57. CollectBundleResources Task
  58. BundleResources: <null>
  59. OptimizePropertyLists: False
  60. OptimizePNGs: False
  61. ProjectDir: /Users/johnconners/Projects/UnifiedDrawingTest
  62. ResourcePrefix: Resources
  63.  
  64. Target _CoreCompileColladaAssets:
  65. No input files were specified for target _CoreCompileColladaAssets, skipping.
  66.  
  67. Target _CoreCompileTextureAtlases:
  68. TextureAtlas Task
  69. AtlasTextures: <null>
  70. IntermediateOutputPath: obj/Debug/
  71. ProjectDir: /Users/johnconners/Projects/UnifiedDrawingTest
  72. ResourcePrefix: Resources
  73. SdkBinPath: /Applications/Xcode.app/Contents/Developer/usr/bin
  74. SdkDevPath: /Applications/Xcode.app/Contents/Developer
  75. SdkUsrPath: /Applications/Xcode.app/Contents/Developer/usr
  76.  
  77. Target _CollectBundleResources:
  78. CollectBundleResources Task
  79. BundleResources:
  80. OptimizePropertyLists: False
  81. OptimizePNGs: False
  82. ProjectDir: /Users/johnconners/Projects/UnifiedDrawingTest
  83. ResourcePrefix: Resources
  84.  
  85. Target PrepareForBuild:
  86. Configuration: Debug Platform: AnyCPU
  87.  
  88. Target _UnpackLibraryResources:
  89. UnpackLibraryResources Task
  90. Prefix: xammac
  91. IntermediateOutputPath: obj/Debug/
  92. NoOverwrite:
  93. obj/Debug/ibtool/Main.storyboardc/Info.plist
  94. obj/Debug/ibtool/Main.storyboardc/MainMenu.nib
  95. obj/Debug/ibtool/Main.storyboardc/NSWindowController-B8D-0N-5wS.nib
  96. obj/Debug/ibtool/Main.storyboardc/XfG-lQ-9wD-view-m2S-Jp-Qdl.nib
  97. ReferencedLibraries:
  98. /Library/Frameworks/Xamarin.Mac.framework/Versions/Current/lib/mono/4.5/System.dll
  99. sysdrawing-coregraphics/mac/xm45/System.Drawing.dll
  100. /Library/Frameworks/Xamarin.Mac.framework/Versions/Current/lib/mono/4.5/System.Xml.dll
  101. /Library/Frameworks/Xamarin.Mac.framework/Versions/Current/lib/mono/4.5/OpenTK.dll
  102. /Library/Frameworks/Xamarin.Mac.framework/Versions/Current/lib/mono/4.5/Xamarin.Mac.dll
  103. /Library/Frameworks/Xamarin.Mac.framework/Versions/Current/lib/mono/4.5/System.Core.dll
  104. /Library/Frameworks/Mono.framework/Versions/4.2.2/lib/mono/4.5/mscorlib.dll
  105.  
  106. Target CopyFilesMarkedCopyLocal:
  107. Copying file from '/Library/Frameworks/Xamarin.Mac.framework/Versions/Current/lib/mono/4.5/System.dll' to '/Users/johnconners/Projects/UnifiedDrawingTest/bin/Debug/System.dll'
  108. Copying file from '/Users/johnconners/Projects/UnifiedDrawingTest/sysdrawing-coregraphics/mac/xm45/System.Drawing.dll' to '/Users/johnconners/Projects/UnifiedDrawingTest/bin/Debug/System.Drawing.dll'
  109. Copying file from '/Library/Frameworks/Xamarin.Mac.framework/Versions/Current/lib/mono/4.5/System.Xml.dll' to '/Users/johnconners/Projects/UnifiedDrawingTest/bin/Debug/System.Xml.dll'
  110. Copying file from '/Library/Frameworks/Xamarin.Mac.framework/Versions/Current/lib/mono/4.5/OpenTK.dll' to '/Users/johnconners/Projects/UnifiedDrawingTest/bin/Debug/OpenTK.dll'
  111. Copying file from '/Library/Frameworks/Xamarin.Mac.framework/Versions/Current/lib/mono/4.5/Xamarin.Mac.dll' to '/Users/johnconners/Projects/UnifiedDrawingTest/bin/Debug/Xamarin.Mac.dll'
  112. Copying file from '/Library/Frameworks/Xamarin.Mac.framework/Versions/Current/lib/mono/4.5/System.Core.dll' to '/Users/johnconners/Projects/UnifiedDrawingTest/bin/Debug/System.Core.dll'
  113. Copying file from '/Library/Frameworks/Xamarin.Mac.framework/Versions/Current/lib/mono/4.5/Mono.Security.dll' to '/Users/johnconners/Projects/UnifiedDrawingTest/bin/Debug/Mono.Security.dll'
  114. Copying file from '/Library/Frameworks/Xamarin.Mac.framework/Versions/Current/lib/mono/4.5/Mono.Security.dll.mdb' to '/Users/johnconners/Projects/UnifiedDrawingTest/bin/Debug/Mono.Security.dll.mdb'
  115. Copying file from '/Library/Frameworks/Xamarin.Mac.framework/Versions/Current/lib/mono/4.5/System.Configuration.dll' to '/Users/johnconners/Projects/UnifiedDrawingTest/bin/Debug/System.Configuration.dll'
  116. Copying file from '/Library/Frameworks/Xamarin.Mac.framework/Versions/Current/lib/mono/4.5/System.Configuration.dll.mdb' to '/Users/johnconners/Projects/UnifiedDrawingTest/bin/Debug/System.Configuration.dll.mdb'
  117. Copying file from '/Library/Frameworks/Xamarin.Mac.framework/Versions/Current/lib/mono/4.5/System.Security.dll' to '/Users/johnconners/Projects/UnifiedDrawingTest/bin/Debug/System.Security.dll'
  118. Copying file from '/Library/Frameworks/Xamarin.Mac.framework/Versions/Current/lib/mono/4.5/System.Security.dll.mdb' to '/Users/johnconners/Projects/UnifiedDrawingTest/bin/Debug/System.Security.dll.mdb'
  119. Copying file from '/Library/Frameworks/Xamarin.Mac.framework/Versions/Current/lib/mono/4.5/System.Net.Http.dll' to '/Users/johnconners/Projects/UnifiedDrawingTest/bin/Debug/System.Net.Http.dll'
  120. Copying file from '/Library/Frameworks/Xamarin.Mac.framework/Versions/Current/lib/mono/4.5/System.Net.Http.dll.mdb' to '/Users/johnconners/Projects/UnifiedDrawingTest/bin/Debug/System.Net.Http.dll.mdb'
  121. Copying file from '/Library/Frameworks/Xamarin.Mac.framework/Versions/Current/lib/mono/4.5/Mono.Posix.dll' to '/Users/johnconners/Projects/UnifiedDrawingTest/bin/Debug/Mono.Posix.dll'
  122. Copying file from '/Library/Frameworks/Xamarin.Mac.framework/Versions/Current/lib/mono/4.5/Mono.Posix.dll.mdb' to '/Users/johnconners/Projects/UnifiedDrawingTest/bin/Debug/Mono.Posix.dll.mdb'
  123.  
  124. Target GenerateSatelliteAssemblies:
  125. No input files were specified for target GenerateSatelliteAssemblies, skipping.
  126.  
  127. Target CoreCompile:
  128. Tool /Library/Frameworks/Mono.framework/Commands/mcs execution started with arguments: /noconfig /debug:full /debug+ /optimize- /out:"obj/Debug/Unified Drawing Test.exe" Main.cs AppDelegate.cs ViewController.cs ViewController.designer.cs obj/Debug/.NETFramework,Version=v4.5.AssemblyAttribute.cs /target:exe /define:"__UNIFIED__;DEBUG" /nostdlib /reference:/Library/Frameworks/Xamarin.Mac.framework/Versions/Current/lib/mono/4.5/System.dll /reference:sysdrawing-coregraphics/mac/xm45/System.Drawing.dll /reference:/Library/Frameworks/Xamarin.Mac.framework/Versions/Current/lib/mono/4.5/System.Xml.dll /reference:/Library/Frameworks/Xamarin.Mac.framework/Versions/Current/lib/mono/4.5/OpenTK.dll /reference:/Library/Frameworks/Xamarin.Mac.framework/Versions/Current/lib/mono/4.5/Xamarin.Mac.dll /reference:/Library/Frameworks/Xamarin.Mac.framework/Versions/Current/lib/mono/4.5/System.Core.dll /reference:/Library/Frameworks/Mono.framework/Versions/4.2.2/lib/mono/4.5/mscorlib.dll /warn:4
  129. Main.cs(21,5): error CS0433: The imported type `System.Drawing.Color' is defined multiple times
  130. /Users/johnconners/Projects/UnifiedDrawingTest/sysdrawing-coregraphics/mac/xm45/System.Drawing.dll (Location of the symbol related to previous error)
  131. /Library/Frameworks/Xamarin.Mac.framework/Versions/Current/lib/mono/4.5/OpenTK.dll (Location of the symbol related to previous error)
  132. Task "Csc" execution -- FAILED
  133. Done building target "CoreCompile" in project "/Users/johnconners/Projects/UnifiedDrawingTest/UnifiedDrawingTest.csproj".-- FAILED
  134.  
  135. Done building project "/Users/johnconners/Projects/UnifiedDrawingTest/UnifiedDrawingTest.csproj".-- FAILED
  136.  
  137. Build FAILED.
  138. Errors:
  139.  
  140. /Users/johnconners/Projects/UnifiedDrawingTest/UnifiedDrawingTest.csproj (Build) ->
  141. /Library/Frameworks/Mono.framework/Versions/4.2.2/lib/mono/4.5/Microsoft.CSharp.targets (CoreCompile target) ->
  142.  
  143. Main.cs(21,5): error CS0433: The imported type `System.Drawing.Color' is defined multiple times
  144.  
  145. 0 Warning(s)
  146. 1 Error(s)
  147.  
  148.  
  149. ---------------------- Done ----------------------
  150.  
  151. Build: 1 error, 0 warnings
RAW Paste Data