SHARE
TWEET

Build error

a guest Feb 11th, 2014 62 Never
Not a member of Pastebin yet? Sign Up, it unlocks many cool features!
  1. 21:28:46.894 [ERROR] [org.gradle.BuildExceptionReporter]        at org.gradle.la
  2. uncher.cli.RunBuildAction.run(RunBuildAction.java:50)
  3. 21:28:46.900 [ERROR] [org.gradle.BuildExceptionReporter]        at org.gradle.in
  4. ternal.Actions$RunnableActionAdapter.execute(Actions.java:171)
  5. 21:28:46.905 [ERROR] [org.gradle.BuildExceptionReporter]        at org.gradle.la
  6. uncher.cli.CommandLineActionFactory$ParseAndBuildAction.execute(CommandLineActio
  7. nFactory.java:201)
  8. 21:28:46.910 [ERROR] [org.gradle.BuildExceptionReporter]        at org.gradle.la
  9. uncher.cli.CommandLineActionFactory$ParseAndBuildAction.execute(CommandLineActio
  10. nFactory.java:174)
  11. 21:28:46.916 [ERROR] [org.gradle.BuildExceptionReporter]        at org.gradle.la
  12. uncher.cli.CommandLineActionFactory$WithLogging.execute(CommandLineActionFactory
  13. .java:170)
  14. 21:28:46.922 [ERROR] [org.gradle.BuildExceptionReporter]        at org.gradle.la
  15. uncher.cli.CommandLineActionFactory$WithLogging.execute(CommandLineActionFactory
  16. .java:139)
  17. 21:28:46.927 [ERROR] [org.gradle.BuildExceptionReporter]        at org.gradle.la
  18. uncher.cli.ExceptionReportingAction.execute(ExceptionReportingAction.java:33)
  19. 21:28:46.937 [ERROR] [org.gradle.BuildExceptionReporter]        at org.gradle.la
  20. uncher.cli.ExceptionReportingAction.execute(ExceptionReportingAction.java:22)
  21. 21:28:46.943 [ERROR] [org.gradle.BuildExceptionReporter]        at org.gradle.la
  22. uncher.Main.doAction(Main.java:46)
  23. 21:28:46.949 [ERROR] [org.gradle.BuildExceptionReporter]        at org.gradle.la
  24. uncher.bootstrap.EntryPoint.run(EntryPoint.java:45)
  25. 21:28:46.954 [ERROR] [org.gradle.BuildExceptionReporter]        at org.gradle.la
  26. uncher.Main.main(Main.java:37)
  27. 21:28:46.959 [ERROR] [org.gradle.BuildExceptionReporter]        at org.gradle.la
  28. uncher.bootstrap.ProcessBootstrap.runNoExit(ProcessBootstrap.java:50)
  29. 21:28:46.964 [ERROR] [org.gradle.BuildExceptionReporter]        at org.gradle.la
  30. uncher.bootstrap.ProcessBootstrap.run(ProcessBootstrap.java:32)
  31. 21:28:46.972 [ERROR] [org.gradle.BuildExceptionReporter]        at org.gradle.la
  32. uncher.GradleMain.main(GradleMain.java:23)
  33. 21:28:46.983 [ERROR] [org.gradle.BuildExceptionReporter]        at org.gradle.wr
  34. apper.BootstrapMainStarter.start(BootstrapMainStarter.java:30)
  35. 21:28:46.988 [ERROR] [org.gradle.BuildExceptionReporter]        at org.gradle.wr
  36. apper.WrapperExecutor.execute(WrapperExecutor.java:127)
  37. 21:28:46.994 [ERROR] [org.gradle.BuildExceptionReporter]        at org.gradle.wr
  38. apper.GradleWrapperMain.main(GradleWrapperMain.java:58)
  39. 21:28:47.000 [ERROR] [org.gradle.BuildExceptionReporter] Caused by: org.gradle.a
  40. pi.internal.artifacts.ivyservice.ModuleVersionResolveException: Could not resolv
  41. e :forgeSrc:1.7.2-10.12.0.1027.
  42. 21:28:47.005 [ERROR] [org.gradle.BuildExceptionReporter] Required by:
  43. 21:28:47.010 [ERROR] [org.gradle.BuildExceptionReporter]     com.dand0.ea:forge
  44. 1.7.2:1.0.0
  45. 21:28:47.014 [ERROR] [org.gradle.BuildExceptionReporter]        at org.gradle.ap
  46. i.internal.artifacts.ivyservice.ivyresolve.UserResolverChain.resolve(UserResolve
  47. rChain.java:67)
  48. 21:28:47.020 [ERROR] [org.gradle.BuildExceptionReporter]        at org.gradle.ap
  49. i.internal.artifacts.ivyservice.clientmodule.ClientModuleResolver.resolve(Client
  50. ModuleResolver.java:34)
  51. 21:28:47.025 [ERROR] [org.gradle.BuildExceptionReporter]        at org.gradle.ap
  52. i.internal.artifacts.ivyservice.projectmodule.ProjectDependencyResolver.resolve(
  53. ProjectDependencyResolver.java:48)
  54. 21:28:47.030 [ERROR] [org.gradle.BuildExceptionReporter]        at org.gradle.ap
  55. i.internal.artifacts.ivyservice.ivyresolve.LazyDependencyToModuleResolver$Abstra
  56. ctVersionResolveResult.resolve(LazyDependencyToModuleResolver.java:86)
  57. 21:28:47.035 [ERROR] [org.gradle.BuildExceptionReporter]        at org.gradle.ap
  58. i.internal.artifacts.ivyservice.resolveengine.DependencyGraphBuilder$ModuleVersi
  59. onResolveState.resolve(DependencyGraphBuilder.java:649)
  60. 21:28:47.040 [ERROR] [org.gradle.BuildExceptionReporter]        at org.gradle.ap
  61. i.internal.artifacts.ivyservice.resolveengine.DependencyGraphBuilder$ModuleVersi
  62. onResolveState.getMetaData(DependencyGraphBuilder.java:660)
  63. 21:28:47.046 [ERROR] [org.gradle.BuildExceptionReporter]        at org.gradle.ap
  64. i.internal.artifacts.ivyservice.resolveengine.DependencyGraphBuilder$DependencyE
  65. dge.calculateTargetConfigurations(DependencyGraphBuilder.java:336)
  66. 21:28:47.052 [ERROR] [org.gradle.BuildExceptionReporter]        at org.gradle.ap
  67. i.internal.artifacts.ivyservice.resolveengine.DependencyGraphBuilder$DependencyE
  68. dge.attachToTargetConfigurations(DependencyGraphBuilder.java:310)
  69. 21:28:47.057 [ERROR] [org.gradle.BuildExceptionReporter]        at org.gradle.ap
  70. i.internal.artifacts.ivyservice.resolveengine.DependencyGraphBuilder.traverseGra
  71. ph(DependencyGraphBuilder.java:126)
  72. 21:28:47.062 [ERROR] [org.gradle.BuildExceptionReporter]        at org.gradle.ap
  73. i.internal.artifacts.ivyservice.resolveengine.DependencyGraphBuilder.resolve(Dep
  74. endencyGraphBuilder.java:66)
  75. 21:28:47.068 [ERROR] [org.gradle.BuildExceptionReporter]        at org.gradle.ap
  76. i.internal.artifacts.ivyservice.resolveengine.DefaultDependencyResolver$1.transf
  77. orm(DefaultDependencyResolver.java:108)
  78. 21:28:47.073 [ERROR] [org.gradle.BuildExceptionReporter]        at org.gradle.ap
  79. i.internal.artifacts.ivyservice.resolveengine.DefaultDependencyResolver$1.transf
  80. orm(DefaultDependencyResolver.java:77)
  81. 21:28:47.078 [ERROR] [org.gradle.BuildExceptionReporter]        at org.gradle.ap
  82. i.internal.artifacts.ivyservice.DefaultIvyContextManager.withIvy(DefaultIvyConte
  83. xtManager.java:61)
  84. 21:28:47.084 [ERROR] [org.gradle.BuildExceptionReporter]        at org.gradle.ap
  85. i.internal.artifacts.ivyservice.resolveengine.DefaultDependencyResolver.resolve(
  86. DefaultDependencyResolver.java:77)
  87. 21:28:47.089 [ERROR] [org.gradle.BuildExceptionReporter]        at org.gradle.ap
  88. i.internal.artifacts.ivyservice.CacheLockingArtifactDependencyResolver$1.create(
  89. CacheLockingArtifactDependencyResolver.java:39)
  90. 21:28:47.094 [ERROR] [org.gradle.BuildExceptionReporter]        at org.gradle.ap
  91. i.internal.artifacts.ivyservice.CacheLockingArtifactDependencyResolver$1.create(
  92. CacheLockingArtifactDependencyResolver.java:37)
  93. 21:28:47.099 [ERROR] [org.gradle.BuildExceptionReporter]        at org.gradle.ca
  94. che.internal.DefaultCacheAccess.useCache(DefaultCacheAccess.java:148)
  95. 21:28:47.104 [ERROR] [org.gradle.BuildExceptionReporter]        at org.gradle.ca
  96. che.internal.DefaultPersistentDirectoryStore.useCache(DefaultPersistentDirectory
  97. Store.java:123)
  98. 21:28:47.109 [ERROR] [org.gradle.BuildExceptionReporter]        at org.gradle.ap
  99. i.internal.artifacts.ivyservice.DefaultCacheLockingManager.useCache(DefaultCache
  100. LockingManager.java:77)
  101. 21:28:47.114 [ERROR] [org.gradle.BuildExceptionReporter]        at org.gradle.ap
  102. i.internal.artifacts.ivyservice.CacheLockingArtifactDependencyResolver.resolve(C
  103. acheLockingArtifactDependencyResolver.java:37)
  104. 21:28:47.120 [ERROR] [org.gradle.BuildExceptionReporter]        at org.gradle.ap
  105. i.internal.artifacts.ivyservice.SelfResolvingDependencyResolver.resolve(SelfReso
  106. lvingDependencyResolver.java:41)
  107. 21:28:47.125 [ERROR] [org.gradle.BuildExceptionReporter]        at org.gradle.ap
  108. i.internal.artifacts.ivyservice.ShortcircuitEmptyConfigsArtifactDependencyResolv
  109. er.resolve(ShortcircuitEmptyConfigsArtifactDependencyResolver.java:46)
  110. 21:28:47.130 [ERROR] [org.gradle.BuildExceptionReporter]        at org.gradle.ap
  111. i.internal.artifacts.ivyservice.ErrorHandlingArtifactDependencyResolver.resolve(
  112. ErrorHandlingArtifactDependencyResolver.java:44)
  113. 21:28:47.135 [ERROR] [org.gradle.BuildExceptionReporter]        at org.gradle.ap
  114. i.internal.artifacts.ivyservice.DefaultConfigurationResolver.resolve(DefaultConf
  115. igurationResolver.java:42)
  116. 21:28:47.140 [ERROR] [org.gradle.BuildExceptionReporter]        at org.gradle.ap
  117. i.internal.artifacts.configurations.DefaultConfiguration.resolveNow(DefaultConfi
  118. guration.java:240)
  119. 21:28:47.145 [ERROR] [org.gradle.BuildExceptionReporter]        at org.gradle.ap
  120. i.internal.artifacts.configurations.DefaultConfiguration.getResolvedConfiguratio
  121. n(DefaultConfiguration.java:230)
  122. 21:28:47.151 [ERROR] [org.gradle.BuildExceptionReporter]        at org.gradle.ap
  123. i.internal.artifacts.configurations.DefaultConfiguration_Decorated.getResolvedCo
  124. nfiguration(Unknown Source)
  125. 21:28:47.155 [ERROR] [org.gradle.BuildExceptionReporter]        at org.gradle.ap
  126. i.internal.artifacts.configurations.DefaultConfiguration$ConfigurationFileCollec
  127. tion.getFiles(DefaultConfiguration.java:463)
  128. 21:28:47.161 [ERROR] [org.gradle.BuildExceptionReporter]        ... 67 more
  129. 21:28:47.167 [ERROR] [org.gradle.BuildExceptionReporter] Caused by: org.gradle.a
  130. pi.UncheckedIOException: Could not GET 'https://libraries.minecraft.net//forgeSr
  131. c/1.7.2-10.12.0.1027/forgeSrc-1.7.2-10.12.0.1027.pom'. Received status code 403
  132. from server: Forbidden
  133. 21:28:47.172 [ERROR] [org.gradle.BuildExceptionReporter]        at org.gradle.ap
  134. i.internal.externalresource.transport.http.HttpClientHelper.processResponse(Http
  135. ClientHelper.java:121)
  136. 21:28:47.177 [ERROR] [org.gradle.BuildExceptionReporter]        at org.gradle.ap
  137. i.internal.externalresource.transport.http.HttpClientHelper.performGet(HttpClien
  138. tHelper.java:70)
  139. 21:28:47.182 [ERROR] [org.gradle.BuildExceptionReporter]        at org.gradle.ap
  140. i.internal.externalresource.transport.http.HttpResourceAccessor.getResource(Http
  141. ResourceAccessor.java:46)
  142. 21:28:47.188 [ERROR] [org.gradle.BuildExceptionReporter]        at org.gradle.ap
  143. i.internal.externalresource.transport.http.HttpResourceAccessor.getResource(Http
  144. ResourceAccessor.java:32)
  145. 21:28:47.195 [ERROR] [org.gradle.BuildExceptionReporter]        at org.gradle.ap
  146. i.internal.externalresource.transfer.ProgressLoggingExternalResourceAccessor.get
  147. Resource(ProgressLoggingExternalResourceAccessor.java:38)
  148. 21:28:47.200 [ERROR] [org.gradle.BuildExceptionReporter]        at org.gradle.ap
  149. i.internal.externalresource.transfer.DefaultCacheAwareExternalResourceAccessor.g
  150. etResource(DefaultCacheAwareExternalResourceAccessor.java:60)
  151. 21:28:47.206 [ERROR] [org.gradle.BuildExceptionReporter]        at org.gradle.ap
  152. i.internal.externalresource.transport.DefaultExternalResourceRepository.getResou
  153. rce(DefaultExternalResourceRepository.java:65)
  154. 21:28:47.211 [ERROR] [org.gradle.BuildExceptionReporter]        at org.gradle.ap
  155. i.internal.artifacts.repositories.resolver.ExternalResourceResolver.getResource(
  156. ExternalResourceResolver.java:427)
  157. 21:28:47.216 [ERROR] [org.gradle.BuildExceptionReporter]        at org.gradle.ap
  158. i.internal.artifacts.repositories.resolver.ExternalResourceResolver.findStaticRe
  159. sourceUsingPatterns(ExternalResourceResolver.java:307)
  160. 21:28:47.222 [ERROR] [org.gradle.BuildExceptionReporter]        at org.gradle.ap
  161. i.internal.artifacts.repositories.resolver.ExternalResourceResolver.findMetaData
  162. FileUsingAnyPattern(ExternalResourceResolver.java:266)
  163. 21:28:47.226 [ERROR] [org.gradle.BuildExceptionReporter]        at org.gradle.ap
  164. i.internal.artifacts.repositories.resolver.ExternalResourceResolver.findStaticDe
  165. pendency(ExternalResourceResolver.java:170)
  166. 21:28:47.233 [ERROR] [org.gradle.BuildExceptionReporter]        at org.gradle.ap
  167. i.internal.artifacts.repositories.resolver.ExternalResourceResolver.getDependenc
  168. y(ExternalResourceResolver.java:165)
  169. 21:28:47.239 [ERROR] [org.gradle.BuildExceptionReporter]        at org.gradle.ap
  170. i.internal.artifacts.repositories.resolver.MavenResolver.getDependency(MavenReso
  171. lver.java:81)
  172. 21:28:47.243 [ERROR] [org.gradle.BuildExceptionReporter]        at org.gradle.ap
  173. i.internal.artifacts.repositories.resolver.ExternalResourceResolver.getDependenc
  174. y(ExternalResourceResolver.java:157)
  175. 21:28:47.249 [ERROR] [org.gradle.BuildExceptionReporter]        at org.gradle.ap
  176. i.internal.artifacts.ivyservice.ivyresolve.CacheLockingModuleVersionRepository$1
  177. .run(CacheLockingModuleVersionRepository.java:46)
  178. 21:28:47.254 [ERROR] [org.gradle.BuildExceptionReporter]        at org.gradle.in
  179. ternal.Factories$1.create(Factories.java:22)
  180. 21:28:47.259 [ERROR] [org.gradle.BuildExceptionReporter]        at org.gradle.ca
  181. che.internal.DefaultCacheAccess.longRunningOperation(DefaultCacheAccess.java:198
  182. )
  183. 21:28:47.264 [ERROR] [org.gradle.BuildExceptionReporter]        at org.gradle.ca
  184. che.internal.DefaultCacheAccess.longRunningOperation(DefaultCacheAccess.java:266
  185. )
  186. 21:28:47.269 [ERROR] [org.gradle.BuildExceptionReporter]        at org.gradle.ca
  187. che.internal.DefaultPersistentDirectoryStore.longRunningOperation(DefaultPersist
  188. entDirectoryStore.java:135)
  189. 21:28:47.274 [ERROR] [org.gradle.BuildExceptionReporter]        at org.gradle.ap
  190. i.internal.artifacts.ivyservice.DefaultCacheLockingManager.longRunningOperation(
  191. DefaultCacheLockingManager.java:73)
  192. 21:28:47.279 [ERROR] [org.gradle.BuildExceptionReporter]        at org.gradle.ap
  193. i.internal.artifacts.ivyservice.ivyresolve.CacheLockingModuleVersionRepository.g
  194. etDependency(CacheLockingModuleVersionRepository.java:44)
  195. 21:28:47.285 [ERROR] [org.gradle.BuildExceptionReporter]        at org.gradle.ap
  196. i.internal.artifacts.ivyservice.ivyresolve.CachingModuleVersionRepository.getDep
  197. endency(CachingModuleVersionRepository.java:90)
  198. 21:28:47.290 [ERROR] [org.gradle.BuildExceptionReporter]        at org.gradle.ap
  199. i.internal.artifacts.ivyservice.ivyresolve.memcache.CachedRepository.getDependen
  200. cy(CachedRepository.java:55)
  201. 21:28:47.296 [ERROR] [org.gradle.BuildExceptionReporter]        at org.gradle.ap
  202. i.internal.artifacts.ivyservice.ivyresolve.UserResolverChain$RepositoryResolveSt
  203. ate.resolve(UserResolverChain.java:184)
  204. 21:28:47.304 [ERROR] [org.gradle.BuildExceptionReporter]        at org.gradle.ap
  205. i.internal.artifacts.ivyservice.ivyresolve.UserResolverChain.findLatestModule(Us
  206. erResolverChain.java:98)
  207. 21:28:47.309 [ERROR] [org.gradle.BuildExceptionReporter]        at org.gradle.ap
  208. i.internal.artifacts.ivyservice.ivyresolve.UserResolverChain.findLatestModule(Us
  209. erResolverChain.java:81)
  210. 21:28:47.316 [ERROR] [org.gradle.BuildExceptionReporter]        at org.gradle.ap
  211. i.internal.artifacts.ivyservice.ivyresolve.UserResolverChain.resolve(UserResolve
  212. rChain.java:56)
  213. 21:28:47.322 [ERROR] [org.gradle.BuildExceptionReporter]        ... 94 more
  214. 21:28:47.327 [ERROR] [org.gradle.BuildExceptionReporter]
  215. 21:28:47.333 [LIFECYCLE] [org.gradle.BuildResultLogger]
  216. 21:28:47.339 [LIFECYCLE] [org.gradle.BuildResultLogger] BUILD FAILED
  217. 21:28:47.345 [LIFECYCLE] [org.gradle.BuildResultLogger]
  218. 21:28:47.352 [LIFECYCLE] [org.gradle.BuildResultLogger] Total time: 39.233 secs
  219. 21:28:47.359 [DEBUG] [org.gradle.cache.internal.btree.BTreePersistentIndexedCach
  220. e                                                                              ]
  221.                                                                                C
  222. losing cache taskArtifacts.bin (C:\Users\admin\Desktop\Minecraft\MCP\forge 1.7.2
  223. \.gradle\1.10\taskArtifacts\taskArtifacts.bin)
  224. 21:28:47.369 [DEBUG] [org.gradle.cache.internal.btree.BTreePersistentIndexedCach
  225. e                                                                              ]
  226.                                                                                C
  227. losing cache fileHashes.bin (C:\Users\admin\Desktop\Minecraft\MCP\forge 1.7.2\.g
  228. radle\1.10\taskArtifacts\fileHashes.bin)
  229. 21:28:47.378 [DEBUG] [org.gradle.cache.internal.btree.BTreePersistentIndexedCach
  230. e                                                                              ]
  231.                                                                                C
  232. losing cache fileSnapshots.bin (C:\Users\admin\Desktop\Minecraft\MCP\forge 1.7.2
  233. \.gradle\1.10\taskArtifacts\fileSnapshots.bin)
  234. 21:28:47.386 [DEBUG] [org.gradle.cache.internal.btree.BTreePersistentIndexedCach
  235. e                                                                              ]
  236.                                                                                C
  237. losing cache outputFileStates.bin (C:\Users\admin\Desktop\Minecraft\MCP\forge 1.
  238. 7.2\.gradle\1.10\taskArtifacts\outputFileStates.bin)
  239. 21:28:47.395 [DEBUG] [org.gradle.cache.internal.DefaultFileLockManager] Releasin
  240. g lock on task artifact state cache (C:\Users\admin\Desktop\Minecraft\MCP\forge
  241. 1.7.2\.gradle\1.10\taskArtifacts).
  242. 21:28:47.403 [DEBUG] [org.gradle.cache.internal.DefaultFileLockManager] Releasin
  243. g lock on no_buildscript class cache for build file 'C:\Users\admin\Desktop\Mine
  244. craft\MCP\forge 1.7.2\build.gradle' (C:\Users\admin\.gradle\caches\1.10\scripts\
  245. build_186s9rhb77bkf66mmagp6ro79h\ProjectScript\no_buildscript).
  246. 21:28:47.410 [DEBUG] [org.gradle.cache.internal.DefaultFileLockManager] Releasin
  247. g lock on buildscript class cache for build file 'C:\Users\admin\Desktop\Minecra
  248. ft\MCP\forge 1.7.2\build.gradle' (C:\Users\admin\.gradle\caches\1.10\scripts\bui
  249. ld_186s9rhb77bkf66mmagp6ro79h\ProjectScript\buildscript).
  250. 21:28:47.419 [DEBUG] [org.gradle.cache.internal.btree.BTreePersistentIndexedCach
  251. e                                                                              ]
  252.                                                                                C
  253. losing cache dynamic-revisions.bin (C:\Users\admin\.gradle\caches\modules-2\meta
  254. data-2.1\dynamic-revisions.bin)
  255. 21:28:47.426 [DEBUG] [org.gradle.cache.internal.btree.BTreePersistentIndexedCach
  256. e                                                                              ]
  257.                                                                                C
  258. losing cache artifact-at-repository.bin (C:\Users\admin\.gradle\caches\modules-2
  259. \metadata-2.1\artifact-at-repository.bin)
  260. 21:28:47.434 [DEBUG] [org.gradle.cache.internal.btree.BTreePersistentIndexedCach
  261. e                                                                              ]
  262.                                                                                C
  263. losing cache artifact-at-url.bin (C:\Users\admin\.gradle\caches\modules-2\metada
  264. ta-2.1\artifact-at-url.bin)
  265. 21:28:47.441 [DEBUG] [org.gradle.cache.internal.btree.BTreePersistentIndexedCach
  266. e                                                                              ]
  267.                                                                                C
  268. losing cache module-metadata.bin (C:\Users\admin\.gradle\caches\modules-2\metada
  269. ta-2.1\module-metadata.bin)
  270. 21:28:47.449 [DEBUG] [org.gradle.cache.internal.DefaultFileLockManager] Releasin
  271. g lock on artifact cache (C:\Users\admin\.gradle\caches\modules-2).
  272. 21:28:47.467 [DEBUG] [org.gradle.api.internal.tasks.compile.daemon.CompilerDaemo
  273. nManager                                                                       ]
  274.                                                                                S
  275. topping 0 compiler daemon(s).
  276. 21:28:47.474 [INFO] [org.gradle.api.internal.tasks.compile.daemon.CompilerDaemon
  277. Manager                                                                        ]
  278.                                                                                S
  279. topped 0 compiler daemon(s).
  280. 21:28:47.486 [DEBUG] [org.gradle.api.internal.artifacts.ivyservice.resolveengine
  281. .store.CachedStoreFactory                                                      ]
  282.                                                                                R
  283. esolution result cache closed. Cache reads: 0, disk reads: 0 (avg: 0.0 secs, tot
  284. al: 0.0 secs)
  285. 21:28:47.495 [DEBUG] [org.gradle.api.internal.artifacts.ivyservice.resolveengine
  286. .store.CachedStoreFactory                                                      ]
  287.                                                                                R
  288. esolved configuration cache closed. Cache reads: 0, disk reads: 0 (avg: 0.0 secs
  289. , total: 0.0 secs)
  290. 21:28:47.502 [DEBUG] [org.gradle.api.internal.artifacts.ivyservice.resolveengine
  291. .store.ResolutionResultsStoreFactory                                           ]
  292.                                                                                D
  293. eleted 2 resolution results binary files in 0.017 secs
  294. 21:28:47.508 [DEBUG] [org.gradle.api.internal.artifacts.ivyservice.ivyresolve.me
  295. mcache.InMemoryDependencyMetadataCache                                         ]
  296.                                                                                I
  297. n-memory dependency metadata cache closed. Repos cached: 13, cache instances: 5,
  298.  modules served from cache: 7, artifacts: 0
  299.  
  300. C:\Users\admin\Desktop\Minecraft\MCP\forge 1.7.2>
RAW Paste Data
We use cookies for various purposes including analytics. By continuing to use Pastebin, you agree to our use of cookies as described in the Cookies Policy. OK, I Understand
 
Top