SHARE
TWEET

opencv_contrib_example_stitching_detailed

a guest Oct 29th, 2016 180 Never
Not a member of Pastebin yet? Sign Up, it unlocks many cool features!
  1. -- Build files have been written to: /root/OpenCV/build
  2. [  0%] Built target opencv_core_pch_dephelp
  3. [  0%] Built target pch_Generate_opencv_core
  4. [  2%] Built target opencv_core
  5. [  2%] Built target opencv_ts_pch_dephelp
  6. [  2%] Built target pch_Generate_opencv_ts
  7. [  2%] Built target opencv_imgproc_pch_dephelp
  8. [  2%] Built target pch_Generate_opencv_imgproc
  9. [  5%] Built target opencv_imgproc
  10. [  5%] Built target opencv_imgcodecs_pch_dephelp
  11. [  5%] Built target pch_Generate_opencv_imgcodecs
  12. [  5%] Built target opencv_imgcodecs
  13. [  5%] Built target opencv_videoio_pch_dephelp
  14. [  5%] Built target pch_Generate_opencv_videoio
  15. [  5%] Built target opencv_videoio
  16. [  5%] Automatic moc for target opencv_highgui
  17. [  5%] Built target opencv_highgui_automoc
  18. [  5%] Automatic moc for target opencv_highgui_pch_dephelp
  19. [  5%] Built target opencv_highgui_pch_dephelp_automoc
  20. [  6%] Built target opencv_highgui_pch_dephelp
  21. [  6%] Built target pch_Generate_opencv_highgui
  22. [  6%] Built target opencv_highgui
  23. [  6%] Built target opencv_ts
  24. [  6%] Built target opencv_perf_core_pch_dephelp
  25. [  6%] Built target pch_Generate_opencv_perf_core
  26. [  8%] Built target opencv_perf_core
  27. [  8%] Built target opencv_test_core_pch_dephelp
  28. [  8%] Built target pch_Generate_opencv_test_core
  29. [  9%] Built target opencv_test_core
  30. [ 10%] Built target opencv_flann_pch_dephelp
  31. [ 10%] Built target pch_Generate_opencv_flann
  32. [ 10%] Built target opencv_flann
  33. [ 10%] Built target opencv_test_flann_pch_dephelp
  34. [ 10%] Built target pch_Generate_opencv_test_flann
  35. [ 10%] Built target opencv_test_flann
  36. [ 10%] Built target opencv_hdf_pch_dephelp
  37. [ 12%] Built target pch_Generate_opencv_hdf
  38. [ 12%] Built target opencv_hdf
  39. [ 12%] Built target opencv_perf_imgproc_pch_dephelp
  40. [ 13%] Built target pch_Generate_opencv_perf_imgproc
  41. [ 16%] Built target opencv_perf_imgproc
  42. [ 16%] Built target opencv_test_imgproc_pch_dephelp
  43. [ 17%] Built target pch_Generate_opencv_test_imgproc
  44. [ 20%] Built target opencv_test_imgproc
  45. [ 20%] Built target opencv_ml_pch_dephelp
  46. [ 20%] Built target pch_Generate_opencv_ml
  47. [ 21%] Built target opencv_ml
  48. [ 21%] Built target opencv_test_ml_pch_dephelp
  49. [ 21%] Built target pch_Generate_opencv_test_ml
  50. [ 23%] Built target opencv_test_ml
  51. [ 23%] Built target opencv_photo_pch_dephelp
  52. [ 23%] Built target pch_Generate_opencv_photo
  53. [ 24%] Built target opencv_photo
  54. [ 26%] Built target opencv_perf_photo_pch_dephelp
  55. [ 26%] Built target pch_Generate_opencv_perf_photo
  56. [ 26%] Built target opencv_perf_photo
  57. [ 26%] Built target opencv_test_photo_pch_dephelp
  58. [ 26%] Built target pch_Generate_opencv_test_photo
  59. [ 27%] Built target opencv_test_photo
  60. [ 27%] Built target opencv_reg_pch_dephelp
  61. [ 27%] Built target pch_Generate_opencv_reg
  62. [ 27%] Built target opencv_reg
  63. [ 27%] Built target example_reg_map_test
  64. [ 27%] Built target opencv_perf_reg_pch_dephelp
  65. [ 27%] Built target pch_Generate_opencv_perf_reg
  66. [ 27%] Built target opencv_perf_reg
  67. [ 27%] Built target opencv_test_reg_pch_dephelp
  68. [ 27%] Built target pch_Generate_opencv_test_reg
  69. [ 27%] Built target opencv_test_reg
  70. [ 27%] Built target opencv_surface_matching_pch_dephelp
  71. [ 28%] Built target pch_Generate_opencv_surface_matching
  72. [ 28%] Built target opencv_surface_matching
  73. [ 28%] Built target example_surface_matching_ppf_load_match
  74. [ 28%] Built target example_surface_matching_ppf_normal_computation
  75. [ 28%] Built target opencv_video_pch_dephelp
  76. [ 28%] Built target pch_Generate_opencv_video
  77. [ 28%] Built target opencv_video
  78. [ 28%] Built target opencv_perf_video_pch_dephelp
  79. [ 28%] Built target pch_Generate_opencv_perf_video
  80. [ 28%] Built target opencv_perf_video
  81. [ 28%] Built target opencv_test_video_pch_dephelp
  82. [ 28%] Built target pch_Generate_opencv_test_video
  83. [ 28%] Built target opencv_test_video
  84. [ 28%] Built target opencv_viz_pch_dephelp
  85. [ 28%] Built target pch_Generate_opencv_viz
  86. [ 28%] Built target opencv_viz
  87. [ 28%] Built target opencv_test_viz_pch_dephelp
  88. [ 28%] Built target pch_Generate_opencv_test_viz
  89. [ 28%] Built target opencv_test_viz
  90. [ 28%] Built target opencv_dnn_pch_dephelp
  91. [ 28%] Built target pch_Generate_opencv_dnn
  92. [ 30%] Built target libprotobuf
  93. [ 31%] Built target opencv_dnn
  94. [ 31%] Built target example_dnn_caffe_googlenet
  95. [ 31%] Built target opencv_test_dnn_pch_dephelp
  96. [ 31%] Built target pch_Generate_opencv_test_dnn
  97. [ 31%] Built target opencv_test_dnn
  98. [ 31%] Built target opencv_fuzzy_pch_dephelp
  99. [ 31%] Built target pch_Generate_opencv_fuzzy
  100. [ 31%] Built target opencv_fuzzy
  101. [ 31%] Built target example_fuzzy_fuzzy_filtering
  102. [ 31%] Built target example_fuzzy_fuzzy_inpainting
  103. [ 31%] Built target opencv_test_fuzzy_pch_dephelp
  104. [ 31%] Built target pch_Generate_opencv_test_fuzzy
  105. [ 31%] Built target opencv_test_fuzzy
  106. [ 31%] Built target opencv_perf_imgcodecs_pch_dephelp
  107. [ 31%] Built target pch_Generate_opencv_perf_imgcodecs
  108. [ 31%] Built target opencv_perf_imgcodecs
  109. [ 31%] Built target opencv_test_imgcodecs_pch_dephelp
  110. [ 31%] Built target pch_Generate_opencv_test_imgcodecs
  111. [ 31%] Built target opencv_test_imgcodecs
  112. [ 31%] Built target opencv_shape_pch_dephelp
  113. [ 31%] Built target pch_Generate_opencv_shape
  114. [ 31%] Built target opencv_shape
  115. [ 32%] Built target opencv_test_shape_pch_dephelp
  116. [ 32%] Built target pch_Generate_opencv_test_shape
  117. [ 32%] Built target opencv_test_shape
  118. [ 32%] Built target opencv_perf_videoio_pch_dephelp
  119. [ 32%] Built target pch_Generate_opencv_perf_videoio
  120. [ 32%] Built target opencv_perf_videoio
  121. [ 32%] Built target opencv_test_videoio_pch_dephelp
  122. [ 32%] Built target pch_Generate_opencv_test_videoio
  123. [ 34%] Built target opencv_test_videoio
  124. [ 34%] Automatic moc for target opencv_test_highgui
  125. [ 34%] Built target opencv_test_highgui_automoc
  126. [ 34%] Automatic moc for target opencv_test_highgui_pch_dephelp
  127. [ 34%] Built target opencv_test_highgui_pch_dephelp_automoc
  128. [ 34%] Built target opencv_test_highgui_pch_dephelp
  129. [ 34%] Built target pch_Generate_opencv_test_highgui
  130. [ 34%] Built target opencv_test_highgui
  131. [ 34%] Built target opencv_objdetect_pch_dephelp
  132. [ 34%] Built target pch_Generate_opencv_objdetect
  133. [ 34%] Built target opencv_objdetect
  134. [ 34%] Built target opencv_perf_objdetect_pch_dephelp
  135. [ 34%] Built target pch_Generate_opencv_perf_objdetect
  136. [ 34%] Built target opencv_perf_objdetect
  137. [ 34%] Built target opencv_test_objdetect_pch_dephelp
  138. [ 34%] Built target pch_Generate_opencv_test_objdetect
  139. [ 34%] Built target opencv_test_objdetect
  140. [ 34%] Built target opencv_plot_pch_dephelp
  141. [ 34%] Built target pch_Generate_opencv_plot
  142. [ 35%] Built target opencv_plot
  143. [ 35%] Built target opencv_superres_pch_dephelp
  144. [ 35%] Built target pch_Generate_opencv_superres
  145. [ 35%] Built target opencv_superres
  146. [ 35%] Built target opencv_perf_superres_pch_dephelp
  147. [ 35%] Built target pch_Generate_opencv_perf_superres
  148. [ 35%] Built target opencv_perf_superres
  149. [ 35%] Built target opencv_test_superres_pch_dephelp
  150. [ 36%] Built target pch_Generate_opencv_test_superres
  151. [ 36%] Built target opencv_test_superres
  152. [ 36%] Built target opencv_xobjdetect_pch_dephelp
  153. [ 36%] Built target pch_Generate_opencv_xobjdetect
  154. [ 36%] Built target opencv_xobjdetect
  155. [ 36%] Built target opencv_waldboost_detector
  156. [ 36%] Built target opencv_xphoto
  157. [ 36%] Built target example_xphoto_dct_image_denoising
  158. [ 36%] Built target example_xphoto_grayworld_color_balance
  159. [ 36%] Built target example_xphoto_inpainting
  160. [ 36%] Built target example_xphoto_simple_color_balance
  161. [ 36%] Built target opencv_perf_xphoto_pch_dephelp
  162. [ 36%] Built target pch_Generate_opencv_perf_xphoto
  163. [ 36%] Built target opencv_perf_xphoto
  164. [ 36%] Built target opencv_test_xphoto_pch_dephelp
  165. [ 36%] Built target pch_Generate_opencv_test_xphoto
  166. [ 36%] Built target opencv_test_xphoto
  167. [ 36%] Built target opencv_bgsegm_pch_dephelp
  168. [ 36%] Built target pch_Generate_opencv_bgsegm
  169. [ 36%] Built target opencv_bgsegm
  170. [ 36%] Built target example_bgsegm_bgfg_gmg
  171. [ 38%] Built target opencv_test_bgsegm_pch_dephelp
  172. [ 38%] Built target pch_Generate_opencv_test_bgsegm
  173. [ 38%] Built target opencv_test_bgsegm
  174. [ 38%] Built target opencv_bioinspired_pch_dephelp
  175. [ 38%] Built target pch_Generate_opencv_bioinspired
  176. [ 38%] Built target opencv_bioinspired
  177. [ 38%] Built target example_bioinspired_OpenEXRimages_HDR_Retina_toneMapping
  178. [ 38%] Built target example_bioinspired_basicRetina
  179. [ 38%] Built target example_bioinspired_retinaDemo
  180. [ 38%] Built target opencv_perf_bioinspired_pch_dephelp
  181. [ 38%] Built target pch_Generate_opencv_perf_bioinspired
  182. [ 38%] Built target opencv_perf_bioinspired
  183. [ 38%] Built target opencv_test_bioinspired_pch_dephelp
  184. [ 38%] Built target pch_Generate_opencv_test_bioinspired
  185. [ 38%] Built target opencv_test_bioinspired
  186. [ 38%] Built target opencv_dpm_pch_dephelp
  187. [ 38%] Built target pch_Generate_opencv_dpm
  188. [ 38%] Built target opencv_dpm
  189. [ 38%] Built target example_dpm_cascade_detect_camera
  190. [ 38%] Built target example_dpm_cascade_detect_sequence
  191. [ 38%] Built target opencv_face_pch_dephelp
  192. [ 38%] Built target pch_Generate_opencv_face
  193. [ 38%] Built target opencv_face
  194. [ 38%] Built target example_face_facerec_demo
  195. [ 38%] Built target example_face_facerec_eigenfaces
  196. [ 39%] Built target example_face_facerec_fisherfaces
  197. [ 39%] Built target example_face_facerec_lbph
  198. [ 39%] Built target example_face_facerec_save_load
  199. [ 39%] Built target example_face_facerec_video
  200. [ 39%] Built target opencv_features2d_pch_dephelp
  201. [ 39%] Built target pch_Generate_opencv_features2d
  202. [ 41%] Built target opencv_features2d
  203. [ 41%] Built target opencv_perf_features2d_pch_dephelp
  204. [ 41%] Built target pch_Generate_opencv_perf_features2d
  205. [ 41%] Built target opencv_perf_features2d
  206. [ 41%] Built target opencv_test_features2d_pch_dephelp
  207. [ 41%] Built target pch_Generate_opencv_test_features2d
  208. [ 42%] Built target opencv_test_features2d
  209. [ 42%] Built target opencv_line_descriptor_pch_dephelp
  210. [ 42%] Built target pch_Generate_opencv_line_descriptor
  211. [ 42%] Built target opencv_line_descriptor
  212. [ 43%] Built target example_line_descriptor_compute_descriptors
  213. [ 43%] Built target example_line_descriptor_knn_matching
  214. [ 43%] Built target example_line_descriptor_lines_extraction
  215. [ 43%] Built target example_line_descriptor_lsd_lines_extraction
  216. [ 43%] Built target example_line_descriptor_matching
  217. [ 43%] Built target example_line_descriptor_radius_matching
  218. [ 43%] Built target opencv_perf_line_descriptor_pch_dephelp
  219. [ 43%] Built target pch_Generate_opencv_perf_line_descriptor
  220. [ 43%] Built target opencv_perf_line_descriptor
  221. [ 43%] Built target opencv_test_line_descriptor_pch_dephelp
  222. [ 43%] Built target pch_Generate_opencv_test_line_descriptor
  223. [ 43%] Built target opencv_test_line_descriptor
  224. [ 43%] Built target opencv_saliency_pch_dephelp
  225. [ 43%] Built target pch_Generate_opencv_saliency
  226. [ 43%] Built target opencv_saliency
  227. [ 43%] Built target example_saliency_computeSaliency
  228. [ 45%] Built target opencv_text_pch_dephelp
  229. [ 45%] Built target pch_Generate_opencv_text
  230. [ 45%] Built target opencv_text
  231. [ 45%] Built target example_text_character_recognition
  232. [ 45%] Built target example_text_cropped_word_recognition
  233. [ 45%] Built target example_text_end_to_end_recognition
  234. [ 45%] Built target example_text_segmented_word_recognition
  235. [ 45%] Built target example_text_textdetection
  236. [ 45%] Built target example_text_webcam_demo
  237. [ 45%] Built target opencv_calib3d_pch_dephelp
  238. [ 45%] Built target pch_Generate_opencv_calib3d
  239. [ 46%] Built target opencv_calib3d
  240. [ 46%] Built target opencv_perf_calib3d_pch_dephelp
  241. [ 46%] Built target pch_Generate_opencv_perf_calib3d
  242. [ 47%] Built target opencv_perf_calib3d
  243. [ 47%] Built target opencv_test_calib3d_pch_dephelp
  244. [ 47%] Built target pch_Generate_opencv_test_calib3d
  245. [ 49%] Built target opencv_test_calib3d
  246. [ 50%] Built target opencv_ccalib_pch_dephelp
  247. [ 50%] Built target pch_Generate_opencv_ccalib
  248. [ 50%] Built target opencv_ccalib
  249. [ 50%] Built target example_ccalib_multi_cameras_calibration
  250. [ 50%] Built target example_ccalib_omni_calibration
  251. [ 50%] Built target example_ccalib_omni_stereo_calibration
  252. [ 50%] Built target example_ccalib_random_pattern_calibration
  253. [ 50%] Built target example_ccalib_random_pattern_generator
  254. [ 50%] Automatic moc for target example_cvv_cvv_demo
  255. [ 50%] Built target example_cvv_cvv_demo_automoc
  256. [ 50%] Automatic moc for target opencv_cvv
  257. [ 50%] Built target opencv_cvv_automoc
  258. [ 54%] Built target opencv_cvv
  259. [ 56%] Built target example_cvv_cvv_demo
  260. [ 56%] Automatic moc for target opencv_test_cvv
  261. [ 56%] Built target opencv_test_cvv_automoc
  262. [ 56%] Automatic moc for target opencv_test_cvv_pch_dephelp
  263. [ 56%] Built target opencv_test_cvv_pch_dephelp_automoc
  264. [ 57%] Built target opencv_test_cvv_pch_dephelp
  265. [ 57%] Built target pch_Generate_opencv_test_cvv
  266. [ 57%] Built target opencv_test_cvv
  267. [ 58%] Built target opencv_datasets
  268. [ 58%] Built target example_datasets_ar_hmdb
  269. [ 58%] Built target example_datasets_ar_hmdb_benchmark
  270. [ 58%] Built target example_datasets_ar_sports
  271. [ 58%] Built target example_datasets_fr_adience
  272. [ 58%] Built target example_datasets_fr_lfw
  273. [ 58%] Built target example_datasets_fr_lfw_benchmark
  274. [ 58%] Built target example_datasets_gr_chalearn
  275. [ 58%] Built target example_datasets_gr_skig
  276. [ 58%] Built target example_datasets_hpe_humaneva
  277. [ 58%] Built target example_datasets_hpe_parse
  278. [ 58%] Built target example_datasets_ir_affine
  279. [ 58%] Built target example_datasets_ir_robot
  280. [ 58%] Built target example_datasets_is_bsds
  281. [ 58%] Built target example_datasets_is_weizmann
  282. [ 58%] Built target example_datasets_msm_epfl
  283. [ 58%] Built target example_datasets_msm_middlebury
  284. [ 58%] Built target example_datasets_or_imagenet
  285. [ 58%] Built target example_datasets_or_mnist
  286. [ 58%] Built target example_datasets_or_pascal
  287. [ 58%] Built target example_datasets_or_sun
  288. [ 58%] Built target example_datasets_pd_caltech
  289. [ 58%] Built target example_datasets_pd_inria
  290. [ 60%] Built target example_datasets_slam_kitti
  291. [ 60%] Built target example_datasets_slam_tumindoor
  292. [ 60%] Built target example_datasets_tr_chars
  293. [ 60%] Built target example_datasets_tr_chars_benchmark
  294. [ 60%] Built target example_datasets_tr_icdar
  295. [ 60%] Built target example_datasets_tr_icdar_benchmark
  296. [ 60%] Built target example_datasets_tr_svt
  297. [ 60%] Built target example_datasets_tr_svt_benchmark
  298. [ 60%] Built target example_datasets_track_vot
  299. [ 60%] Generating src/org/opencv/core/Core.java
  300. [ 60%] Generating src/org/opencv/core/Algorithm.java
  301. [ 60%] Generating src/org/opencv/imgproc/LineSegmentDetector.java
  302. [ 60%] Generating src/org/opencv/imgproc/Imgproc.java
  303. [ 60%] Generating src/org/opencv/imgproc/Subdiv2D.java
  304. [ 60%] Generating src/org/opencv/imgproc/CLAHE.java
  305. [ 60%] Generating src/org/opencv/ml/DTrees.java
  306. [ 60%] Generating src/org/opencv/ml/TrainData.java
  307. [ 60%] Generating src/org/opencv/ml/Ml.java
  308. [ 60%] Generating src/org/opencv/ml/RTrees.java
  309. [ 60%] Generating src/org/opencv/ml/StatModel.java
  310. [ 60%] Generating src/org/opencv/ml/ANN_MLP.java
  311. [ 60%] Generating src/org/opencv/ml/KNearest.java
  312. [ 60%] Generating src/org/opencv/ml/NormalBayesClassifier.java
  313. [ 60%] Generating src/org/opencv/ml/LogisticRegression.java
  314. [ 60%] Generating src/org/opencv/ml/EM.java
  315. [ 60%] Generating src/org/opencv/ml/SVM.java
  316. [ 61%] Generating src/org/opencv/ml/Boost.java
  317. [ 61%] Generating src/org/opencv/photo/MergeRobertson.java
  318. [ 61%] Generating src/org/opencv/photo/MergeExposures.java
  319. [ 61%] Generating src/org/opencv/photo/TonemapDurand.java
  320. [ 61%] Generating src/org/opencv/photo/CalibrateRobertson.java
  321. [ 61%] Generating src/org/opencv/photo/AlignExposures.java
  322. [ 61%] Generating src/org/opencv/photo/CalibrateDebevec.java
  323. [ 61%] Generating src/org/opencv/photo/TonemapReinhard.java
  324. [ 61%] Generating src/org/opencv/photo/MergeDebevec.java
  325. [ 61%] Generating src/org/opencv/photo/MergeMertens.java
  326. [ 61%] Generating src/org/opencv/photo/TonemapDrago.java
  327. [ 61%] Generating src/org/opencv/photo/AlignMTB.java
  328. [ 61%] Generating src/org/opencv/photo/Tonemap.java
  329. [ 61%] Generating src/org/opencv/photo/TonemapMantiuk.java
  330. [ 61%] Generating src/org/opencv/photo/Photo.java
  331. [ 61%] Generating src/org/opencv/photo/CalibrateCRF.java
  332. [ 61%] Generating src/org/opencv/video/BackgroundSubtractorMOG2.java
  333. [ 61%] Generating src/org/opencv/video/KalmanFilter.java
  334. [ 61%] Generating src/org/opencv/video/DualTVL1OpticalFlow.java
  335. [ 61%] Generating src/org/opencv/video/Video.java
  336. [ 61%] Generating src/org/opencv/video/BackgroundSubtractor.java
  337. [ 61%] Generating src/org/opencv/video/DenseOpticalFlow.java
  338. [ 61%] Generating src/org/opencv/video/BackgroundSubtractorKNN.java
  339. [ 61%] Generating src/org/opencv/imgcodecs/Imgcodecs.java
  340. [ 61%] Generating src/org/opencv/videoio/Videoio.java
  341. [ 63%] Generating src/org/opencv/videoio/VideoCapture.java
  342. [ 63%] Generating src/org/opencv/videoio/VideoWriter.java
  343. [ 63%] Generating src/org/opencv/objdetect/BaseCascadeClassifier.java
  344. [ 63%] Generating src/org/opencv/objdetect/CascadeClassifier.java
  345. [ 63%] Generating src/org/opencv/objdetect/Objdetect.java
  346. [ 63%] Generating src/org/opencv/objdetect/HOGDescriptor.java
  347. [ 63%] Generating src/org/opencv/bioinspired/RetinaFastToneMapping.java
  348. [ 63%] Generating src/org/opencv/bioinspired/TransientAreasSegmentationModule.java
  349. [ 63%] Generating src/org/opencv/bioinspired/Retina.java
  350. [ 63%] Generating src/org/opencv/bioinspired/Bioinspired.java
  351. [ 63%] Generating src/org/opencv/features2d/DescriptorMatcher.java
  352. [ 63%] Generating src/org/opencv/features2d/FeatureDetector.java
  353. [ 63%] Generating src/org/opencv/features2d/Features2d.java
  354. [ 63%] Generating src/org/opencv/features2d/DescriptorExtractor.java
  355. [ 63%] Generating src/org/opencv/calib3d/Calib3d.java
  356. [ 63%] Generating src/org/opencv/calib3d/StereoSGBM.java
  357. [ 63%] Generating src/org/opencv/calib3d/StereoBM.java
  358. [ 63%] Generating src/org/opencv/calib3d/StereoMatcher.java
  359. [ 63%] Generating src/org/opencv/utils/Converters.java
  360. [ 63%] Generating src/org/opencv/core/MatOfPoint2f.java
  361. [ 63%] Generating src/org/opencv/core/Mat.java
  362. [ 63%] Generating src/org/opencv/core/Point.java
  363. [ 63%] Generating src/org/opencv/core/Range.java
  364. [ 63%] Generating src/org/opencv/core/MatOfRect.java
  365. [ 63%] Generating src/org/opencv/core/MatOfKeyPoint.java
  366. [ 64%] Generating src/org/opencv/core/Rect.java
  367. [ 64%] Generating src/org/opencv/core/CvException.java
  368. [ 64%] Generating src/org/opencv/core/MatOfPoint3f.java
  369. [ 64%] Generating src/org/opencv/core/MatOfPoint.java
  370. [ 64%] Generating src/org/opencv/core/MatOfDouble.java
  371. [ 64%] Generating src/org/opencv/core/MatOfFloat.java
  372. [ 64%] Generating src/org/opencv/core/RotatedRect.java
  373. [ 64%] Generating src/org/opencv/core/MatOfInt4.java
  374. [ 64%] Generating src/org/opencv/core/Point3.java
  375. [ 64%] Generating src/org/opencv/core/MatOfByte.java
  376. [ 64%] Generating src/org/opencv/core/MatOfDMatch.java
  377. [ 64%] Generating src/org/opencv/core/CvType.java
  378. [ 64%] Generating src/org/opencv/core/Size.java
  379. [ 64%] Generating src/org/opencv/core/DMatch.java
  380. [ 64%] Generating src/org/opencv/core/MatOfFloat6.java
  381. [ 64%] Generating src/org/opencv/core/KeyPoint.java
  382. [ 64%] Generating src/org/opencv/core/TermCriteria.java
  383. [ 64%] Generating src/org/opencv/core/Scalar.java
  384. [ 64%] Generating src/org/opencv/core/MatOfPoint3.java
  385. [ 64%] Generating src/org/opencv/core/MatOfFloat4.java
  386. [ 64%] Generating src/org/opencv/core/MatOfInt.java
  387. [ 64%] Generating src/org/opencv/imgproc/Moments.java
  388. [ 64%] Generating opencv-310.jar
  389.  
  390. BUILD SUCCESSFUL
  391. Total time: 14 seconds
  392. [ 67%] Built target opencv_java
  393. [ 67%] Built target opencv_test_java_properties
  394. [ 67%] Copying the OpenCV jar
  395. [ 67%] Build Java tests
  396. Buildfile: /root/OpenCV/build/modules/java/pure_test/.build/build.xml
  397.  
  398. build:
  399.  
  400. compile:
  401.     [javac] Compiling 2 source files to /root/OpenCV/build/modules/java/pure_test/.build/build/classes
  402.  
  403. jar:
  404.       [jar] Building jar: /root/OpenCV/build/modules/java/pure_test/.build/build/jar/opencv-test.jar
  405.  
  406. BUILD SUCCESSFUL
  407. Total time: 3 seconds
  408. [ 72%] Built target opencv_test_java
  409. [ 72%] Built target opencv_rgbd_pch_dephelp
  410. [ 72%] Built target pch_Generate_opencv_rgbd
  411. [ 72%] Built target opencv_rgbd
  412. [ 73%] Built target example_rgbd_linemod
  413. [ 73%] Built target example_rgbd_odometry_evaluation
  414. [ 73%] Built target opencv_test_rgbd_pch_dephelp
  415. [ 73%] Built target pch_Generate_opencv_test_rgbd
  416. [ 73%] Built target opencv_test_rgbd
  417. [ 75%] Built target opencv_stereo_pch_dephelp
  418. [ 75%] Built target pch_Generate_opencv_stereo
  419. [ 75%] Built target opencv_stereo
  420. [ 75%] Built target example_stereo_sample
  421. [ 75%] Built target opencv_perf_stereo_pch_dephelp
  422. [ 75%] Built target pch_Generate_opencv_perf_stereo
  423. [ 75%] Built target opencv_perf_stereo
  424. [ 75%] Built target opencv_test_stereo_pch_dephelp
  425. [ 75%] Built target pch_Generate_opencv_test_stereo
  426. [ 75%] Built target opencv_test_stereo
  427. [ 75%] Built target opencv_structured_light_pch_dephelp
  428. [ 75%] Built target pch_Generate_opencv_structured_light
  429. [ 75%] Built target opencv_structured_light
  430. [ 75%] Built target example_structured_light_cap_pattern
  431. [ 75%] Built target example_structured_light_pointcloud
  432. [ 75%] Built target opencv_test_structured_light_pch_dephelp
  433. [ 75%] Built target pch_Generate_opencv_test_structured_light
  434. [ 75%] Built target opencv_test_structured_light
  435. [ 75%] Built target opencv_tracking_pch_dephelp
  436. [ 75%] Built target pch_Generate_opencv_tracking
  437. [ 76%] Built target opencv_tracking
  438. [ 76%] Built target example_tracking_benchmark
  439. [ 76%] Built target example_tracking_kcf
  440. [ 76%] Built target example_tracking_multiTracker_dataset
  441. [ 76%] Built target example_tracking_multitracker
  442. [ 76%] Built target example_tracking_tracker
  443. [ 76%] Built target example_tracking_tracker_dataset
  444. [ 76%] Built target example_tracking_tutorial_customizing_cn_tracker
  445. [ 76%] Built target example_tracking_tutorial_introduction_to_tracker
  446. [ 76%] Built target example_tracking_tutorial_multitracker
  447. [ 78%] Built target opencv_perf_tracking_pch_dephelp
  448. [ 78%] Built target pch_Generate_opencv_perf_tracking
  449. [ 78%] Built target opencv_perf_tracking
  450. [ 78%] Built target opencv_test_tracking_pch_dephelp
  451. [ 78%] Built target pch_Generate_opencv_test_tracking
  452. [ 79%] Built target opencv_test_tracking
  453. [ 79%] Built target opencv_videostab_pch_dephelp
  454. [ 80%] Built target pch_Generate_opencv_videostab
  455. [ 80%] Built target opencv_videostab
  456. [ 80%] Built target opencv_xfeatures2d_pch_dephelp
  457. [ 80%] Built target pch_Generate_opencv_xfeatures2d
  458. [ 82%] Built target opencv_xfeatures2d
  459. [ 82%] Built target example_xfeatures2d_bagofwords_classification
  460. [ 82%] Built target example_xfeatures2d_shape_transformation
  461. [ 83%] Built target example_xfeatures2d_surf_matcher
  462. [ 83%] Built target example_xfeatures2d_video_homography
  463. [ 84%] Built target opencv_perf_xfeatures2d_pch_dephelp
  464. [ 84%] Built target pch_Generate_opencv_perf_xfeatures2d
  465. [ 84%] Built target opencv_perf_xfeatures2d
  466. [ 84%] Built target opencv_test_xfeatures2d_pch_dephelp
  467. [ 84%] Built target pch_Generate_opencv_test_xfeatures2d
  468. [ 84%] Built target opencv_test_xfeatures2d
  469. [ 84%] Built target opencv_ximgproc_pch_dephelp
  470. [ 84%] Built target pch_Generate_opencv_ximgproc
  471. [ 86%] Built target opencv_ximgproc
  472. [ 86%] Built target example_ximgproc_disparity_filtering
  473. [ 86%] Built target example_ximgproc_fast_hough_transform
  474. [ 86%] Built target example_ximgproc_live_demo
  475. [ 86%] Built target example_ximgproc_niblack_thresholding
  476. [ 86%] Built target example_ximgproc_seeds
  477. [ 86%] Built target example_ximgproc_structured_edge_detection
  478. [ 86%] Built target opencv_perf_ximgproc_pch_dephelp
  479. [ 87%] Built target pch_Generate_opencv_perf_ximgproc
  480. [ 87%] Built target opencv_perf_ximgproc
  481. [ 87%] Built target opencv_test_ximgproc_pch_dephelp
  482. [ 87%] Built target pch_Generate_opencv_test_ximgproc
  483. [ 89%] Built target opencv_test_ximgproc
  484. [ 89%] Built target opencv_aruco_pch_dephelp
  485. [ 90%] Built target pch_Generate_opencv_aruco
  486. [ 90%] Built target opencv_aruco
  487. [ 90%] Built target example_aruco_calibrate_camera
  488. [ 90%] Built target example_aruco_calibrate_camera_charuco
  489. [ 90%] Built target example_aruco_create_board
  490. [ 90%] Built target example_aruco_create_board_charuco
  491. [ 90%] Built target example_aruco_create_diamond
  492. [ 91%] Built target example_aruco_create_marker
  493. [ 91%] Built target example_aruco_detect_board
  494. [ 91%] Built target example_aruco_detect_board_charuco
  495. [ 91%] Built target example_aruco_detect_diamonds
  496. [ 91%] Built target example_aruco_detect_markers
  497. [ 91%] Built target opencv_test_aruco_pch_dephelp
  498. [ 91%] Built target pch_Generate_opencv_test_aruco
  499. [ 91%] Built target opencv_test_aruco
  500. [ 91%] Built target opencv_optflow_pch_dephelp
  501. [ 91%] Built target pch_Generate_opencv_optflow
  502. [ 93%] Built target opencv_optflow
  503. [ 93%] Built target example_optflow_motempl
  504. [ 93%] Built target example_optflow_optical_flow_evaluation
  505. [ 93%] Built target example_optflow_simpleflow_demo
  506. [ 93%] Built target opencv_test_optflow_pch_dephelp
  507. [ 93%] Built target pch_Generate_opencv_test_optflow
  508. [ 93%] Built target opencv_test_optflow
  509. [ 93%] Built target opencv_perf_stitching_pch_dephelp
  510. [ 93%] Built target pch_Generate_opencv_perf_stitching
  511. [ 93%] Built target opencv_stitching_pch_dephelp
  512. [ 93%] Built target pch_Generate_opencv_stitching
  513. [ 93%] Built target opencv_stitching
  514. [ 93%] Built target opencv_perf_stitching
  515. [ 93%] Built target opencv_test_stitching_pch_dephelp
  516. [ 93%] Built target pch_Generate_opencv_test_stitching
  517. [ 93%] Built target opencv_test_stitching
  518. [ 93%] Generating pyopencv_generated_include.h, pyopencv_generated_funcs.h, pyopencv_generated_types.h, pyopencv_generated_type_reg.h, pyopencv_generated_ns_reg.h
  519. Scanning dependencies of target opencv_python2
  520. [ 93%] Building CXX object modules/python2/CMakeFiles/opencv_python2.dir/__/src2/cv2.cpp.o                                                      
  521. Linking CXX shared module ../../lib/cv2.so
  522. [ 93%] Built target opencv_python2
  523. [ 93%] Generating pyopencv_generated_include.h, pyopencv_generated_funcs.h, pyopencv_generated_types.h, pyopencv_generated_type_reg.h, pyopencv_generated_ns_reg.h
  524. Scanning dependencies of target opencv_python3
  525. [ 93%] Building CXX object modules/python3/CMakeFiles/opencv_python3.dir/__/src2/cv2.cpp.o                                                      
  526. Linking CXX shared module ../../lib/python3/cv2.cpython-34m.so
  527. [ 93%] Built target opencv_python3
  528. Linking CXX executable ../../bin/opencv_traincascade
  529. [ 94%] Built target opencv_traincascade
  530. Linking CXX executable ../../bin/opencv_createsamples
  531. [ 94%] Built target opencv_createsamples
  532. Linking CXX executable ../../bin/opencv_annotation
  533. [ 94%] Built target opencv_annotation
  534. Scanning dependencies of target cpp-tutorial-pnp_detection
  535. [ 94%] Building CXX object samples/cpp/CMakeFiles/cpp-tutorial-pnp_detection.dir/tutorial_code/calib3d/real_time_pose_estimation/src/main_detection.cpp.o                                                              
  536. [ 94%] Building CXX object samples/cpp/CMakeFiles/cpp-tutorial-pnp_detection.dir/tutorial_code/calib3d/real_time_pose_estimation/src/CsvReader.cpp.o                                                                    
  537. [ 94%] Building CXX object samples/cpp/CMakeFiles/cpp-tutorial-pnp_detection.dir/tutorial_code/calib3d/real_time_pose_estimation/src/CsvWriter.cpp.o                                                                    
  538. [ 94%] Building CXX object samples/cpp/CMakeFiles/cpp-tutorial-pnp_detection.dir/tutorial_code/calib3d/real_time_pose_estimation/src/ModelRegistration.cpp.o                                                            
  539. [ 94%] Building CXX object samples/cpp/CMakeFiles/cpp-tutorial-pnp_detection.dir/tutorial_code/calib3d/real_time_pose_estimation/src/Mesh.cpp.o
  540. [ 94%] Building CXX object samples/cpp/CMakeFiles/cpp-tutorial-pnp_detection.dir/tutorial_code/calib3d/real_time_pose_estimation/src/Model.cpp.o
  541. [ 94%] Building CXX object samples/cpp/CMakeFiles/cpp-tutorial-pnp_detection.dir/tutorial_code/calib3d/real_time_pose_estimation/src/PnPProblem.cpp.o                                                                  
  542. [ 94%] Building CXX object samples/cpp/CMakeFiles/cpp-tutorial-pnp_detection.dir/tutorial_code/calib3d/real_time_pose_estimation/src/Utils.cpp.o
  543. [ 94%] Building CXX object samples/cpp/CMakeFiles/cpp-tutorial-pnp_detection.dir/tutorial_code/calib3d/real_time_pose_estimation/src/RobustMatcher.cpp.o                                                                
  544. Linking CXX executable ../../bin/cpp-tutorial-pnp_detection
  545. [ 94%] Built target cpp-tutorial-pnp_detection
  546. Scanning dependencies of target cpp-tutorial-pnp_registration
  547. [ 94%] Building CXX object samples/cpp/CMakeFiles/cpp-tutorial-pnp_registration.dir/tutorial_code/calib3d/real_time_pose_estimation/src/main_registration.cpp.o                                                        
  548. [ 94%] Building CXX object samples/cpp/CMakeFiles/cpp-tutorial-pnp_registration.dir/tutorial_code/calib3d/real_time_pose_estimation/src/CsvReader.cpp.o                                                                
  549. [ 94%] Building CXX object samples/cpp/CMakeFiles/cpp-tutorial-pnp_registration.dir/tutorial_code/calib3d/real_time_pose_estimation/src/CsvWriter.cpp.o                                                                
  550. [ 94%] Building CXX object samples/cpp/CMakeFiles/cpp-tutorial-pnp_registration.dir/tutorial_code/calib3d/real_time_pose_estimation/src/ModelRegistration.cpp.o                                                        
  551. [ 94%] Building CXX object samples/cpp/CMakeFiles/cpp-tutorial-pnp_registration.dir/tutorial_code/calib3d/real_time_pose_estimation/src/Mesh.cpp.o                                                                      
  552. [ 94%] Building CXX object samples/cpp/CMakeFiles/cpp-tutorial-pnp_registration.dir/tutorial_code/calib3d/real_time_pose_estimation/src/Model.cpp.o                                                                    
  553. [ 94%] Building CXX object samples/cpp/CMakeFiles/cpp-tutorial-pnp_registration.dir/tutorial_code/calib3d/real_time_pose_estimation/src/PnPProblem.cpp.o                                                                
  554. [ 94%] Building CXX object samples/cpp/CMakeFiles/cpp-tutorial-pnp_registration.dir/tutorial_code/calib3d/real_time_pose_estimation/src/Utils.cpp.o                                                                    
  555. [ 94%] Building CXX object samples/cpp/CMakeFiles/cpp-tutorial-pnp_registration.dir/tutorial_code/calib3d/real_time_pose_estimation/src/RobustMatcher.cpp.o                                                            
  556. Linking CXX executable ../../bin/cpp-tutorial-pnp_registration
  557. [ 94%] Built target cpp-tutorial-pnp_registration
  558. Scanning dependencies of target example_3calibration
  559. [ 94%] Building CXX object samples/cpp/CMakeFiles/example_3calibration.dir/3calibration.cpp.o                                                  
  560. Linking CXX executable ../../bin/cpp-example-3calibration
  561. [ 94%] Built target example_3calibration
  562. Scanning dependencies of target example_autofocus
  563. [ 94%] Building CXX object samples/cpp/CMakeFiles/example_autofocus.dir/autofocus.cpp.o                                                        
  564. Linking CXX executable ../../bin/cpp-example-autofocus
  565. [ 94%] Built target example_autofocus
  566. Scanning dependencies of target example_bgfg_segm
  567. [ 94%] Building CXX object samples/cpp/CMakeFiles/example_bgfg_segm.dir/bgfg_segm.cpp.o                                                        
  568. Linking CXX executable ../../bin/cpp-example-bgfg_segm
  569. [ 94%] Built target example_bgfg_segm
  570. Scanning dependencies of target example_calibration
  571. [ 94%] Building CXX object samples/cpp/CMakeFiles/example_calibration.dir/calibration.cpp.o                                                    
  572. Linking CXX executable ../../bin/cpp-example-calibration
  573. [ 94%] Built target example_calibration
  574. Scanning dependencies of target example_camshiftdemo
  575. [ 94%] Building CXX object samples/cpp/CMakeFiles/example_camshiftdemo.dir/camshiftdemo.cpp.o                                                  
  576. Linking CXX executable ../../bin/cpp-example-camshiftdemo
  577. [ 94%] Built target example_camshiftdemo
  578. Scanning dependencies of target example_cloning_demo
  579. [ 94%] Building CXX object samples/cpp/CMakeFiles/example_cloning_demo.dir/cloning_demo.cpp.o                                                  
  580. Linking CXX executable ../../bin/cpp-example-cloning_demo
  581. [ 94%] Built target example_cloning_demo
  582. Scanning dependencies of target example_cloning_gui
  583. [ 94%] Building CXX object samples/cpp/CMakeFiles/example_cloning_gui.dir/cloning_gui.cpp.o                                                    
  584. Linking CXX executable ../../bin/cpp-example-cloning_gui
  585. [ 94%] Built target example_cloning_gui
  586. Scanning dependencies of target example_connected_components
  587. [ 94%] Building CXX object samples/cpp/CMakeFiles/example_connected_components.dir/connected_components.cpp.o                                  
  588. Linking CXX executable ../../bin/cpp-example-connected_components
  589. [ 94%] Built target example_connected_components
  590. Scanning dependencies of target example_contours2
  591. [ 94%] Building CXX object samples/cpp/CMakeFiles/example_contours2.dir/contours2.cpp.o                                                        
  592. Linking CXX executable ../../bin/cpp-example-contours2
  593. [ 94%] Built target example_contours2
  594. Scanning dependencies of target example_convexhull
  595. [ 94%] Building CXX object samples/cpp/CMakeFiles/example_convexhull.dir/convexhull.cpp.o                                                      
  596. Linking CXX executable ../../bin/cpp-example-convexhull
  597. [ 94%] Built target example_convexhull
  598. Scanning dependencies of target example_cout_mat
  599. [ 94%] Building CXX object samples/cpp/CMakeFiles/example_cout_mat.dir/cout_mat.cpp.o                                                          
  600. Linking CXX executable ../../bin/cpp-example-cout_mat
  601. [ 94%] Built target example_cout_mat
  602. Scanning dependencies of target example_create_mask
  603. [ 94%] Building CXX object samples/cpp/CMakeFiles/example_create_mask.dir/create_mask.cpp.o                                                    
  604. Linking CXX executable ../../bin/cpp-example-create_mask
  605. [ 94%] Built target example_create_mask
  606. Scanning dependencies of target example_dbt_face_detection
  607. [ 94%] Building CXX object samples/cpp/CMakeFiles/example_dbt_face_detection.dir/dbt_face_detection.cpp.o                                      
  608. Linking CXX executable ../../bin/cpp-example-dbt_face_detection
  609. [ 94%] Built target example_dbt_face_detection
  610. Scanning dependencies of target example_delaunay2
  611. [ 94%] Building CXX object samples/cpp/CMakeFiles/example_delaunay2.dir/delaunay2.cpp.o                                                        
  612. Linking CXX executable ../../bin/cpp-example-delaunay2
  613. [ 94%] Built target example_delaunay2
  614. Scanning dependencies of target example_demhist
  615. [ 94%] Building CXX object samples/cpp/CMakeFiles/example_demhist.dir/demhist.cpp.o                                                            
  616. Linking CXX executable ../../bin/cpp-example-demhist
  617. [ 94%] Built target example_demhist
  618. Scanning dependencies of target example_detect_blob
  619. [ 94%] Building CXX object samples/cpp/CMakeFiles/example_detect_blob.dir/detect_blob.cpp.o                                                    
  620. Linking CXX executable ../../bin/cpp-example-detect_blob
  621. [ 94%] Built target example_detect_blob
  622. Scanning dependencies of target example_detect_mser
  623. [ 94%] Building CXX object samples/cpp/CMakeFiles/example_detect_mser.dir/detect_mser.cpp.o                                                    
  624. Linking CXX executable ../../bin/cpp-example-detect_mser
  625. [ 94%] Built target example_detect_mser
  626. Scanning dependencies of target example_dft
  627. [ 94%] Building CXX object samples/cpp/CMakeFiles/example_dft.dir/dft.cpp.o                                                                    
  628. Linking CXX executable ../../bin/cpp-example-dft
  629. [ 94%] Built target example_dft
  630. Scanning dependencies of target example_distrans
  631. [ 94%] Building CXX object samples/cpp/CMakeFiles/example_distrans.dir/distrans.cpp.o                                                          
  632. Linking CXX executable ../../bin/cpp-example-distrans
  633. [ 94%] Built target example_distrans
  634. Scanning dependencies of target example_drawing
  635. [ 94%] Building CXX object samples/cpp/CMakeFiles/example_drawing.dir/drawing.cpp.o                                                            
  636. Linking CXX executable ../../bin/cpp-example-drawing
  637. [ 94%] Built target example_drawing
  638. Scanning dependencies of target example_edge
  639. [ 94%] Building CXX object samples/cpp/CMakeFiles/example_edge.dir/edge.cpp.o                                                                  
  640. Linking CXX executable ../../bin/cpp-example-edge
  641. [ 94%] Built target example_edge
  642. Scanning dependencies of target example_em
  643. [ 94%] Building CXX object samples/cpp/CMakeFiles/example_em.dir/em.cpp.o                                                                      
  644. Linking CXX executable ../../bin/cpp-example-em
  645. [ 94%] Built target example_em
  646. Scanning dependencies of target example_example
  647. [ 94%] Building CXX object samples/cpp/CMakeFiles/example_example.dir/example_cmake/example.cpp.o                                              
  648. Linking CXX executable ../../bin/cpp-example-example
  649. [ 94%] Built target example_example
  650. Scanning dependencies of target example_facedetect
  651. [ 94%] Building CXX object samples/cpp/CMakeFiles/example_facedetect.dir/facedetect.cpp.o                                                      
  652. Linking CXX executable ../../bin/cpp-example-facedetect
  653. [ 94%] Built target example_facedetect
  654. Scanning dependencies of target example_facial_features
  655. [ 94%] Building CXX object samples/cpp/CMakeFiles/example_facial_features.dir/facial_features.cpp.o                                            
  656. Linking CXX executable ../../bin/cpp-example-facial_features
  657. [ 94%] Built target example_facial_features
  658. Scanning dependencies of target example_fback
  659. [ 94%] Building CXX object samples/cpp/CMakeFiles/example_fback.dir/fback.cpp.o                                                                
  660. Linking CXX executable ../../bin/cpp-example-fback
  661. [ 94%] Built target example_fback
  662. Scanning dependencies of target example_ffilldemo
  663. [ 94%] Building CXX object samples/cpp/CMakeFiles/example_ffilldemo.dir/ffilldemo.cpp.o                                                        
  664. Linking CXX executable ../../bin/cpp-example-ffilldemo
  665. [ 94%] Built target example_ffilldemo
  666. Scanning dependencies of target example_filestorage
  667. [ 94%] Building CXX object samples/cpp/CMakeFiles/example_filestorage.dir/filestorage.cpp.o                                                    
  668. Linking CXX executable ../../bin/cpp-example-filestorage
  669. [ 94%] Built target example_filestorage
  670. Scanning dependencies of target example_fitellipse
  671. [ 94%] Building CXX object samples/cpp/CMakeFiles/example_fitellipse.dir/fitellipse.cpp.o                                                      
  672. Linking CXX executable ../../bin/cpp-example-fitellipse
  673. [ 94%] Built target example_fitellipse
  674. Scanning dependencies of target example_grabcut
  675. [ 94%] Building CXX object samples/cpp/CMakeFiles/example_grabcut.dir/grabcut.cpp.o                                                            
  676. Linking CXX executable ../../bin/cpp-example-grabcut
  677. [ 94%] Built target example_grabcut
  678. Scanning dependencies of target example_houghcircles
  679. [ 94%] Building CXX object samples/cpp/CMakeFiles/example_houghcircles.dir/houghcircles.cpp.o                                                  
  680. Linking CXX executable ../../bin/cpp-example-houghcircles
  681. [ 94%] Built target example_houghcircles
  682. Scanning dependencies of target example_houghlines
  683. [ 94%] Building CXX object samples/cpp/CMakeFiles/example_houghlines.dir/houghlines.cpp.o                                                      
  684. Linking CXX executable ../../bin/cpp-example-houghlines
  685. [ 94%] Built target example_houghlines
  686. Scanning dependencies of target example_image
  687. [ 94%] Building CXX object samples/cpp/CMakeFiles/example_image.dir/image.cpp.o                                                                
  688. Linking CXX executable ../../bin/cpp-example-image
  689. [ 94%] Built target example_image
  690. Scanning dependencies of target example_image_alignment
  691. [ 94%] Building CXX object samples/cpp/CMakeFiles/example_image_alignment.dir/image_alignment.cpp.o                                            
  692. Linking CXX executable ../../bin/cpp-example-image_alignment
  693. [ 94%] Built target example_image_alignment
  694. Scanning dependencies of target example_image_sequence
  695. [ 94%] Building CXX object samples/cpp/CMakeFiles/example_image_sequence.dir/image_sequence.cpp.o                                              
  696. Linking CXX executable ../../bin/cpp-example-image_sequence
  697. [ 94%] Built target example_image_sequence
  698. Scanning dependencies of target example_imagelist_creator
  699. [ 94%] Building CXX object samples/cpp/CMakeFiles/example_imagelist_creator.dir/imagelist_creator.cpp.o                                        
  700. Linking CXX executable ../../bin/cpp-example-imagelist_creator
  701. [ 94%] Built target example_imagelist_creator
  702. Scanning dependencies of target example_inpaint
  703. [ 94%] Building CXX object samples/cpp/CMakeFiles/example_inpaint.dir/inpaint.cpp.o                                                            
  704. Linking CXX executable ../../bin/cpp-example-inpaint
  705. [ 94%] Built target example_inpaint
  706. Scanning dependencies of target example_intelperc_capture
  707. [ 94%] Building CXX object samples/cpp/CMakeFiles/example_intelperc_capture.dir/intelperc_capture.cpp.o                                        
  708. Linking CXX executable ../../bin/cpp-example-intelperc_capture
  709. [ 94%] Built target example_intelperc_capture
  710. Scanning dependencies of target example_kalman
  711. [ 94%] Building CXX object samples/cpp/CMakeFiles/example_kalman.dir/kalman.cpp.o                                                              
  712. Linking CXX executable ../../bin/cpp-example-kalman
  713. [ 94%] Built target example_kalman
  714. Scanning dependencies of target example_kmeans
  715. [ 94%] Building CXX object samples/cpp/CMakeFiles/example_kmeans.dir/kmeans.cpp.o                                                              
  716. Linking CXX executable ../../bin/cpp-example-kmeans
  717. [ 94%] Built target example_kmeans
  718. Scanning dependencies of target example_laplace
  719. [ 94%] Building CXX object samples/cpp/CMakeFiles/example_laplace.dir/laplace.cpp.o                                                            
  720. Linking CXX executable ../../bin/cpp-example-laplace
  721. [ 94%] Built target example_laplace
  722. Scanning dependencies of target example_letter_recog
  723. [ 94%] Building CXX object samples/cpp/CMakeFiles/example_letter_recog.dir/letter_recog.cpp.o                                                  
  724. Linking CXX executable ../../bin/cpp-example-letter_recog
  725. [ 94%] Built target example_letter_recog
  726. Scanning dependencies of target example_lkdemo
  727. [ 94%] Building CXX object samples/cpp/CMakeFiles/example_lkdemo.dir/lkdemo.cpp.o                                                              
  728. Linking CXX executable ../../bin/cpp-example-lkdemo
  729. [ 94%] Built target example_lkdemo
  730. Scanning dependencies of target example_logistic_regression
  731. [ 94%] Building CXX object samples/cpp/CMakeFiles/example_logistic_regression.dir/logistic_regression.cpp.o                                    
  732. Linking CXX executable ../../bin/cpp-example-logistic_regression
  733. [ 94%] Built target example_logistic_regression
  734. Scanning dependencies of target example_lsd_lines
  735. [ 94%] Building CXX object samples/cpp/CMakeFiles/example_lsd_lines.dir/lsd_lines.cpp.o                                                        
  736. Linking CXX executable ../../bin/cpp-example-lsd_lines
  737. [ 94%] Built target example_lsd_lines
  738. Scanning dependencies of target example_mask_tmpl
  739. [ 94%] Building CXX object samples/cpp/CMakeFiles/example_mask_tmpl.dir/mask_tmpl.cpp.o                                                        
  740. Linking CXX executable ../../bin/cpp-example-mask_tmpl
  741. [ 94%] Built target example_mask_tmpl
  742. Scanning dependencies of target example_matchmethod_orb_akaze_brisk
  743. [ 94%] Building CXX object samples/cpp/CMakeFiles/example_matchmethod_orb_akaze_brisk.dir/matchmethod_orb_akaze_brisk.cpp.o                    
  744. Linking CXX executable ../../bin/cpp-example-matchmethod_orb_akaze_brisk
  745. [ 94%] Built target example_matchmethod_orb_akaze_brisk
  746. Scanning dependencies of target example_minarea
  747. [ 94%] Building CXX object samples/cpp/CMakeFiles/example_minarea.dir/minarea.cpp.o                                                            
  748. Linking CXX executable ../../bin/cpp-example-minarea
  749. [ 94%] Built target example_minarea
  750. Scanning dependencies of target example_morphology2
  751. [ 94%] Building CXX object samples/cpp/CMakeFiles/example_morphology2.dir/morphology2.cpp.o                                                    
  752. Linking CXX executable ../../bin/cpp-example-morphology2
  753. [ 94%] Built target example_morphology2
  754. Scanning dependencies of target example_npr_demo
  755. [ 94%] Building CXX object samples/cpp/CMakeFiles/example_npr_demo.dir/npr_demo.cpp.o                                                          
  756. Linking CXX executable ../../bin/cpp-example-npr_demo
  757. [ 94%] Built target example_npr_demo
  758. Scanning dependencies of target example_opencv_version
  759. [ 94%] Building CXX object samples/cpp/CMakeFiles/example_opencv_version.dir/opencv_version.cpp.o                                              
  760. Linking CXX executable ../../bin/cpp-example-opencv_version
  761. [ 94%] Built target example_opencv_version
  762. Scanning dependencies of target example_openni_capture
  763. [ 94%] Building CXX object samples/cpp/CMakeFiles/example_openni_capture.dir/openni_capture.cpp.o                                              
  764. Linking CXX executable ../../bin/cpp-example-openni_capture
  765. [ 94%] Built target example_openni_capture
  766. Scanning dependencies of target example_pca
  767. [ 94%] Building CXX object samples/cpp/CMakeFiles/example_pca.dir/pca.cpp.o                                                                    
  768. Linking CXX executable ../../bin/cpp-example-pca
  769. [ 94%] Built target example_pca
  770. Scanning dependencies of target example_phase_corr
  771. [ 94%] Building CXX object samples/cpp/CMakeFiles/example_phase_corr.dir/phase_corr.cpp.o                                                      
  772. Linking CXX executable ../../bin/cpp-example-phase_corr
  773. [ 94%] Built target example_phase_corr
  774. Scanning dependencies of target example_points_classifier
  775. [ 94%] Building CXX object samples/cpp/CMakeFiles/example_points_classifier.dir/points_classifier.cpp.o                                        
  776. Linking CXX executable ../../bin/cpp-example-points_classifier
  777. [ 94%] Built target example_points_classifier
  778. Scanning dependencies of target example_polar_transforms
  779. [ 94%] Building CXX object samples/cpp/CMakeFiles/example_polar_transforms.dir/polar_transforms.cpp.o                                          
  780. Linking CXX executable ../../bin/cpp-example-polar_transforms
  781. [ 94%] Built target example_polar_transforms
  782. Scanning dependencies of target example_segment_objects
  783. [ 94%] Building CXX object samples/cpp/CMakeFiles/example_segment_objects.dir/segment_objects.cpp.o                                            
  784. Linking CXX executable ../../bin/cpp-example-segment_objects
  785. [ 94%] Built target example_segment_objects
  786. Scanning dependencies of target example_select3dobj
  787. [ 94%] Building CXX object samples/cpp/CMakeFiles/example_select3dobj.dir/select3dobj.cpp.o                                                    
  788. Linking CXX executable ../../bin/cpp-example-select3dobj
  789. [ 94%] Built target example_select3dobj
  790. Scanning dependencies of target example_shape_example
  791. [ 94%] Building CXX object samples/cpp/CMakeFiles/example_shape_example.dir/shape_example.cpp.o                                                
  792. Linking CXX executable ../../bin/cpp-example-shape_example
  793. [ 94%] Built target example_shape_example
  794. Scanning dependencies of target example_smiledetect
  795. [ 94%] Building CXX object samples/cpp/CMakeFiles/example_smiledetect.dir/smiledetect.cpp.o                                                    
  796. Linking CXX executable ../../bin/cpp-example-smiledetect
  797. [ 94%] Built target example_smiledetect
  798. Scanning dependencies of target example_squares
  799. [ 94%] Building CXX object samples/cpp/CMakeFiles/example_squares.dir/squares.cpp.o                                                            
  800. Linking CXX executable ../../bin/cpp-example-squares
  801. [ 94%] Built target example_squares
  802. Scanning dependencies of target example_starter_imagelist
  803. [ 94%] Building CXX object samples/cpp/CMakeFiles/example_starter_imagelist.dir/starter_imagelist.cpp.o                                        
  804. Linking CXX executable ../../bin/cpp-example-starter_imagelist
  805. [ 94%] Built target example_starter_imagelist
  806. Scanning dependencies of target example_starter_video
  807. [ 94%] Building CXX object samples/cpp/CMakeFiles/example_starter_video.dir/starter_video.cpp.o                                                
  808. Linking CXX executable ../../bin/cpp-example-starter_video
  809. [ 94%] Built target example_starter_video
  810. Scanning dependencies of target example_stereo_calib
  811. [ 94%] Building CXX object samples/cpp/CMakeFiles/example_stereo_calib.dir/stereo_calib.cpp.o                                                  
  812. Linking CXX executable ../../bin/cpp-example-stereo_calib
  813. [ 94%] Built target example_stereo_calib
  814. Scanning dependencies of target example_stereo_match
  815. [ 94%] Building CXX object samples/cpp/CMakeFiles/example_stereo_match.dir/stereo_match.cpp.o                                                  
  816. Linking CXX executable ../../bin/cpp-example-stereo_match
  817. [ 94%] Built target example_stereo_match
  818. Scanning dependencies of target example_stitching
  819. [ 94%] Building CXX object samples/cpp/CMakeFiles/example_stitching.dir/stitching.cpp.o                                                        
  820. Linking CXX executable ../../bin/cpp-example-stitching
  821. [ 94%] Built target example_stitching
  822. Scanning dependencies of target example_stitching_detailed
  823. [ 94%] Building CXX object samples/cpp/CMakeFiles/example_stitching_detailed.dir/stitching_detailed.cpp.o                                      
  824. Linking CXX executable ../../bin/cpp-example-stitching_detailed
  825. CMakeFiles/example_stitching_detailed.dir/stitching_detailed.cpp.o: In function `main':
  826. stitching_detailed.cpp:(.text.startup.main+0x19b2): undefined reference to `cv::detail::SurfFeaturesFinderGpu::SurfFeaturesFinderGpu(double, int, int, int, int)'
  827. collect2: error: ld returned 1 exit status
  828. samples/cpp/CMakeFiles/example_stitching_detailed.dir/build.make:174: recipe for target 'bin/cpp-example-stitching_detailed' failed
  829. make[2]: *** [bin/cpp-example-stitching_detailed] Error 1
  830. CMakeFiles/Makefile2:25810: recipe for target 'samples/cpp/CMakeFiles/example_stitching_detailed.dir/all' failed
  831. make[1]: *** [samples/cpp/CMakeFiles/example_stitching_detailed.dir/all] Error 2
  832. Makefile:147: recipe for target 'all' failed
  833. make: *** [all] Error 2
RAW Paste Data
We use cookies for various purposes including analytics. By continuing to use Pastebin, you agree to our use of cookies as described in the Cookies Policy. OK, I Understand
Top