SHARE
TWEET

Untitled

a guest Nov 22nd, 2019 114 Never
Not a member of Pastebin yet? Sign Up, it unlocks many cool features!
  1. Leos-MBP:build silentstorm$ make -j6
  2. [  0%] Built target Detour
  3. [  0%] Built target gsoap
  4. [  3%] Built target Recast
  5. [  3%] Built target fmt
  6. [  7%] Built target g3dlib
  7. [ 12%] Built target common
  8. [ 12%] Built target revision.h
  9. [ 13%] Built target shared
  10. make[2]: *** No rule to make target `/usr/local/opt/openssl/lib/libssl.dylib', needed by `src/server/authserver/authserver'.  Stop.
  11. make[1]: *** [src/server/authserver/CMakeFiles/authserver.dir/all] Error 2
  12. make[1]: *** Waiting for unfinished jobs....
  13. [ 36%] Built target game
  14. [ 36%] Building CXX object src/server/scripts/CMakeFiles/scripts.dir/Northrend/DraktharonKeep/boss_novos.cpp.o
  15. /Users/silentstorm/azerothcore-wotlk/src/server/scripts/Northrend/DraktharonKeep/boss_novos.cpp:57:65: error: no matching constructor for initialization of
  16.       'const std::unordered_map<uint32, std::tuple<uint32, Position> >' (aka 'const unordered_map<unsigned int, tuple<unsigned int, Position> >')
  17. std::unordered_map<uint32, std::tuple <uint32, Position>> const npcSummon =
  18.                                                                 ^
  19. /Library/Developer/CommandLineTools/usr/bin/../include/c++/v1/unordered_map:806:14: note: candidate constructor not viable: cannot convert initializer list argument to 'size_type'
  20.       (aka 'unsigned long')
  21.     explicit unordered_map(size_type __n, const hasher& __hf = hasher(),
  22.              ^
  23. /Library/Developer/CommandLineTools/usr/bin/../include/c++/v1/unordered_map:832:5: note: candidate constructor not viable: no known conversion from 'Misc' to 'std::__1::pair<const unsigned int,
  24.       std::__1::tuple<unsigned int, Position> >' for 1st argument
  25.     unordered_map(initializer_list<value_type> __il, size_type __n,
  26.     ^
  27. /Library/Developer/CommandLineTools/usr/bin/../include/c++/v1/unordered_map:843:5: note: candidate constructor not viable: cannot convert initializer list argument to 'size_type'
  28.       (aka 'unsigned long')
  29.     unordered_map(size_type __n, const hasher& __hf, const allocator_type& __a)
  30.     ^
  31. /Library/Developer/CommandLineTools/usr/bin/../include/c++/v1/unordered_map:855:5: note: candidate constructor not viable: no known conversion from 'Misc' to 'std::__1::pair<const unsigned int,
  32.       std::__1::tuple<unsigned int, Position> >' for 1st argument
  33.     unordered_map(initializer_list<value_type> __il, size_type __n, const allocator_type& __a)
  34.     ^
  35. /Library/Developer/CommandLineTools/usr/bin/../include/c++/v1/unordered_map:814:9: note: candidate template ignored: couldn't infer template argument '_InputIterator'
  36.         unordered_map(_InputIterator __first, _InputIterator __last,
  37.         ^
  38. /Library/Developer/CommandLineTools/usr/bin/../include/c++/v1/unordered_map:812:9: note: candidate constructor template not viable: requires 2 arguments, but 3 were provided
  39.         unordered_map(_InputIterator __first, _InputIterator __last);
  40.         ^
  41. /Library/Developer/CommandLineTools/usr/bin/../include/c++/v1/unordered_map:818:9: note: candidate constructor template not viable: requires 6 arguments, but 3 were provided
  42.         unordered_map(_InputIterator __first, _InputIterator __last,
  43.         ^
  44. /Library/Developer/CommandLineTools/usr/bin/../include/c++/v1/unordered_map:847:7: note: candidate constructor template not viable: requires 4 arguments, but 3 were provided
  45.       unordered_map(_InputIterator __first, _InputIterator __last, size_type __n, const allocator_type& __a)
  46.       ^
  47. /Library/Developer/CommandLineTools/usr/bin/../include/c++/v1/unordered_map:851:7: note: candidate constructor template not viable: requires 5 arguments, but 3 were provided
  48.       unordered_map(_InputIterator __first, _InputIterator __last, size_type __n, const hasher& __hf,
  49.       ^
  50. /Library/Developer/CommandLineTools/usr/bin/../include/c++/v1/unordered_map:824:5: note: candidate constructor not viable: requires 2 arguments, but 3 were provided
  51.     unordered_map(const unordered_map& __u, const allocator_type& __a);
  52.     ^
  53. /Library/Developer/CommandLineTools/usr/bin/../include/c++/v1/unordered_map:828:5: note: candidate constructor not viable: requires 2 arguments, but 3 were provided
  54.     unordered_map(unordered_map&& __u, const allocator_type& __a);
  55.     ^
  56. /Library/Developer/CommandLineTools/usr/bin/../include/c++/v1/unordered_map:840:5: note: candidate constructor not viable: requires 2 arguments, but 3 were provided
  57.     unordered_map(size_type __n, const allocator_type& __a)
  58.     ^
  59. /Library/Developer/CommandLineTools/usr/bin/../include/c++/v1/unordered_map:808:5: note: candidate constructor not viable: requires 4 arguments, but 3 were provided
  60.     unordered_map(size_type __n, const hasher& __hf,
  61.     ^
  62. /Library/Developer/CommandLineTools/usr/bin/../include/c++/v1/unordered_map:858:5: note: candidate constructor not viable: requires 4 arguments, but 3 were provided
  63.     unordered_map(initializer_list<value_type> __il, size_type __n, const hasher& __hf,
  64.     ^
  65. /Library/Developer/CommandLineTools/usr/bin/../include/c++/v1/unordered_map:822:14: note: candidate constructor not viable: requires single argument '__a', but 3 arguments were provided
  66.     explicit unordered_map(const allocator_type& __a);
  67.              ^
  68. /Library/Developer/CommandLineTools/usr/bin/../include/c++/v1/unordered_map:823:5: note: candidate constructor not viable: requires single argument '__u', but 3 arguments were provided
  69.     unordered_map(const unordered_map& __u);
  70.     ^
  71. /Library/Developer/CommandLineTools/usr/bin/../include/c++/v1/unordered_map:826:5: note: candidate constructor not viable: requires single argument '__u', but 3 arguments were provided
  72.     unordered_map(unordered_map&& __u)
  73.     ^
  74. /Library/Developer/CommandLineTools/usr/bin/../include/c++/v1/unordered_map:831:5: note: candidate constructor not viable: requires single argument '__il', but 3 arguments were provided
  75.     unordered_map(initializer_list<value_type> __il);
  76.     ^
  77. /Library/Developer/CommandLineTools/usr/bin/../include/c++/v1/unordered_map:834:5: note: candidate constructor not viable: requires 5 arguments, but 3 were provided
  78.     unordered_map(initializer_list<value_type> __il, size_type __n,
  79.     ^
  80. /Library/Developer/CommandLineTools/usr/bin/../include/c++/v1/unordered_map:799:5: note: candidate constructor not viable: requires 0 arguments, but 3 were provided
  81.     unordered_map()
  82.     ^
  83. 1 error generated.
  84. make[2]: *** [src/server/scripts/CMakeFiles/scripts.dir/Northrend/DraktharonKeep/boss_novos.cpp.o] Error 1
  85. make[1]: *** [src/server/scripts/CMakeFiles/scripts.dir/all] Error 2
  86. make: *** [all] Error 2
RAW Paste Data
We use cookies for various purposes including analytics. By continuing to use Pastebin, you agree to our use of cookies as described in the Cookies Policy. OK, I Understand
 
Top