Advertisement
Guest User

Untitled

a guest
Feb 18th, 2013
61
0
Never
Not a member of Pastebin yet? Sign Up, it unlocks many cool features!
text 3.77 KB | None | 0 0
  1. In file included from /home/andrew/minetest/mapgen/minetest/src/mapgen.cpp:37:0:
  2. /home/andrew/minetest/mapgen/minetest/src/mapgen_plus.h: In member function ‘virtual Mapgen* MapgenPlusFactory::createMapgen(int, MapgenParams*, EmergeManager*)’:
  3. /home/andrew/minetest/mapgen/minetest/src/mapgen_plus.h:66:14: error: expected type-specifier before ‘MapgenTest’
  4. /home/andrew/minetest/mapgen/minetest/src/mapgen_plus.h:66:14: error: cannot convert ‘int*’ to ‘Mapgen*’ in return
  5. /home/andrew/minetest/mapgen/minetest/src/mapgen_plus.h:66:14: error: expected ‘;’ before ‘MapgenTest’
  6. /home/andrew/minetest/mapgen/minetest/src/mapgen_plus.h:66:25: error: ‘MapgenTest’ was not declared in this scope
  7. /home/andrew/minetest/mapgen/minetest/src/mapgen_plus.h: In member function ‘virtual MapgenParams* MapgenPlusFactory::createMapgenParams()’:
  8. /home/andrew/minetest/mapgen/minetest/src/mapgen_plus.h:70:14: error: expected type-specifier before ‘MapgenTestParams’
  9. /home/andrew/minetest/mapgen/minetest/src/mapgen_plus.h:70:14: error: cannot convert ‘int*’ to ‘MapgenParams*’ in return
  10. /home/andrew/minetest/mapgen/minetest/src/mapgen_plus.h:70:14: error: expected ‘;’ before ‘MapgenTestParams’
  11. /home/andrew/minetest/mapgen/minetest/src/mapgen_plus.h:70:31: error: ‘MapgenTestParams’ was not declared in this scope
  12. In file included from /home/andrew/minetest/mapgen/minetest/src/mapgen.cpp:37:0:
  13. /home/andrew/minetest/mapgen/minetest/src/mapgen_plus.h: In member function ‘virtual Mapgen* MapgenPlusFactory::createMapgen(int, MapgenParams*, EmergeManager*)’:
  14. /home/andrew/minetest/mapgen/minetest/src/mapgen_plus.h:66:14: error: expected type-specifier before ‘MapgenTest’
  15. /home/andrew/minetest/mapgen/minetest/src/mapgen_plus.h:66:14: error: cannot convert ‘int*’ to ‘Mapgen*’ in return
  16. /home/andrew/minetest/mapgen/minetest/src/mapgen_plus.h:66:14: error: expected ‘;’ before ‘MapgenTest’
  17. /home/andrew/minetest/mapgen/minetest/src/mapgen_plus.h:66:25: error: ‘MapgenTest’ was not declared in this scope
  18. /home/andrew/minetest/mapgen/minetest/src/mapgen_plus.h: In member function ‘virtual MapgenParams* MapgenPlusFactory::createMapgenParams()’:
  19. /home/andrew/minetest/mapgen/minetest/src/mapgen_plus.h:70:14: error: expected type-specifier before ‘MapgenTestParams’
  20. /home/andrew/minetest/mapgen/minetest/src/mapgen_plus.h:70:14: error: cannot convert ‘int*’ to ‘MapgenParams*’ in return
  21. /home/andrew/minetest/mapgen/minetest/src/mapgen_plus.h:70:14: error: expected ‘;’ before ‘MapgenTestParams’
  22. /home/andrew/minetest/mapgen/minetest/src/mapgen_plus.h:70:31: error: ‘MapgenTestParams’ was not declared in this scope
  23. /home/andrew/minetest/mapgen/minetest/src/mapgen_plus.h:71:2: warning: control reaches end of non-void function [-Wreturn-type]
  24. /home/andrew/minetest/mapgen/minetest/src/mapgen_plus.h: In member function ‘virtual Mapgen* MapgenPlusFactory::createMapgen(int, MapgenParams*, EmergeManager*)’:
  25. /home/andrew/minetest/mapgen/minetest/src/mapgen_plus.h:67:2: warning: control reaches end of non-void function [-Wreturn-type]
  26. make[2]: *** [src/CMakeFiles/minetestserver.dir/mapgen.cpp.o] Error 1
  27. make[1]: *** [src/CMakeFiles/minetestserver.dir/all] Error 2
  28. make[1]: *** Waiting for unfinished jobs....
  29. /home/andrew/minetest/mapgen/minetest/src/mapgen_plus.h:71:2: warning: control reaches end of non-void function [-Wreturn-type]
  30. /home/andrew/minetest/mapgen/minetest/src/mapgen_plus.h: In member function ‘virtual Mapgen* MapgenPlusFactory::createMapgen(int, MapgenParams*, EmergeManager*)’:
  31. /home/andrew/minetest/mapgen/minetest/src/mapgen_plus.h:67:2: warning: control reaches end of non-void function [-Wreturn-type]
  32. make[2]: *** [src/CMakeFiles/minetest.dir/mapgen.cpp.o] Error 1
  33. make[1]: *** [src/CMakeF
Advertisement
Add Comment
Please, Sign In to add comment
Advertisement