Advertisement
Guest User

Untitled

a guest
Mar 2nd, 2021
181
0
Never
Not a member of Pastebin yet? Sign Up, it unlocks many cool features!
text 4.03 KB | None | 0 0
  1. [INFO] Changes detected - recompiling the module!
  2. [INFO] Compiling 11 source files to /media/irynah/DATA/0NEW-108G/0PROJECTS/OpenMRS-projects/openmrs-contrib-qaframework/target/test-classes
  3. [INFO] -------------------------------------------------------------
  4. [ERROR] COMPILATION ERROR :
  5. [INFO] -------------------------------------------------------------
  6. [ERROR] /media/irynah/DATA/0NEW-108G/0PROJECTS/OpenMRS-projects/openmrs-contrib-qaframework/src/test/java/org/openmrs/contrib/qaframework/automation/StylesGuideSteps.java:[41,41] cannot find symbol
  7. symbol: method clickOnStylesGuideAppLink()
  8. location: variable systemAdministrationPage of type org.openmrs.reference.page.SystemAdministrationPage
  9. [ERROR] /media/irynah/DATA/0NEW-108G/0PROJECTS/OpenMRS-projects/openmrs-contrib-qaframework/src/test/java/org/openmrs/contrib/qaframework/automation/AllergiesSteps.java:[45,28] cannot find symbol
  10. symbol: method addNoKnownAllergy()
  11. location: variable allergyPage of type org.openmrs.reference.page.AllergyPage
  12. [ERROR] /media/irynah/DATA/0NEW-108G/0PROJECTS/OpenMRS-projects/openmrs-contrib-qaframework/src/test/java/org/openmrs/contrib/qaframework/automation/AllergiesSteps.java:[55,28] cannot find symbol
  13. symbol: method removeNoKnownAllergy()
  14. location: variable allergyPage of type org.openmrs.reference.page.AllergyPage
  15. [ERROR] /media/irynah/DATA/0NEW-108G/0PROJECTS/OpenMRS-projects/openmrs-contrib-qaframework/src/test/java/org/openmrs/contrib/qaframework/automation/ConditionsSteps.java:[38,30] cannot find symbol
  16. symbol: method clickOnConditionsWidgetLink()
  17. location: variable dashboardPage of type org.openmrs.reference.page.ClinicianFacingPatientDashboardPage
  18. [INFO] 4 errors
  19. [INFO] -------------------------------------------------------------
  20. [INFO] ------------------------------------------------------------------------
  21. [INFO] BUILD FAILURE
  22. [INFO] ------------------------------------------------------------------------
  23. [INFO] Total time: 20.031 s
  24. [INFO] Finished at: 2021-03-02T20:05:43+03:00
  25. [INFO] ------------------------------------------------------------------------
  26. [ERROR] Failed to execute goal org.apache.maven.plugins:maven-compiler-plugin:3.1:testCompile (default-testCompile) on project qaframework: Compilation failure: Compilation failure:
  27. [ERROR] /media/irynah/DATA/0NEW-108G/0PROJECTS/OpenMRS-projects/openmrs-contrib-qaframework/src/test/java/org/openmrs/contrib/qaframework/automation/StylesGuideSteps.java:[41,41] cannot find symbol
  28. [ERROR] symbol: method clickOnStylesGuideAppLink()
  29. [ERROR] location: variable systemAdministrationPage of type org.openmrs.reference.page.SystemAdministrationPage
  30. [ERROR] /media/irynah/DATA/0NEW-108G/0PROJECTS/OpenMRS-projects/openmrs-contrib-qaframework/src/test/java/org/openmrs/contrib/qaframework/automation/AllergiesSteps.java:[45,28] cannot find symbol
  31. [ERROR] symbol: method addNoKnownAllergy()
  32. [ERROR] location: variable allergyPage of type org.openmrs.reference.page.AllergyPage
  33. [ERROR] /media/irynah/DATA/0NEW-108G/0PROJECTS/OpenMRS-projects/openmrs-contrib-qaframework/src/test/java/org/openmrs/contrib/qaframework/automation/AllergiesSteps.java:[55,28] cannot find symbol
  34. [ERROR] symbol: method removeNoKnownAllergy()
  35. [ERROR] location: variable allergyPage of type org.openmrs.reference.page.AllergyPage
  36. [ERROR] /media/irynah/DATA/0NEW-108G/0PROJECTS/OpenMRS-projects/openmrs-contrib-qaframework/src/test/java/org/openmrs/contrib/qaframework/automation/ConditionsSteps.java:[38,30] cannot find symbol
  37. [ERROR] symbol: method clickOnConditionsWidgetLink()
  38. [ERROR] location: variable dashboardPage of type org.openmrs.reference.page.ClinicianFacingPatientDashboardPage
  39. [ERROR] -> [Help 1]
  40. [ERROR]
  41. [ERROR] To see the full stack trace of the errors, re-run Maven with the -e switch.
  42. [ERROR] Re-run Maven using the -X switch to enable full debug logging.
  43. [ERROR]
  44. [ERROR] For more information about the errors and possible solutions, please read the following articles:
  45. [ERROR] [Help 1] http://cwiki.apache.org/confluence/display/MAVEN/MojoFailureException
  46.  
Advertisement
Add Comment
Please, Sign In to add comment
Advertisement