Guest User

Untitled

a guest
Jan 22nd, 2019
75
Never
Not a member of Pastebin yet? Sign Up, it unlocks many cool features!
  1. PS C:\openmrs-workspace\openmrs`-module-commonlabtest> mvn release:perform -X
  2. Apache Maven 3.3.3 (7994120775791599e205a5524ec3e0dfe41d4a06; 2015-04-22T16:57:37+05:00)
  3. Maven home: C:\apache-maven-3.3.3
  4. Java version: 1.8.0_121, vendor: Oracle Corporation
  5. Java home: C:\Program Files\Java\jdk1.8.0_121\jre
  6. Default locale: en_US, platform encoding: Cp1252
  7. OS name: "windows 10", version: "10.0", arch: "amd64", family: "dos"
  8. [DEBUG] Created new class realm maven.api
  9. [DEBUG] Importing foreign packages into class realm maven.api
  10. [DEBUG]   Imported: javax.enterprise.inject.* < plexus.core
  11. [DEBUG]   Imported: javax.enterprise.util.* < plexus.core
  12. [DEBUG]   Imported: javax.inject.* < plexus.core
  13. [DEBUG]   Imported: org.apache.maven.* < plexus.core
  14. [DEBUG]   Imported: org.apache.maven.artifact < plexus.core
  15. [DEBUG]   Imported: org.apache.maven.classrealm < plexus.core
  16. [DEBUG]   Imported: org.apache.maven.cli < plexus.core
  17. [DEBUG]   Imported: org.apache.maven.configuration < plexus.core
  18. [DEBUG]   Imported: org.apache.maven.exception < plexus.core
  19. [DEBUG]   Imported: org.apache.maven.execution < plexus.core
  20. [DEBUG]   Imported: org.apache.maven.execution.scope < plexus.core
  21. [DEBUG]   Imported: org.apache.maven.lifecycle < plexus.core
  22. [DEBUG]   Imported: org.apache.maven.model < plexus.core
  23. [DEBUG]   Imported: org.apache.maven.monitor < plexus.core
  24. [DEBUG]   Imported: org.apache.maven.plugin < plexus.core
  25. [DEBUG]   Imported: org.apache.maven.profiles < plexus.core
  26. [DEBUG]   Imported: org.apache.maven.project < plexus.core
  27. [DEBUG]   Imported: org.apache.maven.reporting < plexus.core
  28. [DEBUG]   Imported: org.apache.maven.repository < plexus.core
  29. [DEBUG]   Imported: org.apache.maven.rtinfo < plexus.core
  30. [DEBUG]   Imported: org.apache.maven.settings < plexus.core
  31. [DEBUG]   Imported: org.apache.maven.toolchain < plexus.core
  32. [DEBUG]   Imported: org.apache.maven.usability < plexus.core
  33. [DEBUG]   Imported: org.apache.maven.wagon.* < plexus.core
  34. [DEBUG]   Imported: org.apache.maven.wagon.authentication < plexus.core
  35. [DEBUG]   Imported: org.apache.maven.wagon.authorization < plexus.core
  36. [DEBUG]   Imported: org.apache.maven.wagon.events < plexus.core
  37. [DEBUG]   Imported: org.apache.maven.wagon.observers < plexus.core
  38. [DEBUG]   Imported: org.apache.maven.wagon.proxy < plexus.core
  39. [DEBUG]   Imported: org.apache.maven.wagon.repository < plexus.core
  40. [DEBUG]   Imported: org.apache.maven.wagon.resource < plexus.core
  41. [DEBUG]   Imported: org.codehaus.classworlds < plexus.core
  42. [DEBUG]   Imported: org.codehaus.plexus.* < plexus.core
  43. [DEBUG]   Imported: org.codehaus.plexus.classworlds < plexus.core
  44. [DEBUG]   Imported: org.codehaus.plexus.component < plexus.core
  45. [DEBUG]   Imported: org.codehaus.plexus.configuration < plexus.core
  46. [DEBUG]   Imported: org.codehaus.plexus.container < plexus.core
  47. [DEBUG]   Imported: org.codehaus.plexus.context < plexus.core
  48. [DEBUG]   Imported: org.codehaus.plexus.lifecycle < plexus.core
  49. [DEBUG]   Imported: org.codehaus.plexus.logging < plexus.core
  50. [DEBUG]   Imported: org.codehaus.plexus.personality < plexus.core
  51. [DEBUG]   Imported: org.codehaus.plexus.util.xml.Xpp3Dom < plexus.core
  52. [DEBUG]   Imported: org.codehaus.plexus.util.xml.pull.XmlPullParser < plexus.core
  53. [DEBUG]   Imported: org.codehaus.plexus.util.xml.pull.XmlPullParserException < plexus.core
  54. [DEBUG]   Imported: org.codehaus.plexus.util.xml.pull.XmlSerializer < plexus.core
  55. [DEBUG]   Imported: org.eclipse.aether.* < plexus.core
  56. [DEBUG]   Imported: org.eclipse.aether.artifact < plexus.core
  57. [DEBUG]   Imported: org.eclipse.aether.collection < plexus.core
  58. [DEBUG]   Imported: org.eclipse.aether.deployment < plexus.core
  59. [DEBUG]   Imported: org.eclipse.aether.graph < plexus.core
  60. [DEBUG]   Imported: org.eclipse.aether.impl < plexus.core
  61. [DEBUG]   Imported: org.eclipse.aether.installation < plexus.core
  62. [DEBUG]   Imported: org.eclipse.aether.internal.impl < plexus.core
  63. [DEBUG]   Imported: org.eclipse.aether.metadata < plexus.core
  64. [DEBUG]   Imported: org.eclipse.aether.repository < plexus.core
  65. [DEBUG]   Imported: org.eclipse.aether.resolution < plexus.core
  66. [DEBUG]   Imported: org.eclipse.aether.spi < plexus.core
  67. [DEBUG]   Imported: org.eclipse.aether.transfer < plexus.core
  68. [DEBUG]   Imported: org.eclipse.aether.version < plexus.core
  69. [DEBUG]   Imported: org.slf4j.* < plexus.core
  70. [DEBUG]   Imported: org.slf4j.spi.* < plexus.core
  71. [DEBUG] Populating class realm maven.api
  72. [INFO] Error stacktraces are turned on.
  73. [DEBUG] Reading global settings from C:\apache-maven-3.3.3\conf\settings.xml
  74. [DEBUG] Reading user settings from C:\Users\owais\.m2\settings.xml
  75. [DEBUG] Reading global toolchains from C:\apache-maven-3.3.3\conf\toolchains.xml
  76. [DEBUG] Reading user toolchains from C:\Users\owais\.m2\toolchains.xml
  77. [DEBUG] Using local repository at C:\Users\owais\.m2\repository
  78. [DEBUG] Using manager EnhancedLocalRepositoryManager with priority 10.0 for C:\Users\owais\.m2\repository
  79. [INFO] Scanning for projects...
  80. [DEBUG] Extension realms for project org.openmrs.module:commonlabtest:pom:1.3.2-SNAPSHOT: (none)
  81. [DEBUG] Looking up lifecyle mappings for packaging pom from ClassRealm[plexus.core, parent: null]
  82. [DEBUG] Extension realms for project org.openmrs.maven.parents:maven-parent-openmrs-module:pom:1.1.1: (none)
  83. [DEBUG] Looking up lifecyle mappings for packaging pom from ClassRealm[plexus.core, parent: null]
  84. [DEBUG] Extension realms for project org.openmrs.module:commonlabtest-api:jar:1.3.2-SNAPSHOT: (none)
  85. [DEBUG] Looking up lifecyle mappings for packaging jar from ClassRealm[plexus.core, parent: null]
  86. [DEBUG] Dependency collection stats: {ConflictMarker.analyzeTime=2, ConflictMarker.markTime=1, ConflictMarker.nodeCount=80, ConflictIdSorter.graphTime=1, ConflictIdSorter.topsortTime=0, ConflictIdSorter.conflictIdCount=20, ConflictIdSorter.conflictIdCycleCount=0, ConflictResolver.totalTime=6, ConflictResolver.conflictItemCount=49, DefaultDependencyCollector.collectTime=420, DefaultDependencyCollector.transformTime=13}
  87. [DEBUG] org.openmrs.maven.plugins:maven-openmrs-plugin:jar:1.0.1:
  88. [DEBUG]    org.apache.maven:maven-plugin-api:jar:2.0:compile
  89. [DEBUG]    org.apache.maven:maven-archiver:jar:2.2:compile
  90. [DEBUG]       org.codehaus.plexus:plexus-archiver:jar:1.0-alpha-7:compile
  91. [DEBUG]       org.apache.maven:maven-artifact:jar:2.0:compile
  92. [DEBUG]    org.apache.maven:maven-model:jar:2.0.10:compile
  93. [DEBUG]    org.apache.maven:maven-project:jar:2.0.10:compile
  94. [DEBUG]       org.apache.maven:maven-settings:jar:2.0.10:compile
  95. [DEBUG]       org.apache.maven:maven-profile:jar:2.0.10:compile
  96. [DEBUG]       org.apache.maven:maven-artifact-manager:jar:2.0.10:compile
  97. [DEBUG]          org.apache.maven:maven-repository-metadata:jar:2.0.10:compile
  98. [DEBUG]       org.apache.maven:maven-plugin-registry:jar:2.0.10:compile
  99. [DEBUG]       org.codehaus.plexus:plexus-interpolation:jar:1.1:compile
  100. [DEBUG]       org.codehaus.plexus:plexus-container-default:jar:1.0-alpha-9-stable-1:compile
  101. [DEBUG]          junit:junit:jar:3.8.1:compile
  102. [DEBUG]          classworlds:classworlds:jar:1.1-alpha-2:compile
  103. [DEBUG]    org.apache.maven.shared:file-management:jar:1.2.1:compile
  104. [DEBUG]       org.apache.maven.shared:maven-shared-io:jar:1.1:compile
  105. [DEBUG]          org.apache.maven.wagon:wagon-provider-api:jar:1.0-alpha-6:compile
  106. [DEBUG]    org.codehaus.plexus:plexus-utils:jar:1.5.5:compile
  107. [DEBUG] Created new class realm extension>org.openmrs.maven.plugins:maven-openmrs-plugin:1.0.1
  108. [DEBUG] Importing foreign packages into class realm extension>org.openmrs.maven.plugins:maven-openmrs-plugin:1.0.1
  109. [DEBUG]   Imported:  < maven.api
  110. [DEBUG] Populating class realm extension>org.openmrs.maven.plugins:maven-openmrs-plugin:1.0.1
  111. [DEBUG]   Included: org.openmrs.maven.plugins:maven-openmrs-plugin:jar:1.0.1
  112. [DEBUG]   Included: org.apache.maven:maven-archiver:jar:2.2
  113. [DEBUG]   Included: org.codehaus.plexus:plexus-archiver:jar:1.0-alpha-7
  114. [DEBUG]   Included: org.codehaus.plexus:plexus-interpolation:jar:1.1
  115. [DEBUG]   Included: junit:junit:jar:3.8.1
  116. [DEBUG]   Included: org.apache.maven.shared:file-management:jar:1.2.1
  117. [DEBUG]   Included: org.apache.maven.shared:maven-shared-io:jar:1.1
  118. [DEBUG]   Included: org.codehaus.plexus:plexus-utils:jar:1.5.5
  119. [DEBUG] Extension realms for project org.openmrs.module:commonlabtest-omod:jar:1.3.2-SNAPSHOT: [ClassRealm[extension>org.openmrs.maven.plugins:maven-openmrs-plugin:1.0.1, parent: sun.misc.Launcher$AppClassLoader@55f96302]]
  120. [DEBUG] Created new class realm project>org.openmrs.module:commonlabtest-omod:1.3.2-SNAPSHOT
  121. [DEBUG] Populating class realm project>org.openmrs.module:commonlabtest-omod:1.3.2-SNAPSHOT
  122. [DEBUG] Looking up lifecyle mappings for packaging jar from ClassRealm[project>org.openmrs.module:commonlabtest-omod:1.3.2-SNAPSHOT, parent: ClassRealm[maven.api, parent: null]]
  123. [WARNING]
  124. [WARNING] Some problems were encountered while building the effective model for org.openmrs.module:commonlabtest-omod:jar:1.3.2-SNAPSHOT
  125. [WARNING] 'build.plugins.plugin.version' for org.jacoco:jacoco-maven-plugin is missing. @ org.openmrs.module:commonlabtest-omod:[unknown-version], C:\openmrs-workspace\openmrs-module-commonlabtest\omod\pom.xml, line 115, column 13
  126. [WARNING]
  127. [WARNING] It is highly recommended to fix these problems because they threaten the stability of your build.
  128. [WARNING]
  129. [WARNING] For this reason, future Maven versions might no longer support building such malformed projects.
  130. [WARNING]
  131. [INFO] ------------------------------------------------------------------------
  132. [INFO] Reactor Build Order:
  133. [INFO]
  134. [INFO] Common Lab Test
  135. [INFO] Common Lab Test API
  136. [INFO] Common Lab Test OMOD
  137. [DEBUG] Resolving plugin version for org.apache.maven.plugins:maven-compiler-plugin
  138. [DEBUG] Could not find metadata org.apache.maven.plugins:maven-compiler-plugin/maven-metadata.xml in local (C:\Users\owais\.m2\repository)
  139. [DEBUG] Skipped remote request for org.apache.maven.plugins:maven-compiler-plugin/maven-metadata.xml, locally cached metadata up-to-date.
  140. [DEBUG] Failure to find org.apache.maven.plugins:maven-compiler-plugin/maven-metadata.xml in https://dl.bintray.com/openmrs/maven/ was cached in the local repository, resolution will not be reattempted until the update interval of openmrs-bintray-repo has elapsed or updates are forced
  141. [DEBUG] Skipped remote request for org.apache.maven.plugins:maven-compiler-plugin/maven-metadata.xml, locally cached metadata up-to-date.
  142. [DEBUG] Resolved plugin version for org.apache.maven.plugins:maven-compiler-plugin to 3.8.0 from repository openmrs-repo (http://mavenrepo.openmrs.org/nexus/content/repositories/public, default, releases)
  143. [DEBUG] Resolving plugin prefix release from [org.openmrs.maven.plugins, org.apache.maven.plugins, org.codehaus.mojo]
  144. [DEBUG] Resolved plugin prefix release to org.apache.maven.plugins:maven-release-plugin from POM org.openmrs.module:commonlabtest:pom:1.3.2-SNAPSHOT
  145. [DEBUG] === REACTOR BUILD PLAN ================================================
  146. [DEBUG] Project: org.openmrs.module:commonlabtest:pom:1.3.2-SNAPSHOT
  147. [DEBUG] Tasks:   [release:perform]
  148. [DEBUG] Style:   Aggregating
  149. [DEBUG] =======================================================================
  150. [INFO]
  151. [INFO] ------------------------------------------------------------------------
  152. [INFO] Building Common Lab Test 1.3.2-SNAPSHOT
  153. [INFO] ------------------------------------------------------------------------
  154. [DEBUG] Resolving plugin prefix release from [org.openmrs.maven.plugins, org.apache.maven.plugins, org.codehaus.mojo]
  155. [DEBUG] Resolved plugin prefix release to org.apache.maven.plugins:maven-release-plugin from POM org.openmrs.module:commonlabtest:pom:1.3.2-SNAPSHOT
  156. [DEBUG] Lifecycle default -> [validate, initialize, generate-sources, process-sources, generate-resources, process-resources, compile, process-classes, generate-test-sources, process-test-sources, generate-test-resources, process-test-resources, test-compile, process-test-classes, test, prepare-package, package, pre-integration-test, integration-test, post-integration-test, verify, install, deploy]
  157. [DEBUG] Lifecycle clean -> [pre-clean, clean, post-clean]
  158. [DEBUG] Lifecycle site -> [pre-site, site, post-site, site-deploy]
  159. [DEBUG] === PROJECT BUILD PLAN ================================================
  160. [DEBUG] Project:       org.openmrs.module:commonlabtest:1.3.2-SNAPSHOT
  161. [DEBUG] Dependencies (collect): []
  162. [DEBUG] Dependencies (resolve): []
  163. [DEBUG] Repositories (dependencies): [openmrs-repo (http://mavenrepo.openmrs.org/nexus/content/repositories/public, default, releases+snapshots), openmrs-repo-thirdparty (http://mavenrepo.openmrs.org/nexus/content/repositories/thirdparty, default, releases+snapshots), openmrs-bintray-repo (https://dl.bintray.com/openmrs/maven/, default, releases+snapshots), central (http://repo1.maven.org/maven2, default, releases+snapshots)]
  164. [DEBUG] Repositories (plugins)     : [openmrs-repo (http://mavenrepo.openmrs.org/nexus/content/repositories/public, default, releases), openmrs-bintray-repo (https://dl.bintray.com/openmrs/maven/, default, releases+snapshots), central (https://repo.maven.apache.org/maven2, default, releases)]
  165. [DEBUG] -----------------------------------------------------------------------
  166. [DEBUG] Goal:          org.apache.maven.plugins:maven-release-plugin:2.5.3:perform (default-cli)
  167. [DEBUG] Style:         Aggregating
  168. [DEBUG] Configuration: <?xml version="1.0" encoding="UTF-8"?>
  169. <configuration>
  170.   <arguments>-Prelease</arguments>
  171.   <basedir default-value="${basedir}"/>
  172.   <connectionUrl>${connectionUrl}</connectionUrl>
  173.   <dryRun default-value="false">${dryRun}</dryRun>
  174.   <goals>${goals}</goals>
  175.   <javaHome default-value="${java.home}"/>
  176.   <localCheckout default-value="false">${localCheckout}</localCheckout>
  177.   <localRepoDirectory default-value="${maven.repo.local}"/>
  178.   <mavenExecutorId default-value="invoker">${mavenExecutorId}</mavenExecutorId>
  179.   <mavenHome default-value="${maven.home}"/>
  180.   <password>${password}</password>
  181.   <pomFileName>${pomFileName}</pomFileName>
  182.   <project default-value="${project}"/>
  183.   <reactorProjects default-value="${reactorProjects}"/>
  184.   <releaseProfiles>${releaseProfiles}</releaseProfiles>
  185.   <session default-value="${session}"/>
  186.   <settings default-value="${settings}"/>
  187.   <useReleaseProfile default-value="true">false</useReleaseProfile>
  188.   <username>${username}</username>
  189.   <workingDirectory default-value="${project.build.directory}/checkout">${workingDirectory}</workingDirectory>
  190. </configuration>
  191. [DEBUG] =======================================================================
  192. [INFO]
  193. [INFO] --- maven-release-plugin:2.5.3:perform (default-cli) @ commonlabtest ---
  194. [DEBUG] Dependency collection stats: {ConflictMarker.analyzeTime=1, ConflictMarker.markTime=0, ConflictMarker.nodeCount=182, ConflictIdSorter.graphTime=0, ConflictIdSorter.topsortTime=0, ConflictIdSorter.conflictIdCount=68, ConflictIdSorter.conflictIdCycleCount=0, ConflictResolver.totalTime=18, ConflictResolver.conflictItemCount=171, DefaultDependencyCollector.collectTime=736, DefaultDependencyCollector.transformTime=19}
  195. [DEBUG] org.apache.maven.plugins:maven-release-plugin:jar:2.5.3:
  196. [DEBUG]    org.apache.maven:maven-plugin-api:jar:2.2.1:compile
  197. [DEBUG]    org.apache.maven.release:maven-release-manager:jar:2.5.3:compile
  198. [DEBUG]       org.apache.maven.release:maven-release-api:jar:2.5.3:compile
  199. [DEBUG]          org.eclipse.aether:aether-util:jar:1.0.0.v20140518:compile
  200. [DEBUG]             org.eclipse.aether:aether-api:jar:1.0.0.v20140518:compile
  201. [DEBUG]       org.codehaus.plexus:plexus-container-default:jar:1.0-alpha-9:compile
  202. [DEBUG]          junit:junit:jar:3.8.1:compile
  203. [DEBUG]       org.codehaus.plexus:plexus-interactivity-api:jar:1.0-alpha-6:compile
  204. [DEBUG]       org.codehaus.plexus:plexus-interpolation:jar:1.14:compile
  205. [DEBUG]       org.sonatype.plexus:plexus-sec-dispatcher:jar:1.3:compile
  206. [DEBUG]          org.sonatype.plexus:plexus-cipher:jar:1.4:compile
  207. [DEBUG]       org.apache.maven:maven-artifact:jar:2.2.1:compile
  208. [DEBUG]       org.apache.maven:maven-artifact-manager:jar:2.2.1:compile
  209. [DEBUG]          backport-util-concurrent:backport-util-concurrent:jar:3.1:compile
  210. [DEBUG]       org.apache.maven.shared:maven-invoker:jar:2.2:compile
  211. [DEBUG]          org.codehaus.plexus:plexus-component-annotations:jar:1.5.5:compile
  212. [DEBUG]       commons-lang:commons-lang:jar:2.4:compile
  213. [DEBUG]       commons-cli:commons-cli:jar:1.2:compile
  214. [DEBUG]       commons-io:commons-io:jar:2.2:compile
  215. [DEBUG]       org.apache.maven.scm:maven-scm-providers-standard:pom:1.9.4:runtime
  216. [DEBUG]          org.apache.maven.scm:maven-scm-provider-accurev:jar:1.9.4:runtime
  217. [DEBUG]          org.apache.maven.scm:maven-scm-provider-bazaar:jar:1.9.4:runtime
  218. [DEBUG]          org.apache.maven.scm:maven-scm-provider-clearcase:jar:1.9.4:runtime
  219. [DEBUG]          org.apache.maven.scm:maven-scm-provider-cvsexe:jar:1.9.4:runtime
  220. [DEBUG]             org.apache.maven.scm:maven-scm-provider-cvs-commons:jar:1.9.4:runtime
  221. [DEBUG]          org.apache.maven.scm:maven-scm-provider-cvsjava:jar:1.9.4:runtime
  222. [DEBUG]             org.netbeans.lib:cvsclient:jar:20060125:runtime
  223. [DEBUG]             ch.ethz.ganymed:ganymed-ssh2:jar:build210:runtime
  224. [DEBUG]          org.apache.maven.scm:maven-scm-provider-gitexe:jar:1.9.4:runtime
  225. [DEBUG]             org.apache.maven.scm:maven-scm-provider-git-commons:jar:1.9.4:runtime
  226. [DEBUG]          org.apache.maven.scm:maven-scm-provider-hg:jar:1.9.4:runtime
  227. [DEBUG]          org.apache.maven.scm:maven-scm-provider-perforce:jar:1.9.4:runtime
  228. [DEBUG]          org.apache.maven.scm:maven-scm-provider-starteam:jar:1.9.4:runtime
  229. [DEBUG]          org.apache.maven.scm:maven-scm-provider-svnexe:jar:1.9.4:runtime
  230. [DEBUG]          org.apache.maven.scm:maven-scm-provider-synergy:jar:1.9.4:runtime
  231. [DEBUG]          org.apache.maven.scm:maven-scm-provider-vss:jar:1.9.4:runtime
  232. [DEBUG]          org.apache.maven.scm:maven-scm-provider-tfs:jar:1.9.4:runtime
  233. [DEBUG]          org.apache.maven.scm:maven-scm-provider-integrity:jar:1.9.4:runtime
  234. [DEBUG]             com.mks.api:mksapi-jar:jar:4.10.9049:runtime
  235. [DEBUG]             org.codehaus.groovy:groovy-all:jar:1.7.6:runtime
  236. [DEBUG]          org.apache.maven.scm:maven-scm-provider-jazz:jar:1.9.4:runtime
  237. [DEBUG]       org.apache.maven.scm:maven-scm-manager-plexus:jar:1.8:runtime
  238. [DEBUG]       org.apache.maven.scm:maven-scm-provider-svn-commons:jar:1.9.4:compile
  239. [DEBUG]       jaxen:jaxen:jar:1.1-beta-8:runtime
  240. [DEBUG]          jdom:jdom:jar:1.0:runtime
  241. [DEBUG]    org.apache.maven:maven-model:jar:2.2.1:compile
  242. [DEBUG]    org.apache.maven:maven-core:jar:2.2.1:compile
  243. [DEBUG]       org.apache.maven:maven-plugin-parameter-documenter:jar:2.2.1:compile
  244. [DEBUG]       org.slf4j:slf4j-jdk14:jar:1.5.6:runtime
  245. [DEBUG]          org.slf4j:slf4j-api:jar:1.5.6:runtime
  246. [DEBUG]       org.slf4j:jcl-over-slf4j:jar:1.5.6:runtime
  247. [DEBUG]       org.apache.maven.reporting:maven-reporting-api:jar:2.2.1:compile
  248. [DEBUG]          org.apache.maven.doxia:doxia-sink-api:jar:1.1:compile
  249. [DEBUG]          org.apache.maven.doxia:doxia-logging-api:jar:1.1:compile
  250. [DEBUG]       org.apache.maven:maven-profile:jar:2.2.1:compile
  251. [DEBUG]       org.apache.maven:maven-repository-metadata:jar:2.2.1:compile
  252. [DEBUG]       org.apache.maven:maven-error-diagnostics:jar:2.2.1:compile
  253. [DEBUG]       org.apache.maven:maven-plugin-descriptor:jar:2.2.1:compile
  254. [DEBUG]       org.apache.maven:maven-monitor:jar:2.2.1:compile
  255. [DEBUG]       classworlds:classworlds:jar:1.1:compile
  256. [DEBUG]    org.apache.maven:maven-project:jar:2.2.1:compile
  257. [DEBUG]       org.apache.maven:maven-plugin-registry:jar:2.2.1:compile
  258. [DEBUG]    org.apache.maven:maven-settings:jar:2.2.1:compile
  259. [DEBUG]    org.apache.maven.scm:maven-scm-api:jar:1.9.4:compile
  260. [DEBUG]    org.codehaus.plexus:plexus-utils:jar:3.0.15:compile
  261. [DEBUG]    org.jdom:jdom:jar:1.1:compile
  262. [DEBUG] Created new class realm plugin>org.apache.maven.plugins:maven-release-plugin:2.5.3
  263. [DEBUG] Importing foreign packages into class realm plugin>org.apache.maven.plugins:maven-release-plugin:2.5.3
  264. [DEBUG]   Imported:  < maven.api
  265. [DEBUG] Populating class realm plugin>org.apache.maven.plugins:maven-release-plugin:2.5.3
  266. [DEBUG]   Included: org.apache.maven.plugins:maven-release-plugin:jar:2.5.3
  267. [DEBUG]   Included: org.apache.maven.release:maven-release-manager:jar:2.5.3
  268. [DEBUG]   Included: org.apache.maven.release:maven-release-api:jar:2.5.3
  269. [DEBUG]   Included: org.eclipse.aether:aether-util:jar:1.0.0.v20140518
  270. [DEBUG]   Included: junit:junit:jar:3.8.1
  271. [DEBUG]   Included: org.codehaus.plexus:plexus-interactivity-api:jar:1.0-alpha-6
  272. [DEBUG]   Included: org.codehaus.plexus:plexus-interpolation:jar:1.14
  273. [DEBUG]   Included: org.sonatype.plexus:plexus-sec-dispatcher:jar:1.3
  274. [DEBUG]   Included: org.sonatype.plexus:plexus-cipher:jar:1.4
  275. [DEBUG]   Included: backport-util-concurrent:backport-util-concurrent:jar:3.1
  276. [DEBUG]   Included: org.apache.maven.shared:maven-invoker:jar:2.2
  277. [DEBUG]   Included: org.codehaus.plexus:plexus-component-annotations:jar:1.5.5
  278. [DEBUG]   Included: commons-lang:commons-lang:jar:2.4
  279. [DEBUG]   Included: commons-cli:commons-cli:jar:1.2
  280. [DEBUG]   Included: commons-io:commons-io:jar:2.2
  281. [DEBUG]   Included: org.apache.maven.scm:maven-scm-providers-standard:pom:1.9.4
  282. [DEBUG]   Included: org.apache.maven.scm:maven-scm-provider-accurev:jar:1.9.4
  283. [DEBUG]   Included: org.apache.maven.scm:maven-scm-provider-bazaar:jar:1.9.4
  284. [DEBUG]   Included: org.apache.maven.scm:maven-scm-provider-clearcase:jar:1.9.4
  285. [DEBUG]   Included: org.apache.maven.scm:maven-scm-provider-cvsexe:jar:1.9.4
  286. [DEBUG]   Included: org.apache.maven.scm:maven-scm-provider-cvs-commons:jar:1.9.4
  287. [DEBUG]   Included: org.apache.maven.scm:maven-scm-provider-cvsjava:jar:1.9.4
  288. [DEBUG]   Included: org.netbeans.lib:cvsclient:jar:20060125
  289. [DEBUG]   Included: ch.ethz.ganymed:ganymed-ssh2:jar:build210
  290. [DEBUG]   Included: org.apache.maven.scm:maven-scm-provider-gitexe:jar:1.9.4
  291. [DEBUG]   Included: org.apache.maven.scm:maven-scm-provider-git-commons:jar:1.9.4
  292. [DEBUG]   Included: org.apache.maven.scm:maven-scm-provider-hg:jar:1.9.4
  293. [DEBUG]   Included: org.apache.maven.scm:maven-scm-provider-perforce:jar:1.9.4
  294. [DEBUG]   Included: org.apache.maven.scm:maven-scm-provider-starteam:jar:1.9.4
  295. [DEBUG]   Included: org.apache.maven.scm:maven-scm-provider-svnexe:jar:1.9.4
  296. [DEBUG]   Included: org.apache.maven.scm:maven-scm-provider-synergy:jar:1.9.4
  297. [DEBUG]   Included: org.apache.maven.scm:maven-scm-provider-vss:jar:1.9.4
  298. [DEBUG]   Included: org.apache.maven.scm:maven-scm-provider-tfs:jar:1.9.4
  299. [DEBUG]   Included: org.apache.maven.scm:maven-scm-provider-integrity:jar:1.9.4
  300. [DEBUG]   Included: com.mks.api:mksapi-jar:jar:4.10.9049
  301. [DEBUG]   Included: org.codehaus.groovy:groovy-all:jar:1.7.6
  302. [DEBUG]   Included: org.apache.maven.scm:maven-scm-provider-jazz:jar:1.9.4
  303. [DEBUG]   Included: org.apache.maven.scm:maven-scm-manager-plexus:jar:1.8
  304. [DEBUG]   Included: org.apache.maven.scm:maven-scm-provider-svn-commons:jar:1.9.4
  305. [DEBUG]   Included: jaxen:jaxen:jar:1.1-beta-8
  306. [DEBUG]   Included: jdom:jdom:jar:1.0
  307. [DEBUG]   Included: org.slf4j:slf4j-jdk14:jar:1.5.6
  308. [DEBUG]   Included: org.slf4j:jcl-over-slf4j:jar:1.5.6
  309. [DEBUG]   Included: org.apache.maven.reporting:maven-reporting-api:jar:2.2.1
  310. [DEBUG]   Included: org.apache.maven.doxia:doxia-sink-api:jar:1.1
  311. [DEBUG]   Included: org.apache.maven.doxia:doxia-logging-api:jar:1.1
  312. [DEBUG]   Included: org.apache.maven.scm:maven-scm-api:jar:1.9.4
  313. [DEBUG]   Included: org.codehaus.plexus:plexus-utils:jar:3.0.15
  314. [DEBUG]   Included: org.jdom:jdom:jar:1.1
  315. [DEBUG] Configuring mojo org.apache.maven.plugins:maven-release-plugin:2.5.3:perform from plugin realm ClassRealm[plugin>org.apache.maven.plugins:maven-release-plugin:2.5.3, parent: sun.misc.Launcher$AppClassLoader@55f96302]
  316. [DEBUG] Configuring mojo 'org.apache.maven.plugins:maven-release-plugin:2.5.3:perform' with basic configurator -->
  317. [DEBUG]   (f) arguments = -Prelease
  318. [DEBUG]   (s) basedir = C:\openmrs-workspace\openmrs-module-commonlabtest
  319. [DEBUG]   (f) dryRun = false
  320. [DEBUG]   (f) javaHome = C:\Program Files\Java\jdk1.8.0_121\jre
  321. [DEBUG]   (f) localCheckout = false
  322. [DEBUG]   (f) mavenExecutorId = invoker
  323. [DEBUG]   (f) mavenHome = C:\apache-maven-3.3.3
  324. [DEBUG]   (f) project = MavenProject: org.openmrs.module:commonlabtest:1.3.2-SNAPSHOT @ C:\openmrs-workspace\openmrs-module-commonlabtest\pom.xml
  325. [DEBUG]   (f) reactorProjects = [MavenProject: org.openmrs.module:commonlabtest:1.3.2-SNAPSHOT @ C:\openmrs-workspace\openmrs-module-commonlabtest\pom.xml, MavenProject: org.openmrs.module:commonlabtest-api:1.3.2-SNAPSHOT @ C:\openmrs-workspace\openmrs-module-commonlabtest\api\pom.xml, MavenProject: org.openmrs.module:commonlabtest-omod:1.3.2-SNAPSHOT @ C:\openmrs-workspace\openmrs-module-commonlabtest\omod\pom.xml]
  326. [DEBUG]   (f) session = org.apache.maven.execution.MavenSession@3b0ca5e1
  327. [DEBUG]   (f) settings = org.apache.maven.execution.SettingsAdapter@54dcbb9f
  328. [DEBUG]   (f) useReleaseProfile = false
  329. [DEBUG]   (f) workingDirectory = C:\openmrs-workspace\openmrs-module-commonlabtest\target\checkout
  330. [DEBUG] -- end configuration --
  331. [INFO] Checking out the project to perform the release ...
  332. [INFO] Executing: cmd.exe /X /C "git clone --branch 1.3.1 https://github.com/openmrs/openmrs-module-commonlabtest C:\openmrs-workspace\openmrs-module-commonlabtest\target\checkout"
  333. [INFO] Working directory: C:\openmrs-workspace\openmrs-module-commonlabtest\target
  334. [INFO] Executing: cmd.exe /X /C "git ls-remote https://github.com/openmrs/openmrs-module-commonlabtest"
  335. [INFO] Working directory: C:\Users\owais\AppData\Local\Temp
  336. [DEBUG] a4bbef339ee24e43e57d92ce227f64374dd185da        HEAD
  337. [DEBUG] c5545daf1e2a899b8651f5f347100b3f4c20c2a2        refs/heads/javadoc
  338. [DEBUG] a4bbef339ee24e43e57d92ce227f64374dd185da        refs/heads/master
  339. [DEBUG] c5545daf1e2a899b8651f5f347100b3f4c20c2a2        refs/pull/1/head
  340. [DEBUG] b39b90b9271791f3aaf84b606a17f9f7bc272c32        refs/tags/1.3.0
  341. [DEBUG] bfb687176e420ae5cef13f5a0d3f958c46f969be        refs/tags/1.3.0^{}
  342. [DEBUG] 0011137405cd9bc3614599076ce52f3fa23b2f67        refs/tags/1.3.1
  343. [DEBUG] 3e211d34bbdcd9718e879c53fd56e3ba654a00e0        refs/tags/1.3.1^{}
  344. [INFO] Executing: cmd.exe /X /C "git fetch https://github.com/openmrs/openmrs-module-commonlabtest"
  345. [INFO] Working directory: C:\openmrs-workspace\openmrs-module-commonlabtest\target\checkout
  346. [INFO] Executing: cmd.exe /X /C "git checkout 1.3.1"
  347. [INFO] Working directory: C:\openmrs-workspace\openmrs-module-commonlabtest\target\checkout
  348. [INFO] Executing: cmd.exe /X /C "git ls-files"
  349. [INFO] Working directory: C:\openmrs-workspace\openmrs-module-commonlabtest\target\checkout
  350. [DEBUG] .gitignore
  351. [DEBUG] LICENSE
  352. [DEBUG] OpenMRSFormatter.xml
  353. [DEBUG] README.md
  354. [DEBUG] api/bin/src/main/resources/messages.properties
  355. [DEBUG] api/pom.xml
  356. [DEBUG] api/src/main/java/org/openmrs/module/commonlabtest/CommonLabTestActivator.java
  357. [DEBUG] api/src/main/java/org/openmrs/module/commonlabtest/CommonLabTestConfig.java
  358. [DEBUG] api/src/main/java/org/openmrs/module/commonlabtest/LabTest.java
  359. [DEBUG] api/src/main/java/org/openmrs/module/commonlabtest/LabTestAttribute.java
  360. [DEBUG] api/src/main/java/org/openmrs/module/commonlabtest/LabTestAttributeType.java
  361. [DEBUG] api/src/main/java/org/openmrs/module/commonlabtest/LabTestSample.java
  362. [DEBUG] api/src/main/java/org/openmrs/module/commonlabtest/LabTestType.java
  363. [DEBUG] api/src/main/java/org/openmrs/module/commonlabtest/api/CommonLabTestService.java
  364. [DEBUG] api/src/main/java/org/openmrs/module/commonlabtest/api/dao/CommonLabTestDAO.java
  365. [DEBUG] api/src/main/java/org/openmrs/module/commonlabtest/api/dao/impl/CommonLabTestDAOImpl.java
  366. [DEBUG] api/src/main/java/org/openmrs/module/commonlabtest/api/impl/CommonLabTestServiceImpl.java
  367. [DEBUG] api/src/main/resources/CommonLabTestAttribute.hbm.xml
  368. [DEBUG] api/src/main/resources/liquibase.xml
  369. [DEBUG] api/src/main/resources/messages.properties
  370. [DEBUG] api/src/main/resources/messages_es.properties
  371. [DEBUG] api/src/main/resources/messages_fr.properties
  372. [DEBUG] api/src/main/resources/moduleApplicationContext.xml
  373. [DEBUG] api/src/test/java/org/openmrs/module/commonlabtest/CommonLabTestBase.java
  374. [DEBUG] api/src/test/java/org/openmrs/module/commonlabtest/CommonLabTestDAOTest.java
  375. [DEBUG] api/src/test/java/org/openmrs/module/commonlabtest/CommonLabTestServiceTest.java
  376. [DEBUG] api/src/test/resources/CommonLabTestService-initialData.xml
  377. [DEBUG] api/src/test/resources/TestingApplicationContext.xml
  378. [DEBUG] api/src/test/resources/test-hibernate.cfg.xml
  379. [DEBUG] omod/pom.xml
  380. [DEBUG] omod/src/main/java/org/openmrs/module/commonlabtest/extension/html/AdminList.java
  381. [DEBUG] omod/src/main/java/org/openmrs/module/commonlabtest/extension/html/CommonLabTestExt.java
  382. [DEBUG] omod/src/main/java/org/openmrs/module/commonlabtest/web/controller/LabTestAttributeTypeController.java
  383. [DEBUG] omod/src/main/java/org/openmrs/module/commonlabtest/web/controller/LabTestOrderController.java
  384. [DEBUG] omod/src/main/java/org/openmrs/module/commonlabtest/web/controller/LabTestOrderPortletController.java
  385. [DEBUG] omod/src/main/java/org/openmrs/module/commonlabtest/web/controller/LabTestRequestController.java
  386. [DEBUG] omod/src/main/java/org/openmrs/module/commonlabtest/web/controller/LabTestResultController.java
  387. [DEBUG] omod/src/main/java/org/openmrs/module/commonlabtest/web/controller/LabTestResultViewController.java
  388. [DEBUG] omod/src/main/java/org/openmrs/module/commonlabtest/web/controller/LabTestSampleController.java
  389. [DEBUG] omod/src/main/java/org/openmrs/module/commonlabtest/web/controller/LabTestTypeController.java
  390. [DEBUG] omod/src/main/java/org/openmrs/module/commonlabtest/web/controller/ManageLabTestAttributeTypesController.java
  391. [DEBUG] omod/src/main/java/org/openmrs/module/commonlabtest/web/controller/ManageLabTestSampleController.java
  392. [DEBUG] omod/src/main/java/org/openmrs/module/commonlabtest/web/controller/ManageLabTestTypeController.java
  393. [DEBUG] omod/src/main/java/org/openmrs/module/commonlabtest/web/resource/CommonLabModuleResourceController.java
  394. [DEBUG] omod/src/main/java/org/openmrs/module/commonlabtest/web/resource/LabTestAttributeResourceController.java
  395. [DEBUG] omod/src/main/java/org/openmrs/module/commonlabtest/web/resource/LabTestAttributeTypeResourceController.java
  396. [DEBUG] omod/src/main/java/org/openmrs/module/commonlabtest/web/resource/LabTestOrderResourceController.java
  397. [DEBUG] omod/src/main/java/org/openmrs/module/commonlabtest/web/resource/LabTestSampleResourceController.java
  398. [DEBUG] omod/src/main/java/org/openmrs/module/commonlabtest/web/resource/LabTestTypeResourceController.java
  399. [DEBUG] omod/src/main/resources/config.xml
  400. [DEBUG] omod/src/main/resources/messages.properties
  401. [DEBUG] omod/src/main/resources/webModuleApplicationContext.xml
  402. [DEBUG] omod/src/main/webapp/addLabTest.jsp
  403. [DEBUG] omod/src/main/webapp/addLabTestAttributeType.jsp
  404. [DEBUG] omod/src/main/webapp/addLabTestOrder.jsp
  405. [DEBUG] omod/src/main/webapp/addLabTestRequest.jsp
  406. [DEBUG] omod/src/main/webapp/addLabTestResult.jsp
  407. [DEBUG] omod/src/main/webapp/addLabTestSample.jsp
  408. [DEBUG] omod/src/main/webapp/addLabTestType.jsp
  409. [DEBUG] omod/src/main/webapp/commonlabtest.jsp
  410. [DEBUG] omod/src/main/webapp/include/localHeader.jsp
  411. [DEBUG] omod/src/main/webapp/manageLabTestAttributeTypes.jsp
  412. [DEBUG] omod/src/main/webapp/manageLabTestSamples.jsp
  413. [DEBUG] omod/src/main/webapp/manageLabTestTypes.jsp
  414. [DEBUG] omod/src/main/webapp/manageLabTests.jsp
  415. [DEBUG] omod/src/main/webapp/portlets/patientLabTests.jsp
  416. [DEBUG] omod/src/main/webapp/resources/bootstrap/css/bootstrap-grid.css
  417. [DEBUG] omod/src/main/webapp/resources/bootstrap/css/bootstrap-grid.css.map
  418. [DEBUG] omod/src/main/webapp/resources/bootstrap/css/bootstrap-grid.min.css
  419. [DEBUG] omod/src/main/webapp/resources/bootstrap/css/bootstrap-grid.min.css.map
  420. [DEBUG] omod/src/main/webapp/resources/bootstrap/css/bootstrap-reboot.css
  421. [DEBUG] omod/src/main/webapp/resources/bootstrap/css/bootstrap-reboot.css.map
  422. [DEBUG] omod/src/main/webapp/resources/bootstrap/css/bootstrap-reboot.min.css
  423. [DEBUG] omod/src/main/webapp/resources/bootstrap/css/bootstrap-reboot.min.css.map
  424. [DEBUG] omod/src/main/webapp/resources/bootstrap/css/bootstrap.css
  425. [DEBUG] omod/src/main/webapp/resources/bootstrap/css/bootstrap.css.map
  426. [DEBUG] omod/src/main/webapp/resources/bootstrap/css/bootstrap.min.css
  427. [DEBUG] omod/src/main/webapp/resources/bootstrap/css/bootstrap.min.css.map
  428. [DEBUG] omod/src/main/webapp/resources/bootstrap/fonts/FontAwesome.otf
  429. [DEBUG] omod/src/main/webapp/resources/bootstrap/fonts/fontawesome-webfont.eot
  430. [DEBUG] omod/src/main/webapp/resources/bootstrap/fonts/fontawesome-webfont.svg
  431. [DEBUG] omod/src/main/webapp/resources/bootstrap/fonts/fontawesome-webfont.ttf
  432. [DEBUG] omod/src/main/webapp/resources/bootstrap/fonts/fontawesome-webfont.woff
  433. [DEBUG] omod/src/main/webapp/resources/bootstrap/js/bootstrap.bundle.js
  434. [DEBUG] omod/src/main/webapp/resources/bootstrap/js/bootstrap.bundle.js.map
  435. [DEBUG] omod/src/main/webapp/resources/bootstrap/js/bootstrap.bundle.min.js
  436. [DEBUG] omod/src/main/webapp/resources/bootstrap/js/bootstrap.bundle.min.js.map
  437. [DEBUG] omod/src/main/webapp/resources/bootstrap/js/bootstrap.js
  438. [DEBUG] omod/src/main/webapp/resources/bootstrap/js/bootstrap.js.map
  439. [DEBUG] omod/src/main/webapp/resources/bootstrap/js/bootstrap.min.js
  440. [DEBUG] omod/src/main/webapp/resources/bootstrap/js/bootstrap.min.js.map
  441. [DEBUG] omod/src/main/webapp/resources/bootstrap/js/jquery-3.3.1.min.js
  442. [DEBUG] omod/src/main/webapp/resources/bootstrap/js/popper.min.js
  443. [DEBUG] omod/src/main/webapp/resources/css/bootstrap-grid.css
  444. [DEBUG] omod/src/main/webapp/resources/css/bootstrap-grid.css.map
  445. [DEBUG] omod/src/main/webapp/resources/css/bootstrap-grid.min.css
  446. [DEBUG] omod/src/main/webapp/resources/css/bootstrap-grid.min.css.map
  447. [DEBUG] omod/src/main/webapp/resources/css/bootstrap-reboot.css
  448. [DEBUG] omod/src/main/webapp/resources/css/bootstrap-reboot.css.map
  449. [DEBUG] omod/src/main/webapp/resources/css/bootstrap-reboot.min.css
  450. [DEBUG] omod/src/main/webapp/resources/css/bootstrap-reboot.min.css.map
  451. [DEBUG] omod/src/main/webapp/resources/css/bootstrap.css
  452. [DEBUG] omod/src/main/webapp/resources/css/bootstrap.css.map
  453. [DEBUG] omod/src/main/webapp/resources/css/bootstrap.min.css
  454. [DEBUG] omod/src/main/webapp/resources/css/bootstrap.min.css.map
  455. [DEBUG] omod/src/main/webapp/resources/css/commonlabtest.css
  456. [DEBUG] omod/src/main/webapp/resources/css/commonlabtestform.css
  457. [DEBUG] omod/src/main/webapp/resources/css/custom.css
  458. [DEBUG] omod/src/main/webapp/resources/css/dataTables.bootstrap4.min.css
  459. [DEBUG] omod/src/main/webapp/resources/css/font-awesome.min.css
  460. [DEBUG] omod/src/main/webapp/resources/css/hover-min.css
  461. [DEBUG] omod/src/main/webapp/resources/css/hover.css
  462. [DEBUG] omod/src/main/webapp/resources/css/mdb.css
  463. [DEBUG] omod/src/main/webapp/resources/css/mdb.min.css
  464. [DEBUG] omod/src/main/webapp/resources/css/style.css
  465. [DEBUG] omod/src/main/webapp/resources/css/waitMe.min.css
  466. [DEBUG] omod/src/main/webapp/resources/font-awesome/css/font-awesome.css
  467. [DEBUG] omod/src/main/webapp/resources/font-awesome/css/font-awesome.min.css
  468. [DEBUG] omod/src/main/webapp/resources/font-awesome/fonts/FontAwesome.otf
  469. [DEBUG] omod/src/main/webapp/resources/font-awesome/fonts/fontawesome-webfont.eot
  470. [DEBUG] omod/src/main/webapp/resources/font-awesome/fonts/fontawesome-webfont.svg
  471. [DEBUG] omod/src/main/webapp/resources/font-awesome/fonts/fontawesome-webfont.ttf
  472. [DEBUG] omod/src/main/webapp/resources/font-awesome/fonts/fontawesome-webfont.woff
  473. [DEBUG] omod/src/main/webapp/resources/img/add.png
  474. [DEBUG] omod/src/main/webapp/resources/img/addorder.png
  475. [DEBUG] omod/src/main/webapp/resources/img/addplus.png
  476. [DEBUG] omod/src/main/webapp/resources/img/doublechecked.png
  477. [DEBUG] omod/src/main/webapp/resources/img/edit.png
  478. [DEBUG] omod/src/main/webapp/resources/img/greenchecked.png
  479. [DEBUG] omod/src/main/webapp/resources/img/iconchecked.png
  480. [DEBUG] omod/src/main/webapp/resources/img/plus.png
  481. [DEBUG] omod/src/main/webapp/resources/img/testResult.png
  482. [DEBUG] omod/src/main/webapp/resources/img/testSample.png
  483. [DEBUG] omod/src/main/webapp/resources/img/view.png
  484. [DEBUG] omod/src/main/webapp/resources/js/bootstrap.bundle.js
  485. [DEBUG] omod/src/main/webapp/resources/js/bootstrap.bundle.js.map
  486. [DEBUG] omod/src/main/webapp/resources/js/bootstrap.bundle.min.js
  487. [DEBUG] omod/src/main/webapp/resources/js/bootstrap.bundle.min.js.map
  488. [DEBUG] omod/src/main/webapp/resources/js/bootstrap.js
  489. [DEBUG] omod/src/main/webapp/resources/js/bootstrap.js.map
  490. [DEBUG] omod/src/main/webapp/resources/js/bootstrap.min.js
  491. [DEBUG] omod/src/main/webapp/resources/js/bootstrap.min.js.map
  492. [DEBUG] omod/src/main/webapp/resources/js/commonlabtest.js
  493. [DEBUG] omod/src/main/webapp/resources/js/dataTables.bootstrap4.min.js
  494. [DEBUG] omod/src/main/webapp/resources/js/jquery-3.3.1.js
  495. [DEBUG] omod/src/main/webapp/resources/js/jquery-3.3.1.min.js
  496. [DEBUG] omod/src/main/webapp/resources/js/jquery-ui.min.js
  497. [DEBUG] omod/src/main/webapp/resources/js/jquery.dataTables.min.js
  498. [DEBUG] omod/src/main/webapp/resources/js/mdb.js
  499. [DEBUG] omod/src/main/webapp/resources/js/mdb.min.js
  500. [DEBUG] omod/src/main/webapp/resources/js/popper.min.js
  501. [DEBUG] omod/src/main/webapp/resources/js/waitMe.min.js
  502. [DEBUG] omod/src/test/java/org/openmrs/module/commonlabtest/AdminListExtensionTest.java
  503. [DEBUG] omod/src/test/java/org/openmrs/module/commonlabtest/LabTestAttributeResourceControllerTest.java
  504. [DEBUG] omod/src/test/java/org/openmrs/module/commonlabtest/LabTestAttributeTypeResourceControllerTest.java
  505. [DEBUG] omod/src/test/java/org/openmrs/module/commonlabtest/LabTestOrderResourceControllerTest.java
  506. [DEBUG] omod/src/test/java/org/openmrs/module/commonlabtest/LabTestSampleResourceControllerTest.java
  507. [DEBUG] omod/src/test/java/org/openmrs/module/commonlabtest/LabTestTypeResourceControllerTest.java
  508. [DEBUG] omod/src/test/resources/CommonLabTestService-initialData.xml
  509. [DEBUG] omod/src/test/resources/TestingApplicationContext.xml
  510. [DEBUG] omod/src/test/resources/test-hibernate.cfg.xml
  511. [DEBUG] pom.xml
  512. [INFO] Invoking perform goals in directory C:\openmrs-workspace\openmrs-module-commonlabtest\target\checkout
  513. [INFO] Executing goals 'deploy'...
  514. [DEBUG] Using ${maven.home} of: 'C:\apache-maven-3.3.3'.
  515. [DEBUG] Executing: cmd.exe /X /C "C:\apache-maven-3.3.3\bin\mvn.cmd -X -D maven.repo.local=C:\Users\owais\.m2\repository -s C:\Users\owais\AppData\Local\Temp\release-settings6971368905641444504.xml -P release,openmrs,bintray deploy"
  516. [WARNING] Maven will be executed in interactive mode, but no input stream has been configured for this MavenInvoker instance.
  517. [INFO] Apache Maven 3.3.3 (7994120775791599e205a5524ec3e0dfe41d4a06; 2015-04-22T16:57:37+05:00)
  518. [INFO] Maven home: C:\apache-maven-3.3.3
  519. [INFO] Java version: 1.8.0_121, vendor: Oracle Corporation
  520. [INFO] Java home: C:\Program Files\Java\jdk1.8.0_121\jre
  521. [INFO] Default locale: en_US, platform encoding: Cp1252
  522. [INFO] OS name: "windows 10", version: "10.0", arch: "amd64", family: "dos"
  523. [INFO] [DEBUG] Created new class realm maven.api
  524. [INFO] [DEBUG] Importing foreign packages into class realm maven.api
  525. [INFO] [DEBUG]   Imported: javax.enterprise.inject.* < plexus.core
  526. [INFO] [DEBUG]   Imported: javax.enterprise.util.* < plexus.core
  527. [INFO] [DEBUG]   Imported: javax.inject.* < plexus.core
  528. [INFO] [DEBUG]   Imported: org.apache.maven.* < plexus.core
  529. [INFO] [DEBUG]   Imported: org.apache.maven.artifact < plexus.core
  530. [INFO] [DEBUG]   Imported: org.apache.maven.classrealm < plexus.core
  531. [INFO] [DEBUG]   Imported: org.apache.maven.cli < plexus.core
  532. [INFO] [DEBUG]   Imported: org.apache.maven.configuration < plexus.core
  533. [INFO] [DEBUG]   Imported: org.apache.maven.exception < plexus.core
  534. [INFO] [DEBUG]   Imported: org.apache.maven.execution < plexus.core
  535. [INFO] [DEBUG]   Imported: org.apache.maven.execution.scope < plexus.core
  536. [INFO] [DEBUG]   Imported: org.apache.maven.lifecycle < plexus.core
  537. [INFO] [DEBUG]   Imported: org.apache.maven.model < plexus.core
  538. [INFO] [DEBUG]   Imported: org.apache.maven.monitor < plexus.core
  539. [INFO] [DEBUG]   Imported: org.apache.maven.plugin < plexus.core
  540. [INFO] [DEBUG]   Imported: org.apache.maven.profiles < plexus.core
  541. [INFO] [DEBUG]   Imported: org.apache.maven.project < plexus.core
  542. [INFO] [DEBUG]   Imported: org.apache.maven.reporting < plexus.core
  543. [INFO] [DEBUG]   Imported: org.apache.maven.repository < plexus.core
  544. [INFO] [DEBUG]   Imported: org.apache.maven.rtinfo < plexus.core
  545. [INFO] [DEBUG]   Imported: org.apache.maven.settings < plexus.core
  546. [INFO] [DEBUG]   Imported: org.apache.maven.toolchain < plexus.core
  547. [INFO] [DEBUG]   Imported: org.apache.maven.usability < plexus.core
  548. [INFO] [DEBUG]   Imported: org.apache.maven.wagon.* < plexus.core
  549. [INFO] [DEBUG]   Imported: org.apache.maven.wagon.authentication < plexus.core
  550. [INFO] [DEBUG]   Imported: org.apache.maven.wagon.authorization < plexus.core
  551. [INFO] [DEBUG]   Imported: org.apache.maven.wagon.events < plexus.core
  552. [INFO] [DEBUG]   Imported: org.apache.maven.wagon.observers < plexus.core
  553. [INFO] [DEBUG]   Imported: org.apache.maven.wagon.proxy < plexus.core
  554. [INFO] [DEBUG]   Imported: org.apache.maven.wagon.repository < plexus.core
  555. [INFO] [DEBUG]   Imported: org.apache.maven.wagon.resource < plexus.core
  556. [INFO] [DEBUG]   Imported: org.codehaus.classworlds < plexus.core
  557. [INFO] [DEBUG]   Imported: org.codehaus.plexus.* < plexus.core
  558. [INFO] [DEBUG]   Imported: org.codehaus.plexus.classworlds < plexus.core
  559. [INFO] [DEBUG]   Imported: org.codehaus.plexus.component < plexus.core
  560. [INFO] [DEBUG]   Imported: org.codehaus.plexus.configuration < plexus.core
  561. [INFO] [DEBUG]   Imported: org.codehaus.plexus.container < plexus.core
  562. [INFO] [DEBUG]   Imported: org.codehaus.plexus.context < plexus.core
  563. [INFO] [DEBUG]   Imported: org.codehaus.plexus.lifecycle < plexus.core
  564. [INFO] [DEBUG]   Imported: org.codehaus.plexus.logging < plexus.core
  565. [INFO] [DEBUG]   Imported: org.codehaus.plexus.personality < plexus.core
  566. [INFO] [DEBUG]   Imported: org.codehaus.plexus.util.xml.Xpp3Dom < plexus.core
  567. [INFO] [DEBUG]   Imported: org.codehaus.plexus.util.xml.pull.XmlPullParser < plexus.core
  568. [INFO] [DEBUG]   Imported: org.codehaus.plexus.util.xml.pull.XmlPullParserException < plexus.core
  569. [INFO] [DEBUG]   Imported: org.codehaus.plexus.util.xml.pull.XmlSerializer < plexus.core
  570. [INFO] [DEBUG]   Imported: org.eclipse.aether.* < plexus.core
  571. [INFO] [DEBUG]   Imported: org.eclipse.aether.artifact < plexus.core
  572. [INFO] [DEBUG]   Imported: org.eclipse.aether.collection < plexus.core
  573. [INFO] [DEBUG]   Imported: org.eclipse.aether.deployment < plexus.core
  574. [INFO] [DEBUG]   Imported: org.eclipse.aether.graph < plexus.core
  575. [INFO] [DEBUG]   Imported: org.eclipse.aether.impl < plexus.core
  576. [INFO] [DEBUG]   Imported: org.eclipse.aether.installation < plexus.core
  577. [INFO] [DEBUG]   Imported: org.eclipse.aether.internal.impl < plexus.core
  578. [INFO] [DEBUG]   Imported: org.eclipse.aether.metadata < plexus.core
  579. [INFO] [DEBUG]   Imported: org.eclipse.aether.repository < plexus.core
  580. [INFO] [DEBUG]   Imported: org.eclipse.aether.resolution < plexus.core
  581. [INFO] [DEBUG]   Imported: org.eclipse.aether.spi < plexus.core
  582. [INFO] [DEBUG]   Imported: org.eclipse.aether.transfer < plexus.core
  583. [INFO] [DEBUG]   Imported: org.eclipse.aether.version < plexus.core
  584. [INFO] [DEBUG]   Imported: org.slf4j.* < plexus.core
  585. [INFO] [DEBUG]   Imported: org.slf4j.spi.* < plexus.core
  586. [INFO] [DEBUG] Populating class realm maven.api
  587. [INFO] [INFO] Error stacktraces are turned on.
  588. [INFO] [DEBUG] Reading global settings from C:\apache-maven-3.3.3\conf\settings.xml
  589. [INFO] [DEBUG] Reading user settings from C:\Users\owais\AppData\Local\Temp\release-settings6971368905641444504.xml
  590. [INFO] [DEBUG] Reading global toolchains from C:\apache-maven-3.3.3\conf\toolchains.xml
  591. [INFO] [DEBUG] Reading user toolchains from C:\Users\owais\.m2\toolchains.xml
  592. [INFO] [DEBUG] Using local repository at C:\Users\owais\.m2\repository
  593. [INFO] [DEBUG] Using manager EnhancedLocalRepositoryManager with priority 10.0 for C:\Users\owais\.m2\repository
  594. [INFO] [INFO] Scanning for projects...
  595. [INFO] [DEBUG] Extension realms for project org.openmrs.module:commonlabtest:pom:1.3.1: (none)
  596. [INFO] [DEBUG] Looking up lifecyle mappings for packaging pom from ClassRealm[plexus.core, parent: null]
  597. [INFO] [DEBUG] Extension realms for project org.openmrs.maven.parents:maven-parent-openmrs-module:pom:1.1.1: (none)
  598. [INFO] [DEBUG] Looking up lifecyle mappings for packaging pom from ClassRealm[plexus.core, parent: null]
  599. [INFO] [DEBUG] Extension realms for project org.openmrs.module:commonlabtest-api:jar:1.3.1: (none)
  600. [INFO] [DEBUG] Looking up lifecyle mappings for packaging jar from ClassRealm[plexus.core, parent: null]
  601. [INFO] [DEBUG] Dependency collection stats: {ConflictMarker.analyzeTime=2, ConflictMarker.markTime=1, ConflictMarker.nodeCount=80, ConflictIdSorter.graphTime=1, ConflictIdSorter.topsortTime=1, ConflictIdSorter.conflictIdCount=20, ConflictIdSorter.conflictIdCycleCount=0, ConflictResolver.totalTime=6, ConflictResolver.conflictItemCount=49, DefaultDependencyCollector.collectTime=347, DefaultDependencyCollector.transformTime=14}
  602. [INFO] [DEBUG] org.openmrs.maven.plugins:maven-openmrs-plugin:jar:1.0.1:
  603. [INFO] [DEBUG]    org.apache.maven:maven-plugin-api:jar:2.0:compile
  604. [INFO] [DEBUG]    org.apache.maven:maven-archiver:jar:2.2:compile
  605. [INFO] [DEBUG]       org.codehaus.plexus:plexus-archiver:jar:1.0-alpha-7:compile
  606. [INFO] [DEBUG]       org.apache.maven:maven-artifact:jar:2.0:compile
  607. [INFO] [DEBUG]    org.apache.maven:maven-model:jar:2.0.10:compile
  608. [INFO] [DEBUG]    org.apache.maven:maven-project:jar:2.0.10:compile
  609. [INFO] [DEBUG]       org.apache.maven:maven-settings:jar:2.0.10:compile
  610. [INFO] [DEBUG]       org.apache.maven:maven-profile:jar:2.0.10:compile
  611. [INFO] [DEBUG]       org.apache.maven:maven-artifact-manager:jar:2.0.10:compile
  612. [INFO] [DEBUG]          org.apache.maven:maven-repository-metadata:jar:2.0.10:compile
  613. [INFO] [DEBUG]       org.apache.maven:maven-plugin-registry:jar:2.0.10:compile
  614. [INFO] [DEBUG]       org.codehaus.plexus:plexus-interpolation:jar:1.1:compile
  615. [INFO] [DEBUG]       org.codehaus.plexus:plexus-container-default:jar:1.0-alpha-9-stable-1:compile
  616. [INFO] [DEBUG]          junit:junit:jar:3.8.1:compile
  617. [INFO] [DEBUG]          classworlds:classworlds:jar:1.1-alpha-2:compile
  618. [INFO] [DEBUG]    org.apache.maven.shared:file-management:jar:1.2.1:compile
  619. [INFO] [DEBUG]       org.apache.maven.shared:maven-shared-io:jar:1.1:compile
  620. [INFO] [DEBUG]          org.apache.maven.wagon:wagon-provider-api:jar:1.0-alpha-6:compile
  621. [INFO] [DEBUG]    org.codehaus.plexus:plexus-utils:jar:1.5.5:compile
  622. [INFO] [DEBUG] Created new class realm extension>org.openmrs.maven.plugins:maven-openmrs-plugin:1.0.1
  623. [INFO] [DEBUG] Importing foreign packages into class realm extension>org.openmrs.maven.plugins:maven-openmrs-plugin:1.0.1
  624. [INFO] [DEBUG]   Imported:  < maven.api
  625. [INFO] [DEBUG] Populating class realm extension>org.openmrs.maven.plugins:maven-openmrs-plugin:1.0.1
  626. [INFO] [DEBUG]   Included: org.openmrs.maven.plugins:maven-openmrs-plugin:jar:1.0.1
  627. [INFO] [DEBUG]   Included: org.apache.maven:maven-archiver:jar:2.2
  628. [INFO] [DEBUG]   Included: org.codehaus.plexus:plexus-archiver:jar:1.0-alpha-7
  629. [INFO] [DEBUG]   Included: org.codehaus.plexus:plexus-interpolation:jar:1.1
  630. [INFO] [DEBUG]   Included: junit:junit:jar:3.8.1
  631. [INFO] [DEBUG]   Included: org.apache.maven.shared:file-management:jar:1.2.1
  632. [INFO] [DEBUG]   Included: org.apache.maven.shared:maven-shared-io:jar:1.1
  633. [INFO] [DEBUG]   Included: org.codehaus.plexus:plexus-utils:jar:1.5.5
  634. [INFO] [DEBUG] Extension realms for project org.openmrs.module:commonlabtest-omod:jar:1.3.1: [ClassRealm[extension>org.openmrs.maven.plugins:maven-openmrs-plugin:1.0.1, parent: sun.misc.Launcher$AppClassLoader@55f96302]]
  635. [INFO] [DEBUG] Created new class realm project>org.openmrs.module:commonlabtest-omod:1.3.1
  636. [INFO] [DEBUG] Populating class realm project>org.openmrs.module:commonlabtest-omod:1.3.1
  637. [INFO] [DEBUG] Looking up lifecyle mappings for packaging jar from ClassRealm[project>org.openmrs.module:commonlabtest-omod:1.3.1, parent: ClassRealm[maven.api, parent: null]]
  638. [INFO] [WARNING]
  639. [INFO] [WARNING] Some problems were encountered while building the effective model for org.openmrs.module:commonlabtest-omod:jar:1.3.1
  640. [INFO] [WARNING] 'build.plugins.plugin.version' for org.jacoco:jacoco-maven-plugin is missing. @ org.openmrs.module:commonlabtest-omod:[unknown-version], C:\openmrs-workspace\openmrs-module-commonlabtest\target\checkout\omod\pom.xml, line 115, column 13
  641. [INFO] [WARNING]
  642. [INFO] [WARNING] It is highly recommended to fix these problems because they threaten the stability of your build.
  643. [INFO] [WARNING]
  644. [INFO] [WARNING] For this reason, future Maven versions might no longer support building such malformed projects.
  645. [INFO] [WARNING]
  646. [INFO] [INFO] ------------------------------------------------------------------------
  647. [INFO] [INFO] Reactor Build Order:
  648. [INFO] [INFO]
  649. [INFO] [INFO] Common Lab Test
  650. [INFO] [INFO] Common Lab Test API
  651. [INFO] [INFO] Common Lab Test OMOD
  652. [INFO] [DEBUG] === REACTOR BUILD PLAN ================================================
  653. [INFO] [DEBUG] Project: org.openmrs.module:commonlabtest:pom:1.3.1
  654. [INFO] [DEBUG] Tasks:   [deploy]
  655. [INFO] [DEBUG] Style:   Regular
  656. [INFO] [DEBUG] -----------------------------------------------------------------------
  657. [INFO] [DEBUG] Project: org.openmrs.module:commonlabtest-api:jar:1.3.1
  658. [INFO] [DEBUG] Tasks:   [deploy]
  659. [INFO] [DEBUG] Style:   Regular
  660. [INFO] [DEBUG] -----------------------------------------------------------------------
  661. [INFO] [DEBUG] Project: org.openmrs.module:commonlabtest-omod:jar:1.3.1
  662. [INFO] [DEBUG] Tasks:   [deploy]
  663. [INFO] [DEBUG] Style:   Regular
  664. [INFO] [DEBUG] =======================================================================
  665. [INFO] [INFO]
  666. [INFO] [INFO] ------------------------------------------------------------------------
  667. [INFO] [INFO] Building Common Lab Test 1.3.1
  668. [INFO] [INFO] ------------------------------------------------------------------------
  669. [INFO] [DEBUG] Resolving plugin version for org.apache.maven.plugins:maven-compiler-plugin
  670. [INFO] [DEBUG] Could not find metadata org.apache.maven.plugins:maven-compiler-plugin/maven-metadata.xml in local (C:\Users\owais\.m2\repository)
  671. [INFO] [DEBUG] Skipped remote request for org.apache.maven.plugins:maven-compiler-plugin/maven-metadata.xml, locally cached metadata up-to-date.
  672. [INFO] [DEBUG] Failure to find org.apache.maven.plugins:maven-compiler-plugin/maven-metadata.xml in https://dl.bintray.com/openmrs/maven/ was cached in the local repository, resolution will not be reattempted until the update interval of openmrs-bintray-repo has elapsed or updates are forced
  673. [INFO] [DEBUG] Skipped remote request for org.apache.maven.plugins:maven-compiler-plugin/maven-metadata.xml, locally cached metadata up-to-date.
  674. [INFO] [DEBUG] Resolved plugin version for org.apache.maven.plugins:maven-compiler-plugin to 3.8.0 from repository openmrs-repo (http://mavenrepo.openmrs.org/nexus/content/repositories/public, default, releases)
  675. [INFO] [DEBUG] Lifecycle default -> [validate, initialize, generate-sources, process-sources, generate-resources, process-resources, compile, process-classes, generate-test-sources, process-test-sources, generate-test-resources, process-test-resources, test-compile, process-test-classes, test, prepare-package, package, pre-integration-test, integration-test, post-integration-test, verify, install, deploy]
  676. [INFO] [DEBUG] Lifecycle clean -> [pre-clean, clean, post-clean]
  677. [INFO] [DEBUG] Lifecycle site -> [pre-site, site, post-site, site-deploy]
  678. [INFO] [DEBUG] Lifecycle default -> [validate, initialize, generate-sources, process-sources, generate-resources, process-resources, compile, process-classes, generate-test-sources, process-test-sources, generate-test-resources, process-test-resources, test-compile, process-test-classes, test, prepare-package, package, pre-integration-test, integration-test, post-integration-test, verify, install, deploy]
  679. [INFO] [DEBUG] Lifecycle clean -> [pre-clean, clean, post-clean]
  680. [INFO] [DEBUG] Lifecycle site -> [pre-site, site, post-site, site-deploy]
  681. [INFO] [DEBUG] Lifecycle default -> [validate, initialize, generate-sources, process-sources, generate-resources, process-resources, compile, process-classes, generate-test-sources, process-test-sources, generate-test-resources, process-test-resources, test-compile, process-test-classes, test, prepare-package, package, pre-integration-test, integration-test, post-integration-test, verify, install, deploy]
  682. [INFO] [DEBUG] Lifecycle clean -> [pre-clean, clean, post-clean]
  683. [INFO] [DEBUG] Lifecycle site -> [pre-site, site, post-site, site-deploy]
  684. [INFO] [DEBUG] Lifecycle default -> [validate, initialize, generate-sources, process-sources, generate-resources, process-resources, compile, process-classes, generate-test-sources, process-test-sources, generate-test-resources, process-test-resources, test-compile, process-test-classes, test, prepare-package, package, pre-integration-test, integration-test, post-integration-test, verify, install, deploy]
  685. [INFO] [DEBUG] Lifecycle clean -> [pre-clean, clean, post-clean]
  686. [INFO] [DEBUG] Lifecycle site -> [pre-site, site, post-site, site-deploy]
  687. [INFO] [DEBUG] Lifecycle default -> [validate, initialize, generate-sources, process-sources, generate-resources, process-resources, compile, process-classes, generate-test-sources, process-test-sources, generate-test-resources, process-test-resources, test-compile, process-test-classes, test, prepare-package, package, pre-integration-test, integration-test, post-integration-test, verify, install, deploy]
  688. [INFO] [DEBUG] Lifecycle clean -> [pre-clean, clean, post-clean]
  689. [INFO] [DEBUG] Lifecycle site -> [pre-site, site, post-site, site-deploy]
  690. [INFO] [DEBUG] Lifecycle default -> [validate, initialize, generate-sources, process-sources, generate-resources, process-resources, compile, process-classes, generate-test-sources, process-test-sources, generate-test-resources, process-test-resources, test-compile, process-test-classes, test, prepare-package, package, pre-integration-test, integration-test, post-integration-test, verify, install, deploy]
  691. [INFO] [DEBUG] Lifecycle clean -> [pre-clean, clean, post-clean]
  692. [INFO] [DEBUG] Lifecycle site -> [pre-site, site, post-site, site-deploy]
  693. [INFO] [DEBUG] Lifecycle default -> [validate, initialize, generate-sources, process-sources, generate-resources, process-resources, compile, process-classes, generate-test-sources, process-test-sources, generate-test-resources, process-test-resources, test-compile, process-test-classes, test, prepare-package, package, pre-integration-test, integration-test, post-integration-test, verify, install, deploy]
  694. [INFO] [DEBUG] Lifecycle clean -> [pre-clean, clean, post-clean]
  695. [INFO] [DEBUG] Lifecycle site -> [pre-site, site, post-site, site-deploy]
  696. [INFO] [DEBUG] Lifecycle default -> [validate, initialize, generate-sources, process-sources, generate-resources, process-resources, compile, process-classes, generate-test-sources, process-test-sources, generate-test-resources, process-test-resources, test-compile, process-test-classes, test, prepare-package, package, pre-integration-test, integration-test, post-integration-test, verify, install, deploy]
  697. [INFO] [DEBUG] Lifecycle clean -> [pre-clean, clean, post-clean]
  698. [INFO] [DEBUG] Lifecycle site -> [pre-site, site, post-site, site-deploy]
  699. [INFO] [DEBUG] === PROJECT BUILD PLAN ================================================
  700. [INFO] [DEBUG] Project:       org.openmrs.module:commonlabtest:1.3.1
  701. [INFO] [DEBUG] Dependencies (collect): []
  702. [INFO] [DEBUG] Dependencies (resolve): [compile]
  703. [INFO] [DEBUG] Repositories (dependencies): [openmrs-repo (http://mavenrepo.openmrs.org/nexus/content/repositories/public, default, releases+snapshots), openmrs-repo-thirdparty (http://mavenrepo.openmrs.org/nexus/content/repositories/thirdparty, default, releases+snapshots), openmrs-bintray-repo (https://dl.bintray.com/openmrs/maven/, default, releases+snapshots), central (http://repo1.maven.org/maven2, default, releases+snapshots)]
  704. [INFO] [DEBUG] Repositories (plugins)     : [openmrs-repo (http://mavenrepo.openmrs.org/nexus/content/repositories/public, default, releases), openmrs-bintray-repo (https://dl.bintray.com/openmrs/maven/, default, releases+snapshots), central (https://repo.maven.apache.org/maven2, default, releases)]
  705. [INFO] [DEBUG] -----------------------------------------------------------------------
  706. [INFO] [DEBUG] Goal:          org.codehaus.mojo:buildnumber-maven-plugin:1.1:create (default)
  707. [INFO] [DEBUG] Style:         Regular
  708. [INFO] [DEBUG] Configuration: <?xml version="1.0" encoding="UTF-8"?>
  709. [INFO] <configuration>
  710. [INFO]   <buildNumberPropertiesFileLocation default-value="${basedir}/buildNumber.properties"/>
  711. [INFO]   <buildNumberPropertyName default-value="buildNumber">revisionNumber</buildNumberPropertyName>
  712. [INFO]   <doCheck default-value="false">${maven.buildNumber.doCheck}</doCheck>
  713. [INFO]   <doUpdate default-value="false">${maven.buildNumber.doUpdate}</doUpdate>
  714. [INFO]   <getRevisionOnlyOnce default-value="false">true</getRevisionOnlyOnce>
  715. [INFO]   <locale>${maven.buildNumber.locale}</locale>
  716. [INFO]   <password>${password}</password>
  717. [INFO]   <project>${project}</project>
  718. [INFO]   <reactorProjects>${reactorProjects}</reactorProjects>
  719. [INFO]   <readUrlScm>${project.scm.connection}</readUrlScm>
  720. [INFO]   <revisionOnScmFailure>0</revisionOnScmFailure>
  721. [INFO]   <scmBranchPropertyName default-value="scmBranch">${maven.buildNumber.scmBranchPropertyName}</scmBranchPropertyName>
  722. [INFO]   <scmDirectory default-value="${basedir}">${maven.buildNumber.scmDirectory}</scmDirectory>
  723. [INFO]   <session>${session}</session>
  724. [INFO]   <shortRevisionLength>6</shortRevisionLength>
  725. [INFO]   <timestampPropertyName default-value="timestamp">${maven.buildNumber.timestampPropertyName}</timestampPropertyName>
  726. [INFO]   <urlScm>${project.scm.developerConnection}</urlScm>
  727. [INFO]   <useLastCommittedRevision default-value="false">${maven.buildNumber.useLastCommittedRevision}</useLastCommittedRevision>
  728. [INFO]   <username>${username}</username>
  729. [INFO] </configuration>
  730. [INFO] [DEBUG] -----------------------------------------------------------------------
  731. [INFO] [DEBUG] Goal:          com.googlecode.maven-java-formatter-plugin:maven-java-formatter-plugin:0.4:format (default)
  732. [INFO] [DEBUG] Style:         Regular
  733. [INFO] [DEBUG] Configuration: <?xml version="1.0" encoding="UTF-8"?>
  734. [INFO] <configuration>
  735. [INFO]   <basedir>${basedir}</basedir>
  736. [INFO]   <compilerCompliance default-value="1.5">${maven.compiler.source}</compilerCompliance>
  737. [INFO]   <compilerSource default-value="1.5">${maven.compiler.source}</compilerSource>
  738. [INFO]   <compilerTargetPlatform default-value="1.5">${maven.compiler.target}</compilerTargetPlatform>
  739. [INFO]   <configFile>eclipse/OpenMRSFormatter.xml</configFile>
  740. [INFO]   <encoding default-value="${project.build.sourceEncoding}"/>
  741. [INFO]   <lineEnding default-value="AUTO">LF</lineEnding>
  742. [INFO]   <overrideConfigCompilerVersion default-value="false">true</overrideConfigCompilerVersion>
  743. [INFO]   <sourceDirectory>${project.build.sourceDirectory}</sourceDirectory>
  744. [INFO]   <targetDirectory>${project.build.directory}</targetDirectory>
  745. [INFO]   <testSourceDirectory>${project.build.testSourceDirectory}</testSourceDirectory>
  746. [INFO] </configuration>
  747. [INFO] [DEBUG] -----------------------------------------------------------------------
  748. [INFO] [DEBUG] Goal:          net.revelc.code.formatter:formatter-maven-plugin:2.7.1:format (default)
  749. [INFO] [DEBUG] Style:         Regular
  750. [INFO] [DEBUG] Configuration: <?xml version="1.0" encoding="UTF-8"?>
  751. [INFO] <configuration>
  752. [INFO]   <basedir default-value=".">${project.basedir}</basedir>
  753. [INFO]   <compilerCompliance default-value="1.6">${maven.compiler.source}</compilerCompliance>
  754. [INFO]   <compilerSource default-value="1.6">${maven.compiler.source}</compilerSource>
  755. [INFO]   <compilerTargetPlatform default-value="1.6">${maven.compiler.target}</compilerTargetPlatform>
  756. [INFO]   <configCssFile default-value="formatter-maven-plugin/ph-css/css.properties">${configcssfile}</configCssFile>
  757. [INFO]   <configFile default-value="formatter-maven-plugin/eclipse/java.xml">../OpenMRSFormatter.xml</configFile>
  758. [INFO]   <configHtmlFile default-value="formatter-maven-plugin/jsoup/html.properties">${confightmlfile}</configHtmlFile>
  759. [INFO]   <configJsFile default-value="formatter-maven-plugin/eclipse/javascript.xml">${configjsfile}</configJsFile>
  760. [INFO]   <configJsonFile default-value="formatter-maven-plugin/jackson/json.properties">${configjsonfile}</configJsonFile>
  761. [INFO]   <configXmlFile default-value="formatter-maven-plugin/jsoup/xml.properties">${configxmlfile}</configXmlFile>
  762. [INFO]   <directories>
  763. [INFO]     <directory>.</directory>
  764. [INFO]   </directories>
  765. [INFO]   <encoding>${project.build.sourceEncoding}</encoding>
  766. [INFO]   <includes>
  767. [INFO]     <include>**/*.java</include>
  768. [INFO]     <include>**/*.json</include>${formatter.includes}</includes>
  769. [INFO]   <lineEnding default-value="AUTO">${lineending}</lineEnding>
  770. [INFO]   <skipCssFormatting default-value="false">${formatter.css.skip}</skipCssFormatting>
  771. [INFO]   <skipFormatting default-value="false">${formatter.skip}</skipFormatting>
  772. [INFO]   <skipHtmlFormatting default-value="false">${formatter.html.skip}</skipHtmlFormatting>
  773. [INFO]   <skipJavaFormatting default-value="false">${formatter.java.skip}</skipJavaFormatting>
  774. [INFO]   <skipJsFormatting default-value="false">${formatter.js.skip}</skipJsFormatting>
  775. [INFO]   <skipJsonFormatting default-value="false">${formatter.json.skip}</skipJsonFormatting>
  776. [INFO]   <skipXmlFormatting default-value="false">${formatter.xml.skip}</skipXmlFormatting>
  777. [INFO]   <sourceDirectory default-value="${project.build.sourceDirectory}">${sourceDirectory}</sourceDirectory>
  778. [INFO]   <targetDirectory default-value="${project.build.directory}"/>
  779. [INFO]   <testSourceDirectory default-value="${project.build.testSourceDirectory}">${testSourceDirectory}</testSourceDirectory>
  780. [INFO]   <useEclipseDefaults default-value="false">${formatter.useEclipseDefaults}</useEclipseDefaults>
  781. [INFO] </configuration>
  782. [INFO] [DEBUG] --- init fork of org.openmrs.module:commonlabtest:1.3.1 for org.apache.maven.plugins:maven-source-plugin:2.1.2:jar (attach-sources) ---
  783. [INFO] [DEBUG] Dependencies (collect): []
  784. [INFO] [DEBUG] Dependencies (resolve): []
  785. [INFO] [DEBUG] -----------------------------------------------------------------------
  786. [INFO] [DEBUG] Goal:          org.codehaus.mojo:buildnumber-maven-plugin:1.1:create (default)
  787. [INFO] [DEBUG] Style:         Regular
  788. [INFO] [DEBUG] Configuration: <?xml version="1.0" encoding="UTF-8"?>
  789. [INFO] <configuration>
  790. [INFO]   <buildNumberPropertiesFileLocation default-value="${basedir}/buildNumber.properties"/>
  791. [INFO]   <buildNumberPropertyName default-value="buildNumber">revisionNumber</buildNumberPropertyName>
  792. [INFO]   <doCheck default-value="false">${maven.buildNumber.doCheck}</doCheck>
  793. [INFO]   <doUpdate default-value="false">${maven.buildNumber.doUpdate}</doUpdate>
  794. [INFO]   <getRevisionOnlyOnce default-value="false">true</getRevisionOnlyOnce>
  795. [INFO]   <locale>${maven.buildNumber.locale}</locale>
  796. [INFO]   <password>${password}</password>
  797. [INFO]   <project>${project}</project>
  798. [INFO]   <reactorProjects>${reactorProjects}</reactorProjects>
  799. [INFO]   <readUrlScm>${project.scm.connection}</readUrlScm>
  800. [INFO]   <revisionOnScmFailure>0</revisionOnScmFailure>
  801. [INFO]   <scmBranchPropertyName default-value="scmBranch">${maven.buildNumber.scmBranchPropertyName}</scmBranchPropertyName>
  802. [INFO]   <scmDirectory default-value="${basedir}">${maven.buildNumber.scmDirectory}</scmDirectory>
  803. [INFO]   <session>${session}</session>
  804. [INFO]   <shortRevisionLength>6</shortRevisionLength>
  805. [INFO]   <timestampPropertyName default-value="timestamp">${maven.buildNumber.timestampPropertyName}</timestampPropertyName>
  806. [INFO]   <urlScm>${project.scm.developerConnection}</urlScm>
  807. [INFO]   <useLastCommittedRevision default-value="false">${maven.buildNumber.useLastCommittedRevision}</useLastCommittedRevision>
  808. [INFO]   <username>${username}</username>
  809. [INFO] </configuration>
  810. [INFO] [DEBUG] --- exit fork of org.openmrs.module:commonlabtest:1.3.1 for org.apache.maven.plugins:maven-source-plugin:2.1.2:jar (attach-sources) ---
  811. [INFO] [DEBUG] -----------------------------------------------------------------------
  812. [INFO] [DEBUG] Goal:          org.apache.maven.plugins:maven-source-plugin:2.1.2:jar (attach-sources)
  813. [INFO] [DEBUG] Style:         Regular
  814. [INFO] [DEBUG] Configuration: <?xml version="1.0" encoding="UTF-8"?>
  815. [INFO] <configuration>
  816. [INFO]   <attach default-value="true">${attach}</attach>
  817. [INFO]   <defaultManifestFile default-value="${project.build.outputDirectory}/META-INF/MANIFEST.MF"/>
  818. [INFO]   <excludeResources default-value="false">${source.excludeResources}</excludeResources>
  819. [INFO]   <finalName default-value="${project.build.finalName}"/>
  820. [INFO]   <forceCreation default-value="false">${source.forceCreation}</forceCreation>
  821. [INFO]   <includePom default-value="false">${source.includePom}</includePom>
  822. [INFO]   <outputDirectory default-value="${project.build.directory}"/>
  823. [INFO]   <project>${project}</project>
  824. [INFO]   <reactorProjects>${reactorProjects}</reactorProjects>
  825. [INFO]   <useDefaultExcludes default-value="true"/>
  826. [INFO]   <useDefaultManifestFile default-value="false"/>
  827. [INFO] </configuration>
  828. [INFO] [DEBUG] -----------------------------------------------------------------------
  829. [INFO] [DEBUG] Goal:          org.apache.maven.plugins:maven-javadoc-plugin:2.8.1:jar (attach-javadocs)
  830. [INFO] [DEBUG] Style:         Regular
  831. [INFO] [DEBUG] Configuration: <?xml version="1.0" encoding="UTF-8"?>
  832. [INFO] <configuration>
  833. [INFO]   <additionalJOption>${additionalJOption}</additionalJOption>
  834. [INFO]   <additionalparam>${additionalparam}</additionalparam>
  835. [INFO]   <aggregate default-value="false">${aggregate}</aggregate>
  836. [INFO]   <attach default-value="true">${attach}</attach>
  837. [INFO]   <author default-value="true">${author}</author>
  838. [INFO]   <bootclasspath>${bootclasspath}</bootclasspath>
  839. [INFO]   <bootclasspathArtifacts>${bootclasspathArtifacts}</bootclasspathArtifacts>
  840. [INFO]   <bottom default-value="Copyright &amp;#169; {inceptionYear}-{currentYear} {organizationName}. All Rights Reserved.">${bottom}</bottom>
  841. [INFO]   <breakiterator default-value="false">${breakiterator}</breakiterator>
  842. [INFO]   <charset>${charset}</charset>
  843. [INFO]   <debug default-value="false">${debug}</debug>
  844. [INFO]   <defaultManifestFile>${project.build.outputDirectory}/META-INF/MANIFEST.MF</defaultManifestFile>
  845. [INFO]   <destDir>${destDir}</destDir>
  846. [INFO]   <detectJavaApiLink default-value="true">${detectJavaApiLink}</detectJavaApiLink>
  847. [INFO]   <detectLinks default-value="false">${detectLinks}</detectLinks>
  848. [INFO]   <detectOfflineLinks default-value="true">${detectOfflineLinks}</detectOfflineLinks>
  849. [INFO]   <docencoding default-value="${project.reporting.outputEncoding}">${docencoding}</docencoding>
  850. [INFO]   <docfilessubdirs default-value="false">${docfilessubdirs}</docfilessubdirs>
  851. [INFO]   <doclet>${doclet}</doclet>
  852. [INFO]   <docletArtifact>${docletArtifact}</docletArtifact>
  853. [INFO]   <docletArtifacts>${docletArtifacts}</docletArtifacts>
  854. [INFO]   <docletPath>${docletPath}</docletPath>
  855. [INFO]   <doctitle default-value="${project.name} ${project.version} API">${doctitle}</doctitle>
  856. [INFO]   <encoding default-value="${project.build.sourceEncoding}">${encoding}</encoding>
  857. [INFO]   <excludePackageNames>${excludePackageNames}</excludePackageNames>
  858. [INFO]   <excludedocfilessubdir>${excludedocfilessubdir}</excludedocfilessubdir>
  859. [INFO]   <extdirs>${extdirs}</extdirs>
  860. [INFO]   <failOnError default-value="true">${maven.javadoc.failOnError}</failOnError>
  861. [INFO]   <finalName>${project.build.finalName}</finalName>
  862. [INFO]   <footer>${footer}</footer>
  863. [INFO]   <groups>${groups}</groups>
  864. [INFO]   <header>${header}</header>
  865. [INFO]   <helpfile>${helpfile}</helpfile>
  866. [INFO]   <includeDependencySources default-value="false"/>
  867. [INFO]   <includeTransitiveDependencySources default-value="false"/>
  868. [INFO]   <isOffline default-value="${settings.offline}"/>
  869. [INFO]   <jarOutputDirectory>${project.build.directory}</jarOutputDirectory>
  870. [INFO]   <javaApiLinks>${javaApiLinks}</javaApiLinks>
  871. [INFO]   <javadocDirectory>${basedir}/src/main/javadoc</javadocDirectory>
  872. [INFO]   <javadocExecutable>${javadocExecutable}</javadocExecutable>
  873. [INFO]   <javadocOptionsDir default-value="${project.build.directory}/javadoc-bundle-options"/>
  874. [INFO]   <javadocVersion>${javadocVersion}</javadocVersion>
  875. [INFO]   <keywords default-value="false">${keywords}</keywords>
  876. [INFO]   <links>${links}</links>
  877. [INFO]   <linksource default-value="false">${linksource}</linksource>
  878. [INFO]   <localRepository>${localRepository}</localRepository>
  879. [INFO]   <locale>${locale}</locale>
  880. [INFO]   <maxmemory>${maxmemory}</maxmemory>
  881. [INFO]   <minmemory>${minmemory}</minmemory>
  882. [INFO]   <nocomment default-value="false">${nocomment}</nocomment>
  883. [INFO]   <nodeprecated default-value="false">${nodeprecated}</nodeprecated>
  884. [INFO]   <nodeprecatedlist default-value="false">${nodeprecatedlist}</nodeprecatedlist>
  885. [INFO]   <nohelp default-value="false">${nohelp}</nohelp>
  886. [INFO]   <noindex default-value="false">${noindex}</noindex>
  887. [INFO]   <nonavbar default-value="false">${nonavbar}</nonavbar>
  888. [INFO]   <nooverview default-value="false">${nooverview}</nooverview>
  889. [INFO]   <noqualifier>${noqualifier}</noqualifier>
  890. [INFO]   <nosince default-value="false">${nosince}</nosince>
  891. [INFO]   <notimestamp default-value="false">${notimestamp}</notimestamp>
  892. [INFO]   <notree default-value="false">${notree}</notree>
  893. [INFO]   <offlineLinks>${offlineLinks}</offlineLinks>
  894. [INFO]   <old default-value="false">${old}</old>
  895. [INFO]   <outputDirectory default-value="${project.build.directory}/apidocs">${destDir}</outputDirectory>
  896. [INFO]   <overview default-value="${basedir}/src/main/javadoc/overview.html">${overview}</overview>
  897. [INFO]   <packagesheader>${packagesheader}</packagesheader>
  898. [INFO]   <project>${project}</project>
  899. [INFO]   <proxyHost>${proxyHost}</proxyHost>
  900. [INFO]   <proxyPort>${proxyPort}</proxyPort>
  901. [INFO]   <quiet default-value="false">${quiet}</quiet>
  902. [INFO]   <reactorProjects>${reactorProjects}</reactorProjects>
  903. [INFO]   <remoteRepositories>${project.remoteArtifactRepositories}</remoteRepositories>
  904. [INFO]   <resourcesArtifacts>${resourcesArtifacts}</resourcesArtifacts>
  905. [INFO]   <serialwarn default-value="false">${serialwarn}</serialwarn>
  906. [INFO]   <session>${session}</session>
  907. [INFO]   <settings default-value="${settings}"/>
  908. [INFO]   <show default-value="protected">${show}</show>
  909. [INFO]   <skip default-value="false">${maven.javadoc.skip}</skip>
  910. [INFO]   <source>${source}</source>
  911. [INFO]   <sourceDependencyCacheDir default-value="${project.build.directory}/distro-javadoc-sources"/>
  912. [INFO]   <sourcepath>${sourcepath}</sourcepath>
  913. [INFO]   <sourcetab>${sourcetab}</sourcetab>
  914. [INFO]   <splitindex default-value="false">${splitindex}</splitindex>
  915. [INFO]   <stylesheet default-value="java">${stylesheet}</stylesheet>
  916. [INFO]   <stylesheetfile>${stylesheetfile}</stylesheetfile>
  917. [INFO]   <subpackages>${subpackages}</subpackages>
  918. [INFO]   <taglet>${taglet}</taglet>
  919. [INFO]   <tagletArtifact>${tagletArtifact}</tagletArtifact>
  920. [INFO]   <tagletArtifacts>${tagletArtifacts}</tagletArtifacts>
  921. [INFO]   <tagletpath>${tagletpath}</tagletpath>
  922. [INFO]   <taglets>${taglets}</taglets>
  923. [INFO]   <tags>
  924. [INFO]     <tag>
  925. [INFO]       <name>should</name>
  926. [INFO]       <placement>a</placement>
  927. [INFO]       <head>Should:</head>
  928. [INFO]     </tag>${tags}</tags>
  929. [INFO]   <top>${top}</top>
  930. [INFO]   <use default-value="true">${use}</use>
  931. [INFO]   <useDefaultManifestFile default-value="false"/>
  932. [INFO]   <useStandardDocletOptions default-value="true">${useStandardDocletOptions}</useStandardDocletOptions>
  933. [INFO]   <validateLinks default-value="false">${validateLinks}</validateLinks>
  934. [INFO]   <verbose default-value="false">${verbose}</verbose>
  935. [INFO]   <version default-value="true">${version}</version>
  936. [INFO]   <windowtitle default-value="${project.name} ${project.version} API">${windowtitle}</windowtitle>
  937. [INFO] </configuration>
  938. [INFO] [DEBUG] -----------------------------------------------------------------------
  939. [INFO] [DEBUG] Goal:          org.apache.maven.plugins:maven-install-plugin:2.4:install (default-install)
  940. [INFO] [DEBUG] Style:         Regular
  941. [INFO] [DEBUG] Configuration: <?xml version="1.0" encoding="UTF-8"?>
  942. [INFO] <configuration>
  943. [INFO]   <artifact default-value="${project.artifact}"/>
  944. [INFO]   <attachedArtifacts default-value="${project.attachedArtifacts}"/>
  945. [INFO]   <createChecksum default-value="false">${createChecksum}</createChecksum>
  946. [INFO]   <localRepository>${localRepository}</localRepository>
  947. [INFO]   <packaging default-value="${project.packaging}"/>
  948. [INFO]   <pomFile default-value="${project.file}"/>
  949. [INFO]   <skip default-value="false">${maven.install.skip}</skip>
  950. [INFO]   <updateReleaseInfo default-value="false">${updateReleaseInfo}</updateReleaseInfo>
  951. [INFO] </configuration>
  952. [INFO] [DEBUG] -----------------------------------------------------------------------
  953. [INFO] [DEBUG] Goal:          org.apache.maven.plugins:maven-deploy-plugin:2.7:deploy (default-deploy)
  954. [INFO] [DEBUG] Style:         Regular
  955. [INFO] [DEBUG] Configuration: <?xml version="1.0" encoding="UTF-8"?>
  956. [INFO] <configuration>
  957. [INFO]   <altDeploymentRepository>${altDeploymentRepository}</altDeploymentRepository>
  958. [INFO]   <artifact default-value="${project.artifact}"/>
  959. [INFO]   <attachedArtifacts default-value="${project.attachedArtifacts}"/>
  960. [INFO]   <localRepository default-value="${localRepository}"/>
  961. [INFO]   <offline default-value="${settings.offline}"/>
  962. [INFO]   <packaging default-value="${project.packaging}"/>
  963. [INFO]   <pomFile default-value="${project.file}"/>
  964. [INFO]   <project default-value="${project}"/>
  965. [INFO]   <retryFailedDeploymentCount default-value="1">${retryFailedDeploymentCount}</retryFailedDeploymentCount>
  966. [INFO]   <skip default-value="false">${maven.deploy.skip}</skip>
  967. [INFO]   <updateReleaseInfo default-value="false">${updateReleaseInfo}</updateReleaseInfo>
  968. [INFO] </configuration>
  969. [INFO] [DEBUG] =======================================================================
  970. [INFO] [DEBUG] Dependency collection stats: {ConflictMarker.analyzeTime=3, ConflictMarker.markTime=0, ConflictMarker.nodeCount=257, ConflictIdSorter.graphTime=1, ConflictIdSorter.topsortTime=0, ConflictIdSorter.conflictIdCount=101, ConflictIdSorter.conflictIdCycleCount=0, ConflictResolver.totalTime=11, ConflictResolver.conflictItemCount=218, DefaultDependencyCollector.collectTime=1708, DefaultDependencyCollector.transformTime=15}
  971. [INFO] [DEBUG] org.openmrs.module:commonlabtest:pom:1.3.1
  972. [INFO] [DEBUG]    org.openmrs.api:openmrs-api:jar:2.1.2:provided
  973. [INFO] [DEBUG]       commons-collections:commons-collections:jar:3.2.2:provided
  974. [INFO] [DEBUG]       org.apache.commons:commons-lang3:jar:3.1:provided
  975. [INFO] [DEBUG]       commons-beanutils:commons-beanutils:jar:1.7.0:provided
  976. [INFO] [DEBUG]       commons-io:commons-io:jar:1.4:provided
  977. [INFO] [DEBUG]       org.azeckoski:reflectutils:jar:0.9.14:provided
  978. [INFO] [DEBUG]       org.apache.velocity:velocity:jar:1.6.2:provided
  979. [INFO] [DEBUG]          commons-lang:commons-lang:jar:2.4:provided
  980. [INFO] [DEBUG]       log4j:log4j:jar:1.2.15:provided
  981. [INFO] [DEBUG]       org.springframework:spring-core:jar:4.1.4.RELEASE:provided
  982. [INFO] [DEBUG]       org.springframework:spring-beans:jar:4.1.4.RELEASE:provided
  983. [INFO] [DEBUG]       org.springframework:spring-context:jar:4.1.4.RELEASE:provided
  984. [INFO] [DEBUG]          org.springframework:spring-expression:jar:4.1.4.RELEASE:provided
  985. [INFO] [DEBUG]       org.springframework:spring-aop:jar:4.1.4.RELEASE:provided
  986. [INFO] [DEBUG]          aopalliance:aopalliance:jar:1.0:provided
  987. [INFO] [DEBUG]       org.springframework:spring-orm:jar:4.1.4.RELEASE:provided
  988. [INFO] [DEBUG]       org.springframework:spring-tx:jar:4.1.4.RELEASE:provided
  989. [INFO] [DEBUG]       org.springframework:spring-jdbc:jar:4.1.4.RELEASE:provided
  990. [INFO] [DEBUG]       org.springframework:spring-context-support:jar:4.1.4.RELEASE:provided
  991. [INFO] [DEBUG]       asm:asm-commons:jar:2.2.3:provided
  992. [INFO] [DEBUG]          asm:asm-tree:jar:2.2.3:provided
  993. [INFO] [DEBUG]             asm:asm:jar:2.2.3:provided
  994. [INFO] [DEBUG]       asm:asm-util:jar:2.2.3:provided
  995. [INFO] [DEBUG]       cglib:cglib-nodep:jar:2.2:provided
  996. [INFO] [DEBUG]       ca.uhn.hapi:hapi-base:jar:2.0:provided
  997. [INFO] [DEBUG]          commons-cli:commons-cli:jar:1.2:provided
  998. [INFO] [DEBUG]          org.jdom:jdom:jar:1.1:provided
  999. [INFO] [DEBUG]          xalan:xalan:jar:2.7.0:provided
  1000. [INFO] [DEBUG]       ca.uhn.hapi:hapi-structures-v25:jar:2.0:provided
  1001. [INFO] [DEBUG]       ca.uhn.hapi:hapi-structures-v26:jar:2.0:provided
  1002. [INFO] [DEBUG]       org.javassist:javassist:jar:3.19.0-GA:provided
  1003. [INFO] [DEBUG]       org.hibernate:hibernate-core:jar:4.3.9.Final:provided
  1004. [INFO] [DEBUG]          org.jboss.logging:jboss-logging:jar:3.1.3.GA:provided
  1005. [INFO] [DEBUG]          org.jboss.logging:jboss-logging-annotations:jar:1.2.0.Beta1:provided
  1006. [INFO] [DEBUG]          org.jboss.spec.javax.transaction:jboss-transaction-api_1.2_spec:jar:1.0.0.Final:provided
  1007. [INFO] [DEBUG]          org.hibernate.common:hibernate-commons-annotations:jar:4.0.5.Final:provided
  1008. [INFO] [DEBUG]          org.hibernate.javax.persistence:hibernate-jpa-2.1-api:jar:1.0.0.Final:provided
  1009. [INFO] [DEBUG]          antlr:antlr:jar:2.7.7:provided
  1010. [INFO] [DEBUG]          org.jboss:jandex:jar:1.1.0.Final:provided
  1011. [INFO] [DEBUG]       org.hibernate:hibernate-c3p0:jar:4.3.9.Final:provided
  1012. [INFO] [DEBUG]          com.mchange:c3p0:jar:0.9.2.1:provided
  1013. [INFO] [DEBUG]             com.mchange:mchange-commons-java:jar:0.2.3.4:provided
  1014. [INFO] [DEBUG]       org.hibernate:hibernate-ehcache:jar:4.3.9.Final:provided
  1015. [INFO] [DEBUG]       org.hibernate:hibernate-search-orm:jar:5.1.2.Final:provided
  1016. [INFO] [DEBUG]          org.hibernate:hibernate-search-engine:jar:5.1.2.Final:provided
  1017. [INFO] [DEBUG]             org.apache.lucene:lucene-analyzers-common:jar:4.10.4:provided
  1018. [INFO] [DEBUG]             org.apache.lucene:lucene-facet:jar:4.10.4:provided
  1019. [INFO] [DEBUG]       org.apache.lucene:lucene-queryparser:jar:4.10.4:provided
  1020. [INFO] [DEBUG]          org.apache.lucene:lucene-core:jar:4.10.4:provided
  1021. [INFO] [DEBUG]          org.apache.lucene:lucene-sandbox:jar:4.10.4:provided
  1022. [INFO] [DEBUG]       org.apache.lucene:lucene-queries:jar:4.10.4:provided
  1023. [INFO] [DEBUG]       dom4j:dom4j:jar:1.6.1:provided
  1024. [INFO] [DEBUG]       org.slf4j:slf4j-api:jar:1.6.0:provided
  1025. [INFO] [DEBUG]       org.slf4j:jcl-over-slf4j:jar:1.6.0:provided
  1026. [INFO] [DEBUG]       org.slf4j:slf4j-log4j12:jar:1.6.0:provided
  1027. [INFO] [DEBUG]       com.thoughtworks.xstream:xstream:jar:1.4.3:provided
  1028. [INFO] [DEBUG]          xmlpull:xmlpull:jar:1.1.3.1:provided
  1029. [INFO] [DEBUG]          xpp3:xpp3_min:jar:1.1.4c:provided
  1030. [INFO] [DEBUG]       javax.mail:mail:jar:1.4.1:provided
  1031. [INFO] [DEBUG]       org.liquibase:liquibase-core:jar:2.0.5:provided
  1032. [INFO] [DEBUG]       org.openmrs.liquibase.ext:modify-column:jar:2.0.2:provided
  1033. [INFO] [DEBUG]       org.openmrs.liquibase.ext:identity-insert:jar:1.2.1:provided
  1034. [INFO] [DEBUG]       org.openmrs.liquibase.ext:type-converter:jar:1.0.1:provided
  1035. [INFO] [DEBUG]       xerces:xercesImpl:jar:2.8.0:provided
  1036. [INFO] [DEBUG]       javax.validation:validation-api:jar:1.0.0.GA:provided
  1037. [INFO] [DEBUG]       org.hibernate:hibernate-validator:jar:4.2.0.Final:provided
  1038. [INFO] [DEBUG]       org.codehaus.jackson:jackson-core-asl:jar:1.9.13:provided
  1039. [INFO] [DEBUG]       org.codehaus.jackson:jackson-mapper-asl:jar:1.9.13:provided
  1040. [INFO] [DEBUG]       org.codehaus.groovy:groovy-all:jar:2.4.6:provided
  1041. [INFO] [DEBUG]       net.sf.ehcache:ehcache:jar:2.10.0:provided
  1042. [INFO] [DEBUG]    org.openmrs.api:openmrs-api:jar:tests:2.1.2:test
  1043. [INFO] [DEBUG]    org.openmrs.test:openmrs-test:pom:2.1.2:test
  1044. [INFO] [DEBUG]       org.springframework:spring-test:jar:4.1.4.RELEASE:test
  1045. [INFO] [DEBUG]       com.h2database:h2:jar:1.4.187:test
  1046. [INFO] [DEBUG]       org.databene:databene-benerator:jar:0.5.9:test
  1047. [INFO] [DEBUG]          org.databene:databene-webdecs:jar:0.4.9:test
  1048. [INFO] [DEBUG]             org.apache.poi:poi:jar:3.5-beta5:test
  1049. [INFO] [DEBUG]             org.freemarker:freemarker:jar:2.3.9:test
  1050. [INFO] [DEBUG]          org.databene:databene-commons:jar:0.4.9:test
  1051. [INFO] [DEBUG]          org.databene:databene-gui:jar:0.1.9:test
  1052. [INFO] [DEBUG]          net.sourceforge.jtds:jtds:jar:1.2.2:test
  1053. [INFO] [DEBUG]          mysql:mysql-connector-java:jar:5.1.6:test
  1054. [INFO] [DEBUG]          org.apache.derby:derbyclient:jar:10.4.2.0:test
  1055. [INFO] [DEBUG]          postgresql:postgresql:jar:8.3-603.jdbc4:test
  1056. [INFO] [DEBUG]       org.dbunit:dbunit:jar:2.4.7:test
  1057. [INFO] [DEBUG]       xmlunit:xmlunit:jar:1.3:test
  1058. [INFO] [DEBUG]       com.carrotsearch:junit-benchmarks:jar:0.7.0:test
  1059. [INFO] [DEBUG]    junit:junit:jar:4.11:test
  1060. [INFO] [DEBUG]    org.hamcrest:hamcrest-core:jar:1.3:test
  1061. [INFO] [DEBUG]    org.hamcrest:hamcrest-library:jar:1.3:test
  1062. [INFO] [DEBUG]    org.mockito:mockito-core:jar:1.9.5:test
  1063. [INFO] [DEBUG]       org.objenesis:objenesis:jar:1.0:test
  1064. [INFO] [DEBUG]    org.powermock:powermock-module-junit4:jar:1.5:test
  1065. [INFO] [DEBUG]       org.powermock:powermock-module-junit4-common:jar:1.5:test
  1066. [INFO] [DEBUG]          org.powermock:powermock-core:jar:1.5:test
  1067. [INFO] [DEBUG]          org.powermock:powermock-reflect:jar:1.5:test
  1068. [INFO] [DEBUG]    org.powermock:powermock-api-mockito:jar:1.5:test
  1069. [INFO] [DEBUG]       org.powermock:powermock-api-support:jar:1.5:test
  1070. [INFO] [INFO]
  1071. [INFO] [INFO] --- buildnumber-maven-plugin:1.1:create (default) @ commonlabtest ---
  1072. [INFO] [DEBUG] Dependency collection stats: {ConflictMarker.analyzeTime=1, ConflictMarker.markTime=0, ConflictMarker.nodeCount=131, ConflictIdSorter.graphTime=0, ConflictIdSorter.topsortTime=0, ConflictIdSorter.conflictIdCount=47, ConflictIdSorter.conflictIdCycleCount=0, ConflictResolver.totalTime=2, ConflictResolver.conflictItemCount=120, DefaultDependencyCollector.collectTime=631, DefaultDependencyCollector.transformTime=3}
  1073. [INFO] [DEBUG] org.codehaus.mojo:buildnumber-maven-plugin:jar:1.1:
  1074. [INFO] [DEBUG]    org.apache.maven:maven-project:jar:2.0.6:compile
  1075. [INFO] [DEBUG]       org.apache.maven:maven-profile:jar:2.0.6:compile
  1076. [INFO] [DEBUG]       org.apache.maven:maven-model:jar:2.0.6:compile
  1077. [INFO] [DEBUG]       org.apache.maven:maven-artifact-manager:jar:2.0.6:compile
  1078. [INFO] [DEBUG]       org.apache.maven:maven-plugin-registry:jar:2.0.6:compile
  1079. [INFO] [DEBUG]       org.apache.maven:maven-artifact:jar:2.0.6:compile
  1080. [INFO] [DEBUG]    org.apache.maven:maven-settings:jar:2.0.6:compile
  1081. [INFO] [DEBUG]    org.apache.maven:maven-core:jar:2.0.6:compile
  1082. [INFO] [DEBUG]       org.apache.maven:maven-plugin-parameter-documenter:jar:2.0.6:compile
  1083. [INFO] [DEBUG]       org.apache.maven.reporting:maven-reporting-api:jar:2.0.6:compile
  1084. [INFO] [DEBUG]          org.apache.maven.doxia:doxia-sink-api:jar:1.0-alpha-7:compile
  1085. [INFO] [DEBUG]       org.apache.maven:maven-repository-metadata:jar:2.0.6:compile
  1086. [INFO] [DEBUG]       org.apache.maven:maven-error-diagnostics:jar:2.0.6:compile
  1087. [INFO] [DEBUG]       commons-cli:commons-cli:jar:1.0:compile
  1088. [INFO] [DEBUG]       org.apache.maven:maven-plugin-descriptor:jar:2.0.6:compile
  1089. [INFO] [DEBUG]       org.codehaus.plexus:plexus-interactivity-api:jar:1.0-alpha-4:compile
  1090. [INFO] [DEBUG]       org.apache.maven:maven-monitor:jar:2.0.6:compile
  1091. [INFO] [DEBUG]       classworlds:classworlds:jar:1.1:compile
  1092. [INFO] [DEBUG]    org.apache.maven:maven-plugin-api:jar:2.0.6:compile
  1093. [INFO] [DEBUG]    org.codehaus.plexus:plexus-container-default:jar:1.0-alpha-9-stable-1:compile
  1094. [INFO] [DEBUG]       junit:junit:jar:4.10:test
  1095. [INFO] [DEBUG]          org.hamcrest:hamcrest-core:jar:1.1:test
  1096. [INFO] [DEBUG]    org.apache.maven.scm:maven-scm-api:jar:1.7:compile
  1097. [INFO] [DEBUG]    org.apache.maven.scm:maven-scm-manager-plexus:jar:1.7:compile
  1098. [INFO] [DEBUG]    org.apache.maven.scm:maven-scm-provider-bazaar:jar:1.7:compile
  1099. [INFO] [DEBUG]       regexp:regexp:jar:1.3:compile
  1100. [INFO] [DEBUG]    org.apache.maven.scm:maven-scm-provider-svnexe:jar:1.7:compile
  1101. [INFO] [DEBUG]       commons-lang:commons-lang:jar:2.6:compile
  1102. [INFO] [DEBUG]    org.apache.maven.scm:maven-scm-provider-gitexe:jar:1.7:compile
  1103. [INFO] [DEBUG]       org.apache.maven.scm:maven-scm-provider-git-commons:jar:1.7:compile
  1104. [INFO] [DEBUG]    org.apache.maven.scm:maven-scm-provider-svn-commons:jar:1.7:compile
  1105. [INFO] [DEBUG]    org.apache.maven.scm:maven-scm-provider-cvsexe:jar:1.7:compile
  1106. [INFO] [DEBUG]       org.apache.maven.scm:maven-scm-provider-cvs-commons:jar:1.7:compile
  1107. [INFO] [DEBUG]    org.apache.maven.scm:maven-scm-provider-starteam:jar:1.7:compile
  1108. [INFO] [DEBUG]    org.apache.maven.scm:maven-scm-provider-clearcase:jar:1.7:compile
  1109. [INFO] [DEBUG]    org.apache.maven.scm:maven-scm-provider-perforce:jar:1.7:compile
  1110. [INFO] [DEBUG]    org.apache.maven.scm:maven-scm-provider-hg:jar:1.7:compile
  1111. [INFO] [DEBUG]    com.google.code.maven-scm-provider-svnjava:maven-scm-provider-svnjava:jar:1.13:compile
  1112. [INFO] [DEBUG]    org.codehaus.plexus:plexus-utils:jar:2.0.5:compile
  1113. [INFO] [DEBUG]    org.tmatesoft.svnkit:svnkit:jar:1.3.5:compile
  1114. [INFO] [DEBUG]       org.tmatesoft.svnkit:trilead-ssh2:jar:build213-svnkit-1.3-patch:compile
  1115. [INFO] [DEBUG]       org.tmatesoft.sqljet:sqljet:jar:1.0.4:compile
  1116. [INFO] [DEBUG]          org.antlr:antlr-runtime:jar:3.1.3:compile
  1117. [INFO] [DEBUG]             org.antlr:stringtemplate:jar:3.2:compile
  1118. [INFO] [DEBUG]                antlr:antlr:jar:2.7.7:compile
  1119. [INFO] [DEBUG]    net.java.dev.jna:jna:jar:3.2.2:compile
  1120. [INFO] [DEBUG] Created new class realm plugin>org.codehaus.mojo:buildnumber-maven-plugin:1.1
  1121. [INFO] [DEBUG] Importing foreign packages into class realm plugin>org.codehaus.mojo:buildnumber-maven-plugin:1.1
  1122. [INFO] [DEBUG]   Imported:  < maven.api
  1123. [INFO] [DEBUG] Populating class realm plugin>org.codehaus.mojo:buildnumber-maven-plugin:1.1
  1124. [INFO] [DEBUG]   Included: org.codehaus.mojo:buildnumber-maven-plugin:jar:1.1
  1125. [INFO] [DEBUG]   Included: org.apache.maven.reporting:maven-reporting-api:jar:2.0.6
  1126. [INFO] [DEBUG]   Included: org.apache.maven.doxia:doxia-sink-api:jar:1.0-alpha-7
  1127. [INFO] [DEBUG]   Included: commons-cli:commons-cli:jar:1.0
  1128. [INFO] [DEBUG]   Included: org.codehaus.plexus:plexus-interactivity-api:jar:1.0-alpha-4
  1129. [INFO] [DEBUG]   Included: org.apache.maven.scm:maven-scm-api:jar:1.7
  1130. [INFO] [DEBUG]   Included: org.apache.maven.scm:maven-scm-manager-plexus:jar:1.7
  1131. [INFO] [DEBUG]   Included: org.apache.maven.scm:maven-scm-provider-bazaar:jar:1.7
  1132. [INFO] [DEBUG]   Included: regexp:regexp:jar:1.3
  1133. [INFO] [DEBUG]   Included: org.apache.maven.scm:maven-scm-provider-svnexe:jar:1.7
  1134. [INFO] [DEBUG]   Included: commons-lang:commons-lang:jar:2.6
  1135. [INFO] [DEBUG]   Included: org.apache.maven.scm:maven-scm-provider-gitexe:jar:1.7
  1136. [INFO] [DEBUG]   Included: org.apache.maven.scm:maven-scm-provider-git-commons:jar:1.7
  1137. [INFO] [DEBUG]   Included: org.apache.maven.scm:maven-scm-provider-svn-commons:jar:1.7
  1138. [INFO] [DEBUG]   Included: org.apache.maven.scm:maven-scm-provider-cvsexe:jar:1.7
  1139. [INFO] [DEBUG]   Included: org.apache.maven.scm:maven-scm-provider-cvs-commons:jar:1.7
  1140. [INFO] [DEBUG]   Included: org.apache.maven.scm:maven-scm-provider-starteam:jar:1.7
  1141. [INFO] [DEBUG]   Included: org.apache.maven.scm:maven-scm-provider-clearcase:jar:1.7
  1142. [INFO] [DEBUG]   Included: org.apache.maven.scm:maven-scm-provider-perforce:jar:1.7
  1143. [INFO] [DEBUG]   Included: org.apache.maven.scm:maven-scm-provider-hg:jar:1.7
  1144. [INFO] [DEBUG]   Included: com.google.code.maven-scm-provider-svnjava:maven-scm-provider-svnjava:jar:1.13
  1145. [INFO] [DEBUG]   Included: org.codehaus.plexus:plexus-utils:jar:2.0.5
  1146. [INFO] [DEBUG]   Included: org.tmatesoft.svnkit:svnkit:jar:1.3.5
  1147. [INFO] [DEBUG]   Included: org.tmatesoft.svnkit:trilead-ssh2:jar:build213-svnkit-1.3-patch
  1148. [INFO] [DEBUG]   Included: org.tmatesoft.sqljet:sqljet:jar:1.0.4
  1149. [INFO] [DEBUG]   Included: org.antlr:antlr-runtime:jar:3.1.3
  1150. [INFO] [DEBUG]   Included: org.antlr:stringtemplate:jar:3.2
  1151. [INFO] [DEBUG]   Included: antlr:antlr:jar:2.7.7
  1152. [INFO] [DEBUG]   Included: net.java.dev.jna:jna:jar:3.2.2
  1153. [INFO] [DEBUG] Configuring mojo org.codehaus.mojo:buildnumber-maven-plugin:1.1:create from plugin realm ClassRealm[plugin>org.codehaus.mojo:buildnumber-maven-plugin:1.1, parent: sun.misc.Launcher$AppClassLoader@55f96302]
  1154. [INFO] [DEBUG] Configuring mojo 'org.codehaus.mojo:buildnumber-maven-plugin:1.1:create' with basic configurator -->
  1155. [INFO] [DEBUG]   (s) buildNumberPropertiesFileLocation = C:\openmrs-workspace\openmrs-module-commonlabtest\target\checkout\buildNumber.properties
  1156. [INFO] [DEBUG]   (f) buildNumberPropertyName = revisionNumber
  1157. [INFO] [DEBUG]   (s) doCheck = false
  1158. [INFO] [DEBUG]   (s) doUpdate = false
  1159. [INFO] [DEBUG]   (f) getRevisionOnlyOnce = true
  1160. [INFO] [DEBUG]   (f) project = MavenProject: org.openmrs.module:commonlabtest:1.3.1 @ C:\openmrs-workspace\openmrs-module-commonlabtest\target\checkout\pom.xml
  1161. [INFO] [DEBUG]   (f) reactorProjects = [MavenProject: org.openmrs.module:commonlabtest:1.3.1 @ C:\openmrs-workspace\openmrs-module-commonlabtest\target\checkout\pom.xml, MavenProject: org.openmrs.module:commonlabtest-api:1.3.1 @ C:\openmrs-workspace\openmrs-module-commonlabtest\target\checkout\api\pom.xml, MavenProject: org.openmrs.module:commonlabtest-omod:1.3.1 @ C:\openmrs-workspace\openmrs-module-commonlabtest\target\checkout\omod\pom.xml]
  1162. [INFO] [DEBUG]   (f) readUrlScm = scm:git:https://github.com/openmrs/openmrs-module-commonlabtest
  1163. [INFO] [DEBUG]   (s) revisionOnScmFailure = 0
  1164. [INFO] [DEBUG]   (f) scmBranchPropertyName = scmBranch
  1165. [INFO] [DEBUG]   (s) scmDirectory = C:\openmrs-workspace\openmrs-module-commonlabtest\target\checkout
  1166. [INFO] [DEBUG]   (f) session = org.apache.maven.execution.MavenSession@155d1021
  1167. [INFO] [DEBUG]   (s) shortRevisionLength = 6
  1168. [INFO] [DEBUG]   (f) timestampPropertyName = timestamp
  1169. [INFO] [DEBUG]   (s) urlScm = scm:git:https://github.com/openmrs/openmrs-module-commonlabtest
  1170. [INFO] [DEBUG]   (f) useLastCommittedRevision = false
  1171. [INFO] [DEBUG] -- end configuration --
  1172. [INFO] [INFO] Checking for local modifications: skipped.
  1173. [INFO] [INFO] Updating project files from SCM: skipped.
  1174. [INFO] [INFO] ShortRevision tag detected. The value is '6'.
  1175. [INFO] [INFO] Executing: cmd.exe /X /C "git rev-parse --verify --short=6 HEAD"
  1176. [INFO] [INFO] Working directory: C:\openmrs-workspace\openmrs-module-commonlabtest\target\checkout
  1177. [INFO] [DEBUG] consume line 3e211d
  1178. [INFO] [INFO] Storing buildNumber: 3e211d at timestamp: 1548151173797
  1179. [INFO] [INFO] ShortRevision tag detected. The value is '6'.
  1180. [INFO] [INFO] Executing: cmd.exe /X /C "git rev-parse --verify --short=6 HEAD"
  1181. [INFO] [INFO] Working directory: C:\openmrs-workspace\openmrs-module-commonlabtest\target\checkout
  1182. [INFO] [DEBUG] consume line 3e211d
  1183. [INFO] [INFO] Storing buildScmBranch: UNKNOWN
  1184. [INFO] [INFO]
  1185. [INFO] [INFO] --- maven-java-formatter-plugin:0.4:format (default) @ commonlabtest ---
  1186. [INFO] [DEBUG] Dependency collection stats: {ConflictMarker.analyzeTime=1, ConflictMarker.markTime=0, ConflictMarker.nodeCount=23, ConflictIdSorter.graphTime=0, ConflictIdSorter.topsortTime=0, ConflictIdSorter.conflictIdCount=19, ConflictIdSorter.conflictIdCycleCount=0, ConflictResolver.totalTime=1, ConflictResolver.conflictItemCount=23, DefaultDependencyCollector.collectTime=89, DefaultDependencyCollector.transformTime=3}
  1187. [INFO] [DEBUG] com.googlecode.maven-java-formatter-plugin:maven-java-formatter-plugin:jar:0.4:
  1188. [INFO] [DEBUG]    org.openmrs.tools:openmrs-tools:jar:1.11.2:runtime
  1189. [INFO] [DEBUG]       com.sun:tools:jar:1.4.2:system
  1190. [INFO] [DEBUG]    org.apache.maven:maven-plugin-api:jar:2.0:compile
  1191. [INFO] [DEBUG]    org.eclipse.tycho:org.eclipse.jdt.core:jar:3.8.1.v20120125-1544:compile
  1192. [INFO] [DEBUG]    org.jibx.config.3rdparty.org.eclipse:org.eclipse.text:jar:3.5.100.v20110505-0800:compile
  1193. [INFO] [DEBUG]    org.jibx.config.3rdparty.org.eclipse:org.eclipse.core.runtime:jar:3.7.0.v20110110:compile
  1194. [INFO] [DEBUG]    org.jibx.config.3rdparty.org.eclipse:org.eclipse.core.resources:jar:3.7.100.v20110510-0712:compile
  1195. [INFO] [DEBUG]    org.jibx.config.3rdparty.org.eclipse:org.eclipse.equinox.common:jar:3.6.0.v20110523:compile
  1196. [INFO] [DEBUG]    commons-digester:commons-digester:jar:2.0:compile
  1197. [INFO] [DEBUG]       commons-beanutils:commons-beanutils:jar:1.8.0:compile
  1198. [INFO] [DEBUG]       commons-logging:commons-logging:jar:1.1.1:compile
  1199. [INFO] [DEBUG]    commons-codec:commons-codec:jar:1.4:compile
  1200. [INFO] [DEBUG]    org.codehaus.plexus:plexus-io:jar:1.0.1:compile
  1201. [INFO] [DEBUG]    org.codehaus.plexus:plexus-resources:jar:1.0-alpha-7:compile
  1202. [INFO] [DEBUG]       org.codehaus.plexus:plexus-container-default:jar:1.0-alpha-9-stable-1:compile
  1203. [INFO] [DEBUG]          junit:junit:jar:3.8.1:compile
  1204. [INFO] [DEBUG]          classworlds:classworlds:jar:1.1-alpha-2:compile
  1205. [INFO] [DEBUG]    org.codehaus.plexus:plexus-utils:jar:2.0.5:compile
  1206. [INFO] [DEBUG] Created new class realm plugin>com.googlecode.maven-java-formatter-plugin:maven-java-formatter-plugin:0.4
  1207. [INFO] [DEBUG] Importing foreign packages into class realm plugin>com.googlecode.maven-java-formatter-plugin:maven-java-formatter-plugin:0.4
  1208. [INFO] [DEBUG]   Imported:  < maven.api
  1209. [INFO] [DEBUG] Populating class realm plugin>com.googlecode.maven-java-formatter-plugin:maven-java-formatter-plugin:0.4
  1210. [INFO] [DEBUG]   Included: com.googlecode.maven-java-formatter-plugin:maven-java-formatter-plugin:jar:0.4
  1211. [INFO] [DEBUG]   Included: org.openmrs.tools:openmrs-tools:jar:1.11.2
  1212. [INFO] [DEBUG]   Included: com.sun:tools:jar:1.4.2
  1213. [INFO] [DEBUG]   Included: org.eclipse.tycho:org.eclipse.jdt.core:jar:3.8.1.v20120125-1544
  1214. [INFO] [DEBUG]   Included: org.jibx.config.3rdparty.org.eclipse:org.eclipse.text:jar:3.5.100.v20110505-0800
  1215. [INFO] [DEBUG]   Included: org.jibx.config.3rdparty.org.eclipse:org.eclipse.core.runtime:jar:3.7.0.v20110110
  1216. [INFO] [DEBUG]   Included: org.jibx.config.3rdparty.org.eclipse:org.eclipse.core.resources:jar:3.7.100.v20110510-0712
  1217. [INFO] [DEBUG]   Included: org.jibx.config.3rdparty.org.eclipse:org.eclipse.equinox.common:jar:3.6.0.v20110523
  1218. [INFO] [DEBUG]   Included: commons-digester:commons-digester:jar:2.0
  1219. [INFO] [DEBUG]   Included: commons-beanutils:commons-beanutils:jar:1.8.0
  1220. [INFO] [DEBUG]   Included: commons-logging:commons-logging:jar:1.1.1
  1221. [INFO] [DEBUG]   Included: commons-codec:commons-codec:jar:1.4
  1222. [INFO] [DEBUG]   Included: org.codehaus.plexus:plexus-io:jar:1.0.1
  1223. [INFO] [DEBUG]   Included: org.codehaus.plexus:plexus-resources:jar:1.0-alpha-7
  1224. [INFO] [DEBUG]   Included: junit:junit:jar:3.8.1
  1225. [INFO] [DEBUG]   Included: org.codehaus.plexus:plexus-utils:jar:2.0.5
  1226. [INFO] [DEBUG] Configuring mojo com.googlecode.maven-java-formatter-plugin:maven-java-formatter-plugin:0.4:format from plugin realm ClassRealm[plugin>com.googlecode.maven-java-formatter-plugin:maven-java-formatter-plugin:0.4, parent: sun.misc.Launcher$AppClassLoader@55f96302]
  1227. [INFO] [DEBUG] Configuring mojo 'com.googlecode.maven-java-formatter-plugin:maven-java-formatter-plugin:0.4:format' with basic configurator -->
  1228. [INFO] [DEBUG]   (f) basedir = C:\openmrs-workspace\openmrs-module-commonlabtest\target\checkout
  1229. [INFO] [DEBUG]   (f) compilerCompliance = 1.5
  1230. [INFO] [DEBUG]   (f) compilerSource = 1.5
  1231. [INFO] [DEBUG]   (f) compilerTargetPlatform = 1.5
  1232. [INFO] [DEBUG]   (f) configFile = eclipse/OpenMRSFormatter.xml
  1233. [INFO] [DEBUG]   (f) encoding = UTF-8
  1234. [INFO] [DEBUG]   (f) lineEnding = LF
  1235. [INFO] [DEBUG]   (f) overrideConfigCompilerVersion = true
  1236. [INFO] [DEBUG]   (f) sourceDirectory = C:\openmrs-workspace\openmrs-module-commonlabtest\target\checkout\src\main\java
  1237. [INFO] [DEBUG]   (f) targetDirectory = C:\openmrs-workspace\openmrs-module-commonlabtest\target\checkout\target
  1238. [INFO] [DEBUG]   (f) testSourceDirectory = C:\openmrs-workspace\openmrs-module-commonlabtest\target\checkout\src\test\java
  1239. [INFO] [DEBUG] -- end configuration --
  1240. [INFO] [INFO] Using 'UTF-8' encoding to format source files.
  1241. [INFO] [INFO] Number of files to be formatted: 0
  1242. [INFO] [INFO]
  1243. [INFO] [INFO] --- formatter-maven-plugin:2.7.1:format (default) @ commonlabtest ---
  1244. [INFO] [DEBUG] Dependency collection stats: {ConflictMarker.analyzeTime=0, ConflictMarker.markTime=0, ConflictMarker.nodeCount=29, ConflictIdSorter.graphTime=0, ConflictIdSorter.topsortTime=0, ConflictIdSorter.conflictIdCount=24, ConflictIdSorter.conflictIdCycleCount=0, ConflictResolver.totalTime=1, ConflictResolver.conflictItemCount=29, DefaultDependencyCollector.collectTime=196, DefaultDependencyCollector.transformTime=1}
  1245. [INFO] [DEBUG] net.revelc.code.formatter:formatter-maven-plugin:jar:2.7.1:
  1246. [INFO] [DEBUG]    com.fasterxml.jackson.core:jackson-core:jar:2.9.2:compile
  1247. [INFO] [DEBUG]    com.fasterxml.jackson.core:jackson-databind:jar:2.9.2:compile
  1248. [INFO] [DEBUG]       com.fasterxml.jackson.core:jackson-annotations:jar:2.9.0:compile
  1249. [INFO] [DEBUG]    com.google.guava:guava:jar:23.3-jre:compile
  1250. [INFO] [DEBUG]       com.google.code.findbugs:jsr305:jar:1.3.9:compile
  1251. [INFO] [DEBUG]       com.google.errorprone:error_prone_annotations:jar:2.0.18:compile
  1252. [INFO] [DEBUG]       com.google.j2objc:j2objc-annotations:jar:1.1:compile
  1253. [INFO] [DEBUG]       org.codehaus.mojo:animal-sniffer-annotations:jar:1.14:compile
  1254. [INFO] [DEBUG]    net.revelc.code.formatter:jsdt-core:jar:2.6.0:compile
  1255. [INFO] [DEBUG]    net.sourceforge.cssparser:cssparser:jar:0.9.23:compile
  1256. [INFO] [DEBUG]    org.apache.commons:commons-digester3:jar:3.2:compile
  1257. [INFO] [DEBUG]       cglib:cglib:jar:2.2.2:compile
  1258. [INFO] [DEBUG]          asm:asm:jar:3.3.1:compile
  1259. [INFO] [DEBUG]       commons-beanutils:commons-beanutils:jar:1.8.3:compile
  1260. [INFO] [DEBUG]       commons-logging:commons-logging:jar:1.1.1:compile
  1261. [INFO] [DEBUG]    org.codehaus.plexus:plexus-resources:jar:1.1.0:compile
  1262. [INFO] [DEBUG]       org.codehaus.plexus:plexus-container-default:jar:1.0-alpha-9-stable-1:compile
  1263. [INFO] [DEBUG]          junit:junit:jar:3.8.1:compile
  1264. [INFO] [DEBUG]          classworlds:classworlds:jar:1.1-alpha-2:compile
  1265. [INFO] [DEBUG]    org.codehaus.plexus:plexus-utils:jar:3.1.0:compile
  1266. [INFO] [DEBUG]    org.eclipse.tycho:org.eclipse.jdt.core:jar:3.13.50.v20171007-0855:compile
  1267. [INFO] [DEBUG]    org.jsoup:jsoup:jar:1.10.3:compile
  1268. [INFO] [DEBUG]    org.w3c.css:sac:jar:1.3:compile
  1269. [INFO] [DEBUG] Created new class realm plugin>net.revelc.code.formatter:formatter-maven-plugin:2.7.1
  1270. [INFO] [DEBUG] Importing foreign packages into class realm plugin>net.revelc.code.formatter:formatter-maven-plugin:2.7.1
  1271. [INFO] [DEBUG]   Imported:  < maven.api
  1272. [INFO] [DEBUG] Populating class realm plugin>net.revelc.code.formatter:formatter-maven-plugin:2.7.1
  1273. [INFO] [DEBUG]   Included: net.revelc.code.formatter:formatter-maven-plugin:jar:2.7.1
  1274. [INFO] [DEBUG]   Included: com.fasterxml.jackson.core:jackson-core:jar:2.9.2
  1275. [INFO] [DEBUG]   Included: com.fasterxml.jackson.core:jackson-databind:jar:2.9.2
  1276. [INFO] [DEBUG]   Included: com.fasterxml.jackson.core:jackson-annotations:jar:2.9.0
  1277. [INFO] [DEBUG]   Included: com.google.guava:guava:jar:23.3-jre
  1278. [INFO] [DEBUG]   Included: com.google.code.findbugs:jsr305:jar:1.3.9
  1279. [INFO] [DEBUG]   Included: com.google.errorprone:error_prone_annotations:jar:2.0.18
  1280. [INFO] [DEBUG]   Included: com.google.j2objc:j2objc-annotations:jar:1.1
  1281. [INFO] [DEBUG]   Included: org.codehaus.mojo:animal-sniffer-annotations:jar:1.14
  1282. [INFO] [DEBUG]   Included: net.revelc.code.formatter:jsdt-core:jar:2.6.0
  1283. [INFO] [DEBUG]   Included: net.sourceforge.cssparser:cssparser:jar:0.9.23
  1284. [INFO] [DEBUG]   Included: org.apache.commons:commons-digester3:jar:3.2
  1285. [INFO] [DEBUG]   Included: cglib:cglib:jar:2.2.2
  1286. [INFO] [DEBUG]   Included: asm:asm:jar:3.3.1
  1287. [INFO] [DEBUG]   Included: commons-beanutils:commons-beanutils:jar:1.8.3
  1288. [INFO] [DEBUG]   Included: commons-logging:commons-logging:jar:1.1.1
  1289. [INFO] [DEBUG]   Included: org.codehaus.plexus:plexus-resources:jar:1.1.0
  1290. [INFO] [DEBUG]   Included: junit:junit:jar:3.8.1
  1291. [INFO] [DEBUG]   Included: org.codehaus.plexus:plexus-utils:jar:3.1.0
  1292. [INFO] [DEBUG]   Included: org.eclipse.tycho:org.eclipse.jdt.core:jar:3.13.50.v20171007-0855
  1293. [INFO] [DEBUG]   Included: org.jsoup:jsoup:jar:1.10.3
  1294. [INFO] [DEBUG]   Included: org.w3c.css:sac:jar:1.3
  1295. [INFO] [DEBUG] Configuring mojo net.revelc.code.formatter:formatter-maven-plugin:2.7.1:format from plugin realm ClassRealm[plugin>net.revelc.code.formatter:formatter-maven-plugin:2.7.1, parent: sun.misc.Launcher$AppClassLoader@55f96302]
  1296. [INFO] [DEBUG] Configuring mojo 'net.revelc.code.formatter:formatter-maven-plugin:2.7.1:format' with basic configurator -->
  1297. [INFO] [DEBUG]   (f) basedir = C:\openmrs-workspace\openmrs-module-commonlabtest\target\checkout
  1298. [INFO] [DEBUG]   (f) compilerCompliance = 1.6
  1299. [INFO] [DEBUG]   (f) compilerSource = 1.6
  1300. [INFO] [DEBUG]   (f) compilerTargetPlatform = 1.6
  1301. [INFO] [DEBUG]   (f) configCssFile = formatter-maven-plugin/ph-css/css.properties
  1302. [INFO] [DEBUG]   (f) configFile = ../OpenMRSFormatter.xml
  1303. [INFO] [DEBUG]   (f) configHtmlFile = formatter-maven-plugin/jsoup/html.properties
  1304. [INFO] [DEBUG]   (f) configJsFile = formatter-maven-plugin/eclipse/javascript.xml
  1305. [INFO] [DEBUG]   (f) configJsonFile = formatter-maven-plugin/jackson/json.properties
  1306. [INFO] [DEBUG]   (f) configXmlFile = formatter-maven-plugin/jsoup/xml.properties
  1307. [INFO] [DEBUG]   (f) directories = [C:\openmrs-workspace\openmrs-module-commonlabtest\target\checkout]
  1308. [INFO] [DEBUG]   (f) encoding = UTF-8
  1309. [INFO] [DEBUG]   (f) includes = [**/*.java, **/*.json]
  1310. [INFO] [DEBUG]   (f) lineEnding = AUTO
  1311. [INFO] [DEBUG]   (f) skipCssFormatting = false
  1312. [INFO] [DEBUG]   (f) skipFormatting = false
  1313. [INFO] [DEBUG]   (f) skipHtmlFormatting = false
  1314. [INFO] [DEBUG]   (f) skipJavaFormatting = false
  1315. [INFO] [DEBUG]   (f) skipJsFormatting = false
  1316. [INFO] [DEBUG]   (f) skipJsonFormatting = false
  1317. [INFO] [DEBUG]   (f) skipXmlFormatting = false
  1318. [INFO] [DEBUG]   (f) sourceDirectory = C:\openmrs-workspace\openmrs-module-commonlabtest\target\checkout\src\main\java
  1319. [INFO] [DEBUG]   (f) targetDirectory = C:\openmrs-workspace\openmrs-module-commonlabtest\target\checkout\target
  1320. [INFO] [DEBUG]   (f) testSourceDirectory = C:\openmrs-workspace\openmrs-module-commonlabtest\target\checkout\src\test\java
  1321. [INFO] [DEBUG]   (f) useEclipseDefaults = false
  1322. [INFO] [DEBUG] -- end configuration --
  1323. [INFO] [INFO] Using 'UTF-8' encoding to format source files.
  1324. [INFO] [INFO] Number of files to be formatted: 39
  1325. [INFO] [DEBUG] Using search path at: C:\openmrs-workspace\openmrs-module-commonlabtest\target\checkout
  1326. [INFO] [DEBUG] The resource '../OpenMRSFormatter.xml' was not found with resourceLoader org.codehaus.plexus.resource.loader.JarResourceLoader.
  1327. [INFO] [DEBUG] The resource '../OpenMRSFormatter.xml' was not found with resourceLoader org.codehaus.plexus.resource.loader.ThreadContextClasspathResourceLoader.
  1328. [INFO] [DEBUG] URLResourceLoader: No valid URL '../OpenMRSFormatter.xml'
  1329. [INFO] [DEBUG] The resource '../OpenMRSFormatter.xml' was not found with resourceLoader org.codehaus.plexus.resource.loader.URLResourceLoader.
  1330. [INFO] [DEBUG] The resource '../OpenMRSFormatter.xml' was not found with resourceLoader org.codehaus.plexus.resource.loader.FileResourceLoader.
  1331. [INFO] [DEBUG] Config file [../OpenMRSFormatter.xml] cannot be found
  1332. [INFO] org.codehaus.plexus.resource.loader.ResourceNotFoundException: Could not find resource '../OpenMRSFormatter.xml'.
  1333. [INFO]  at org.codehaus.plexus.resource.DefaultResourceManager.getResource(DefaultResourceManager.java:171)
  1334. [INFO]  at org.codehaus.plexus.resource.DefaultResourceManager.getResourceAsInputStream(DefaultResourceManager.java:67)
  1335. [INFO]  at net.revelc.code.formatter.FormatterMojo.getOptionsFromConfigFile(FormatterMojo.java:705)
  1336. [INFO]  at net.revelc.code.formatter.FormatterMojo.getFormattingOptions(FormatterMojo.java:690)
  1337. [INFO]  at net.revelc.code.formatter.FormatterMojo.createCodeFormatter(FormatterMojo.java:642)
  1338. [INFO]  at net.revelc.code.formatter.FormatterMojo.execute(FormatterMojo.java:335)
  1339. [INFO]  at org.apache.maven.plugin.DefaultBuildPluginManager.executeMojo(DefaultBuildPluginManager.java:134)
  1340. [INFO]  at org.apache.maven.lifecycle.internal.MojoExecutor.execute(MojoExecutor.java:208)
  1341. [INFO]  at org.apache.maven.lifecycle.internal.MojoExecutor.execute(MojoExecutor.java:153)
  1342. [INFO]  at org.apache.maven.lifecycle.internal.MojoExecutor.execute(MojoExecutor.java:145)
  1343. [INFO]  at org.apache.maven.lifecycle.internal.LifecycleModuleBuilder.buildProject(LifecycleModuleBuilder.java:116)
  1344. [INFO]  at org.apache.maven.lifecycle.internal.LifecycleModuleBuilder.buildProject(LifecycleModuleBuilder.java:80)
  1345. [INFO]  at org.apache.maven.lifecycle.internal.builder.singlethreaded.SingleThreadedBuilder.build(SingleThreadedBuilder.java:51)
  1346. [INFO]  at org.apache.maven.lifecycle.internal.LifecycleStarter.execute(LifecycleStarter.java:128)
  1347. [INFO]  at org.apache.maven.DefaultMaven.doExecute(DefaultMaven.java:307)
  1348. [INFO]  at org.apache.maven.DefaultMaven.doExecute(DefaultMaven.java:193)
  1349. [INFO]  at org.apache.maven.DefaultMaven.execute(DefaultMaven.java:106)
  1350. [INFO]  at org.apache.maven.cli.MavenCli.execute(MavenCli.java:862)
  1351. [INFO]  at org.apache.maven.cli.MavenCli.doMain(MavenCli.java:286)
  1352. [INFO]  at org.apache.maven.cli.MavenCli.main(MavenCli.java:197)
  1353. [INFO]  at sun.reflect.NativeMethodAccessorImpl.invoke0(Native Method)
  1354. [INFO]  at sun.reflect.NativeMethodAccessorImpl.invoke(NativeMethodAccessorImpl.java:62)
  1355. [INFO]  at sun.reflect.DelegatingMethodAccessorImpl.invoke(DelegatingMethodAccessorImpl.java:43)
  1356. [INFO]  at java.lang.reflect.Method.invoke(Method.java:498)
  1357. [INFO]  at org.codehaus.plexus.classworlds.launcher.Launcher.launchEnhanced(Launcher.java:289)
  1358. [INFO]  at org.codehaus.plexus.classworlds.launcher.Launcher.launch(Launcher.java:229)
  1359. [INFO]  at org.codehaus.plexus.classworlds.launcher.Launcher.mainWithExitCode(Launcher.java:415)
  1360. [INFO]  at org.codehaus.plexus.classworlds.launcher.Launcher.main(Launcher.java:356)
  1361. [INFO] [DEBUG] Using search path at: C:\openmrs-workspace\openmrs-module-commonlabtest\target\checkout
  1362. [INFO] [DEBUG] The resource 'formatter-maven-plugin/eclipse/javascript.xml' was not found with resourceLoader org.codehaus.plexus.resource.loader.JarResourceLoader.
  1363. [INFO] [DEBUG] The resource 'formatter-maven-plugin/eclipse/javascript.xml' was found as jar:file:/C:/Users/owais/.m2/repository/net/revelc/code/formatter/formatter-maven-plugin/2.7.1/formatter-maven-plugin-2.7.1.jar!/formatter-maven-plugin/eclipse/javascript.xml.
  1364. [INFO] [DEBUG] Using search path at: C:\openmrs-workspace\openmrs-module-commonlabtest\target\checkout
  1365. [INFO] [DEBUG] The resource 'formatter-maven-plugin/jsoup/html.properties' was not found with resourceLoader org.codehaus.plexus.resource.loader.JarResourceLoader.
  1366. [INFO] [DEBUG] The resource 'formatter-maven-plugin/jsoup/html.properties' was found as jar:file:/C:/Users/owais/.m2/repository/net/revelc/code/formatter/formatter-maven-plugin/2.7.1/formatter-maven-plugin-2.7.1.jar!/formatter-maven-plugin/jsoup/html.properties.
  1367. [INFO] [DEBUG] Using search path at: C:\openmrs-workspace\openmrs-module-commonlabtest\target\checkout
  1368. [INFO] [DEBUG] The resource 'formatter-maven-plugin/jsoup/xml.properties' was not found with resourceLoader org.codehaus.plexus.resource.loader.JarResourceLoader.
  1369. [INFO] [DEBUG] The resource 'formatter-maven-plugin/jsoup/xml.properties' was found as jar:file:/C:/Users/owais/.m2/repository/net/revelc/code/formatter/formatter-maven-plugin/2.7.1/formatter-maven-plugin-2.7.1.jar!/formatter-maven-plugin/jsoup/xml.properties.
  1370. [INFO] [DEBUG] Using search path at: C:\openmrs-workspace\openmrs-module-commonlabtest\target\checkout
  1371. [INFO] [DEBUG] The resource 'formatter-maven-plugin/jackson/json.properties' was not found with resourceLoader org.codehaus.plexus.resource.loader.JarResourceLoader.
  1372. [INFO] [DEBUG] The resource 'formatter-maven-plugin/jackson/json.properties' was found as jar:file:/C:/Users/owais/.m2/repository/net/revelc/code/formatter/formatter-maven-plugin/2.7.1/formatter-maven-plugin-2.7.1.jar!/formatter-maven-plugin/jackson/json.properties.
  1373. [INFO] [DEBUG] Using search path at: C:\openmrs-workspace\openmrs-module-commonlabtest\target\checkout
  1374. [INFO] [DEBUG] The resource 'formatter-maven-plugin/ph-css/css.properties' was not found with resourceLoader org.codehaus.plexus.resource.loader.JarResourceLoader.
  1375. [INFO] [DEBUG] The resource 'formatter-maven-plugin/ph-css/css.properties' was found as jar:file:/C:/Users/owais/.m2/repository/net/revelc/code/formatter/formatter-maven-plugin/2.7.1/formatter-maven-plugin-2.7.1.jar!/formatter-maven-plugin/ph-css/css.properties.
  1376. [INFO] [DEBUG] Processing file: C:\openmrs-workspace\openmrs-module-commonlabtest\target\checkout\api\src\main\java\org\openmrs\module\commonlabtest\api\CommonLabTestService.java
  1377. [INFO] [DEBUG] Processing file: C:\openmrs-workspace\openmrs-module-commonlabtest\target\checkout\api\src\main\java\org\openmrs\module\commonlabtest\api\CommonLabTestService.java with line ending: AUTO
  1378. [INFO] [DEBUG] Processing file: C:\openmrs-workspace\openmrs-module-commonlabtest\target\checkout\api\src\main\java\org\openmrs\module\commonlabtest\api\dao\CommonLabTestDAO.java
  1379. [INFO] [DEBUG] Processing file: C:\openmrs-workspace\openmrs-module-commonlabtest\target\checkout\api\src\main\java\org\openmrs\module\commonlabtest\api\dao\CommonLabTestDAO.java with line ending: AUTO
  1380. [INFO] [DEBUG] Processing file: C:\openmrs-workspace\openmrs-module-commonlabtest\target\checkout\api\src\main\java\org\openmrs\module\commonlabtest\api\dao\impl\CommonLabTestDAOImpl.java
  1381. [INFO] [DEBUG] Processing file: C:\openmrs-workspace\openmrs-module-commonlabtest\target\checkout\api\src\main\java\org\openmrs\module\commonlabtest\api\dao\impl\CommonLabTestDAOImpl.java with line ending: AUTO
  1382. [INFO] [DEBUG] Processing file: C:\openmrs-workspace\openmrs-module-commonlabtest\target\checkout\api\src\main\java\org\openmrs\module\commonlabtest\api\impl\CommonLabTestServiceImpl.java
  1383. [INFO] [DEBUG] Processing file: C:\openmrs-workspace\openmrs-module-commonlabtest\target\checkout\api\src\main\java\org\openmrs\module\commonlabtest\api\impl\CommonLabTestServiceImpl.java with line ending: AUTO
  1384. [INFO] [DEBUG] Processing file: C:\openmrs-workspace\openmrs-module-commonlabtest\target\checkout\api\src\main\java\org\openmrs\module\commonlabtest\CommonLabTestActivator.java
  1385. [INFO] [DEBUG] Processing file: C:\openmrs-workspace\openmrs-module-commonlabtest\target\checkout\api\src\main\java\org\openmrs\module\commonlabtest\CommonLabTestActivator.java with line ending: AUTO
  1386. [INFO] [DEBUG] Processing file: C:\openmrs-workspace\openmrs-module-commonlabtest\target\checkout\api\src\main\java\org\openmrs\module\commonlabtest\CommonLabTestConfig.java
  1387. [INFO] [DEBUG] Processing file: C:\openmrs-workspace\openmrs-module-commonlabtest\target\checkout\api\src\main\java\org\openmrs\module\commonlabtest\CommonLabTestConfig.java with line ending: AUTO
  1388. [INFO] [DEBUG] Nothing formatted. Try to fix line endings.
  1389. [INFO] [DEBUG] Equal code. Not writing result to file.
  1390. [INFO] [DEBUG] Processing file: C:\openmrs-workspace\openmrs-module-commonlabtest\target\checkout\api\src\main\java\org\openmrs\module\commonlabtest\LabTest.java
  1391. [INFO] [DEBUG] Processing file: C:\openmrs-workspace\openmrs-module-commonlabtest\target\checkout\api\src\main\java\org\openmrs\module\commonlabtest\LabTest.java with line ending: AUTO
  1392. [INFO] [DEBUG] Processing file: C:\openmrs-workspace\openmrs-module-commonlabtest\target\checkout\api\src\main\java\org\openmrs\module\commonlabtest\LabTestAttribute.java
  1393. [INFO] [DEBUG] Processing file: C:\openmrs-workspace\openmrs-module-commonlabtest\target\checkout\api\src\main\java\org\openmrs\module\commonlabtest\LabTestAttribute.java with line ending: AUTO
  1394. [INFO] [DEBUG] Processing file: C:\openmrs-workspace\openmrs-module-commonlabtest\target\checkout\api\src\main\java\org\openmrs\module\commonlabtest\LabTestAttributeType.java
  1395. [INFO] [DEBUG] Processing file: C:\openmrs-workspace\openmrs-module-commonlabtest\target\checkout\api\src\main\java\org\openmrs\module\commonlabtest\LabTestAttributeType.java with line ending: AUTO
  1396. [INFO] [DEBUG] Processing file: C:\openmrs-workspace\openmrs-module-commonlabtest\target\checkout\api\src\main\java\org\openmrs\module\commonlabtest\LabTestSample.java
  1397. [INFO] [DEBUG] Processing file: C:\openmrs-workspace\openmrs-module-commonlabtest\target\checkout\api\src\main\java\org\openmrs\module\commonlabtest\LabTestSample.java with line ending: AUTO
  1398. [INFO] [DEBUG] Processing file: C:\openmrs-workspace\openmrs-module-commonlabtest\target\checkout\api\src\main\java\org\openmrs\module\commonlabtest\LabTestType.java
  1399. [INFO] [DEBUG] Processing file: C:\openmrs-workspace\openmrs-module-commonlabtest\target\checkout\api\src\main\java\org\openmrs\module\commonlabtest\LabTestType.java with line ending: AUTO
  1400. [INFO] [DEBUG] Processing file: C:\openmrs-workspace\openmrs-module-commonlabtest\target\checkout\api\src\test\java\org\openmrs\module\commonlabtest\CommonLabTestBase.java
  1401. [INFO] [DEBUG] Processing file: C:\openmrs-workspace\openmrs-module-commonlabtest\target\checkout\api\src\test\java\org\openmrs\module\commonlabtest\CommonLabTestBase.java with line ending: AUTO
  1402. [INFO] [DEBUG] Processing file: C:\openmrs-workspace\openmrs-module-commonlabtest\target\checkout\api\src\test\java\org\openmrs\module\commonlabtest\CommonLabTestDAOTest.java
  1403. [INFO] [DEBUG] Processing file: C:\openmrs-workspace\openmrs-module-commonlabtest\target\checkout\api\src\test\java\org\openmrs\module\commonlabtest\CommonLabTestDAOTest.java with line ending: AUTO
  1404. [INFO] [DEBUG] Processing file: C:\openmrs-workspace\openmrs-module-commonlabtest\target\checkout\api\src\test\java\org\openmrs\module\commonlabtest\CommonLabTestServiceTest.java
  1405. [INFO] [DEBUG] Processing file: C:\openmrs-workspace\openmrs-module-commonlabtest\target\checkout\api\src\test\java\org\openmrs\module\commonlabtest\CommonLabTestServiceTest.java with line ending: AUTO
  1406. [INFO] [DEBUG] Processing file: C:\openmrs-workspace\openmrs-module-commonlabtest\target\checkout\omod\src\main\java\org\openmrs\module\commonlabtest\extension\html\AdminList.java
  1407. [INFO] [DEBUG] Processing file: C:\openmrs-workspace\openmrs-module-commonlabtest\target\checkout\omod\src\main\java\org\openmrs\module\commonlabtest\extension\html\AdminList.java with line ending: AUTO
  1408. [INFO] [DEBUG] Processing file: C:\openmrs-workspace\openmrs-module-commonlabtest\target\checkout\omod\src\main\java\org\openmrs\module\commonlabtest\extension\html\CommonLabTestExt.java
  1409. [INFO] [DEBUG] Processing file: C:\openmrs-workspace\openmrs-module-commonlabtest\target\checkout\omod\src\main\java\org\openmrs\module\commonlabtest\extension\html\CommonLabTestExt.java with line ending: AUTO
  1410. [INFO] [DEBUG] Nothing formatted. Try to fix line endings.
  1411. [INFO] [DEBUG] Equal code. Not writing result to file.
  1412. [INFO] [DEBUG] Processing file: C:\openmrs-workspace\openmrs-module-commonlabtest\target\checkout\omod\src\main\java\org\openmrs\module\commonlabtest\web\controller\LabTestAttributeTypeController.java
  1413. [INFO] [DEBUG] Processing file: C:\openmrs-workspace\openmrs-module-commonlabtest\target\checkout\omod\src\main\java\org\openmrs\module\commonlabtest\web\controller\LabTestAttributeTypeController.java with line ending: AUTO
  1414. [INFO] [DEBUG] Processing file: C:\openmrs-workspace\openmrs-module-commonlabtest\target\checkout\omod\src\main\java\org\openmrs\module\commonlabtest\web\controller\LabTestOrderController.java
  1415. [INFO] [DEBUG] Processing file: C:\openmrs-workspace\openmrs-module-commonlabtest\target\checkout\omod\src\main\java\org\openmrs\module\commonlabtest\web\controller\LabTestOrderController.java with line ending: AUTO
  1416. [INFO] [DEBUG] Processing file: C:\openmrs-workspace\openmrs-module-commonlabtest\target\checkout\omod\src\main\java\org\openmrs\module\commonlabtest\web\controller\LabTestOrderPortletController.java
  1417. [INFO] [DEBUG] Processing file: C:\openmrs-workspace\openmrs-module-commonlabtest\target\checkout\omod\src\main\java\org\openmrs\module\commonlabtest\web\controller\LabTestOrderPortletController.java with line ending: AUTO
  1418. [INFO] [DEBUG] Processing file: C:\openmrs-workspace\openmrs-module-commonlabtest\target\checkout\omod\src\main\java\org\openmrs\module\commonlabtest\web\controller\LabTestRequestController.java
  1419. [INFO] [DEBUG] Processing file: C:\openmrs-workspace\openmrs-module-commonlabtest\target\checkout\omod\src\main\java\org\openmrs\module\commonlabtest\web\controller\LabTestRequestController.java with line ending: AUTO
  1420. [INFO] [DEBUG] Processing file: C:\openmrs-workspace\openmrs-module-commonlabtest\target\checkout\omod\src\main\java\org\openmrs\module\commonlabtest\web\controller\LabTestResultController.java
  1421. [INFO] [DEBUG] Processing file: C:\openmrs-workspace\openmrs-module-commonlabtest\target\checkout\omod\src\main\java\org\openmrs\module\commonlabtest\web\controller\LabTestResultController.java with line ending: AUTO
  1422. [INFO] [DEBUG] Processing file: C:\openmrs-workspace\openmrs-module-commonlabtest\target\checkout\omod\src\main\java\org\openmrs\module\commonlabtest\web\controller\LabTestResultViewController.java
  1423. [INFO] [DEBUG] Processing file: C:\openmrs-workspace\openmrs-module-commonlabtest\target\checkout\omod\src\main\java\org\openmrs\module\commonlabtest\web\controller\LabTestResultViewController.java with line ending: AUTO
  1424. [INFO] [DEBUG] Processing file: C:\openmrs-workspace\openmrs-module-commonlabtest\target\checkout\omod\src\main\java\org\openmrs\module\commonlabtest\web\controller\LabTestSampleController.java
  1425. [INFO] [DEBUG] Processing file: C:\openmrs-workspace\openmrs-module-commonlabtest\target\checkout\omod\src\main\java\org\openmrs\module\commonlabtest\web\controller\LabTestSampleController.java with line ending: AUTO
  1426. [INFO] [DEBUG] Processing file: C:\openmrs-workspace\openmrs-module-commonlabtest\target\checkout\omod\src\main\java\org\openmrs\module\commonlabtest\web\controller\LabTestTypeController.java
  1427. [INFO] [DEBUG] Processing file: C:\openmrs-workspace\openmrs-module-commonlabtest\target\checkout\omod\src\main\java\org\openmrs\module\commonlabtest\web\controller\LabTestTypeController.java with line ending: AUTO
  1428. [INFO] [DEBUG] Processing file: C:\openmrs-workspace\openmrs-module-commonlabtest\target\checkout\omod\src\main\java\org\openmrs\module\commonlabtest\web\controller\ManageLabTestAttributeTypesController.java
  1429. [INFO] [DEBUG] Processing file: C:\openmrs-workspace\openmrs-module-commonlabtest\target\checkout\omod\src\main\java\org\openmrs\module\commonlabtest\web\controller\ManageLabTestAttributeTypesController.java with line ending: AUTO
  1430. [INFO] [DEBUG] Processing file: C:\openmrs-workspace\openmrs-module-commonlabtest\target\checkout\omod\src\main\java\org\openmrs\module\commonlabtest\web\controller\ManageLabTestSampleController.java
  1431. [INFO] [DEBUG] Processing file: C:\openmrs-workspace\openmrs-module-commonlabtest\target\checkout\omod\src\main\java\org\openmrs\module\commonlabtest\web\controller\ManageLabTestSampleController.java with line ending: AUTO
  1432. [INFO] [DEBUG] Processing file: C:\openmrs-workspace\openmrs-module-commonlabtest\target\checkout\omod\src\main\java\org\openmrs\module\commonlabtest\web\controller\ManageLabTestTypeController.java
  1433. [INFO] [DEBUG] Processing file: C:\openmrs-workspace\openmrs-module-commonlabtest\target\checkout\omod\src\main\java\org\openmrs\module\commonlabtest\web\controller\ManageLabTestTypeController.java with line ending: AUTO
  1434. [INFO] [DEBUG] Nothing formatted. Try to fix line endings.
  1435. [INFO] [DEBUG] Equal code. Not writing result to file.
  1436. [INFO] [DEBUG] Processing file: C:\openmrs-workspace\openmrs-module-commonlabtest\target\checkout\omod\src\main\java\org\openmrs\module\commonlabtest\web\resource\CommonLabModuleResourceController.java
  1437. [INFO] [DEBUG] Processing file: C:\openmrs-workspace\openmrs-module-commonlabtest\target\checkout\omod\src\main\java\org\openmrs\module\commonlabtest\web\resource\CommonLabModuleResourceController.java with line ending: AUTO
  1438. [INFO] [DEBUG] Nothing formatted. Try to fix line endings.
  1439. [INFO] [DEBUG] Equal code. Not writing result to file.
  1440. [INFO] [DEBUG] Processing file: C:\openmrs-workspace\openmrs-module-commonlabtest\target\checkout\omod\src\main\java\org\openmrs\module\commonlabtest\web\resource\LabTestAttributeResourceController.java
  1441. [INFO] [DEBUG] Processing file: C:\openmrs-workspace\openmrs-module-commonlabtest\target\checkout\omod\src\main\java\org\openmrs\module\commonlabtest\web\resource\LabTestAttributeResourceController.java with line ending: AUTO
  1442. [INFO] [DEBUG] Processing file: C:\openmrs-workspace\openmrs-module-commonlabtest\target\checkout\omod\src\main\java\org\openmrs\module\commonlabtest\web\resource\LabTestAttributeTypeResourceController.java
  1443. [INFO] [DEBUG] Processing file: C:\openmrs-workspace\openmrs-module-commonlabtest\target\checkout\omod\src\main\java\org\openmrs\module\commonlabtest\web\resource\LabTestAttributeTypeResourceController.java with line ending: AUTO
  1444. [INFO] [DEBUG] Processing file: C:\openmrs-workspace\openmrs-module-commonlabtest\target\checkout\omod\src\main\java\org\openmrs\module\commonlabtest\web\resource\LabTestOrderResourceController.java
  1445. [INFO] [DEBUG] Processing file: C:\openmrs-workspace\openmrs-module-commonlabtest\target\checkout\omod\src\main\java\org\openmrs\module\commonlabtest\web\resource\LabTestOrderResourceController.java with line ending: AUTO
  1446. [INFO] [DEBUG] Processing file: C:\openmrs-workspace\openmrs-module-commonlabtest\target\checkout\omod\src\main\java\org\openmrs\module\commonlabtest\web\resource\LabTestSampleResourceController.java
  1447. [INFO] [DEBUG] Processing file: C:\openmrs-workspace\openmrs-module-commonlabtest\target\checkout\omod\src\main\java\org\openmrs\module\commonlabtest\web\resource\LabTestSampleResourceController.java with line ending: AUTO
  1448. [INFO] [DEBUG] Processing file: C:\openmrs-workspace\openmrs-module-commonlabtest\target\checkout\omod\src\main\java\org\openmrs\module\commonlabtest\web\resource\LabTestTypeResourceController.java
  1449. [INFO] [DEBUG] Processing file: C:\openmrs-workspace\openmrs-module-commonlabtest\target\checkout\omod\src\main\java\org\openmrs\module\commonlabtest\web\resource\LabTestTypeResourceController.java with line ending: AUTO
  1450. [INFO] [DEBUG] Processing file: C:\openmrs-workspace\openmrs-module-commonlabtest\target\checkout\omod\src\test\java\org\openmrs\module\commonlabtest\AdminListExtensionTest.java
  1451. [INFO] [DEBUG] Processing file: C:\openmrs-workspace\openmrs-module-commonlabtest\target\checkout\omod\src\test\java\org\openmrs\module\commonlabtest\AdminListExtensionTest.java with line ending: AUTO
  1452. [INFO] [DEBUG] Nothing formatted. Try to fix line endings.
  1453. [INFO] [DEBUG] Equal code. Not writing result to file.
  1454. [INFO] [DEBUG] Processing file: C:\openmrs-workspace\openmrs-module-commonlabtest\target\checkout\omod\src\test\java\org\openmrs\module\commonlabtest\LabTestAttributeResourceControllerTest.java
  1455. [INFO] [DEBUG] Processing file: C:\openmrs-workspace\openmrs-module-commonlabtest\target\checkout\omod\src\test\java\org\openmrs\module\commonlabtest\LabTestAttributeResourceControllerTest.java with line ending: AUTO
  1456. [INFO] [DEBUG] Nothing formatted. Try to fix line endings.
  1457. [INFO] [DEBUG] Equal code. Not writing result to file.
  1458. [INFO] [DEBUG] Processing file: C:\openmrs-workspace\openmrs-module-commonlabtest\target\checkout\omod\src\test\java\org\openmrs\module\commonlabtest\LabTestAttributeTypeResourceControllerTest.java
  1459. [INFO] [DEBUG] Processing file: C:\openmrs-workspace\openmrs-module-commonlabtest\target\checkout\omod\src\test\java\org\openmrs\module\commonlabtest\LabTestAttributeTypeResourceControllerTest.java with line ending: AUTO
  1460. [INFO] [DEBUG] Nothing formatted. Try to fix line endings.
  1461. [INFO] [DEBUG] Equal code. Not writing result to file.
  1462. [INFO] [DEBUG] Processing file: C:\openmrs-workspace\openmrs-module-commonlabtest\target\checkout\omod\src\test\java\org\openmrs\module\commonlabtest\LabTestOrderResourceControllerTest.java
  1463. [INFO] [DEBUG] Processing file: C:\openmrs-workspace\openmrs-module-commonlabtest\target\checkout\omod\src\test\java\org\openmrs\module\commonlabtest\LabTestOrderResourceControllerTest.java with line ending: AUTO
  1464. [INFO] [DEBUG] Nothing formatted. Try to fix line endings.
  1465. [INFO] [DEBUG] Equal code. Not writing result to file.
  1466. [INFO] [DEBUG] Processing file: C:\openmrs-workspace\openmrs-module-commonlabtest\target\checkout\omod\src\test\java\org\openmrs\module\commonlabtest\LabTestSampleResourceControllerTest.java
  1467. [INFO] [DEBUG] Processing file: C:\openmrs-workspace\openmrs-module-commonlabtest\target\checkout\omod\src\test\java\org\openmrs\module\commonlabtest\LabTestSampleResourceControllerTest.java with line ending: AUTO
  1468. [INFO] [DEBUG] Nothing formatted. Try to fix line endings.
  1469. [INFO] [DEBUG] Equal code. Not writing result to file.
  1470. [INFO] [DEBUG] Processing file: C:\openmrs-workspace\openmrs-module-commonlabtest\target\checkout\omod\src\test\java\org\openmrs\module\commonlabtest\LabTestTypeResourceControllerTest.java
  1471. [INFO] [DEBUG] Processing file: C:\openmrs-workspace\openmrs-module-commonlabtest\target\checkout\omod\src\test\java\org\openmrs\module\commonlabtest\LabTestTypeResourceControllerTest.java with line ending: AUTO
  1472. [INFO] [DEBUG] Nothing formatted. Try to fix line endings.
  1473. [INFO] [DEBUG] Equal code. Not writing result to file.
  1474. [INFO] [INFO] Successfully formatted:          29 file(s)
  1475. [INFO] [INFO] Fail to format:                  0 file(s)
  1476. [INFO] [INFO] Skipped:                         10 file(s)
  1477. [INFO] [INFO] Read only skipped:               0 file(s)
  1478. [INFO] [INFO] Approximate time taken:          6s
  1479. [INFO] [INFO]
  1480. [INFO] [INFO] >>> maven-source-plugin:2.1.2:jar (attach-sources) > generate-sources @ commonlabtest >>>
  1481. [INFO] [INFO]
  1482. [INFO] [INFO] --- buildnumber-maven-plugin:1.1:create (default) @ commonlabtest ---
  1483. [INFO] [DEBUG] Configuring mojo org.codehaus.mojo:buildnumber-maven-plugin:1.1:create from plugin realm ClassRealm[plugin>org.codehaus.mojo:buildnumber-maven-plugin:1.1, parent: sun.misc.Launcher$AppClassLoader@55f96302]
  1484. [INFO] [DEBUG] Configuring mojo 'org.codehaus.mojo:buildnumber-maven-plugin:1.1:create' with basic configurator -->
  1485. [INFO] [DEBUG]   (s) buildNumberPropertiesFileLocation = C:\openmrs-workspace\openmrs-module-commonlabtest\target\checkout\buildNumber.properties
  1486. [INFO] [DEBUG]   (f) buildNumberPropertyName = revisionNumber
  1487. [INFO] [DEBUG]   (s) doCheck = false
  1488. [INFO] [DEBUG]   (s) doUpdate = false
  1489. [INFO] [DEBUG]   (f) getRevisionOnlyOnce = true
  1490. [INFO] [DEBUG]   (f) project = MavenProject: org.openmrs.module:commonlabtest:1.3.1 @ C:\openmrs-workspace\openmrs-module-commonlabtest\target\checkout\pom.xml
  1491. [INFO] [DEBUG]   (f) reactorProjects = [MavenProject: org.openmrs.module:commonlabtest:1.3.1 @ C:\openmrs-workspace\openmrs-module-commonlabtest\target\checkout\pom.xml, MavenProject: org.openmrs.module:commonlabtest-api:1.3.1 @ C:\openmrs-workspace\openmrs-module-commonlabtest\target\checkout\api\pom.xml, MavenProject: org.openmrs.module:commonlabtest-omod:1.3.1 @ C:\openmrs-workspace\openmrs-module-commonlabtest\target\checkout\omod\pom.xml]
  1492. [INFO] [DEBUG]   (f) readUrlScm = scm:git:https://github.com/openmrs/openmrs-module-commonlabtest
  1493. [INFO] [DEBUG]   (s) revisionOnScmFailure = 0
  1494. [INFO] [DEBUG]   (f) scmBranchPropertyName = scmBranch
  1495. [INFO] [DEBUG]   (s) scmDirectory = C:\openmrs-workspace\openmrs-module-commonlabtest\target\checkout
  1496. [INFO] [DEBUG]   (f) session = org.apache.maven.execution.MavenSession@155d1021
  1497. [INFO] [DEBUG]   (s) shortRevisionLength = 6
  1498. [INFO] [DEBUG]   (f) timestampPropertyName = timestamp
  1499. [INFO] [DEBUG]   (s) urlScm = scm:git:https://github.com/openmrs/openmrs-module-commonlabtest
  1500. [INFO] [DEBUG]   (f) useLastCommittedRevision = false
  1501. [INFO] [DEBUG] -- end configuration --
  1502. [INFO] [DEBUG] Revision available from previous execution
  1503. [INFO] [INFO]
  1504. [INFO] [INFO] <<< maven-source-plugin:2.1.2:jar (attach-sources) < generate-sources @ commonlabtest <<<
  1505. [INFO] [INFO]
  1506. [INFO] [INFO] --- maven-source-plugin:2.1.2:jar (attach-sources) @ commonlabtest ---
  1507. [INFO] [DEBUG] Dependency collection stats: {ConflictMarker.analyzeTime=1, ConflictMarker.markTime=0, ConflictMarker.nodeCount=48, ConflictIdSorter.graphTime=0, ConflictIdSorter.topsortTime=0, ConflictIdSorter.conflictIdCount=18, ConflictIdSorter.conflictIdCycleCount=0, ConflictResolver.totalTime=0, ConflictResolver.conflictItemCount=42, DefaultDependencyCollector.collectTime=91, DefaultDependencyCollector.transformTime=1}
  1508. [INFO] [DEBUG] org.apache.maven.plugins:maven-source-plugin:jar:2.1.2:
  1509. [INFO] [DEBUG]    org.apache.maven:maven-model:jar:2.0.9:compile
  1510. [INFO] [DEBUG]    org.apache.maven:maven-artifact:jar:2.0.9:compile
  1511. [INFO] [DEBUG]    org.apache.maven:maven-plugin-api:jar:2.0.9:compile
  1512. [INFO] [DEBUG]    org.apache.maven:maven-project:jar:2.0.9:compile
  1513. [INFO] [DEBUG]       org.apache.maven:maven-settings:jar:2.0.9:compile
  1514. [INFO] [DEBUG]       org.apache.maven:maven-profile:jar:2.0.9:compile
  1515. [INFO] [DEBUG]       org.apache.maven:maven-artifact-manager:jar:2.0.9:compile
  1516. [INFO] [DEBUG]          org.apache.maven:maven-repository-metadata:jar:2.0.9:compile
  1517. [INFO] [DEBUG]       org.apache.maven:maven-plugin-registry:jar:2.0.9:compile
  1518. [INFO] [DEBUG]       org.codehaus.plexus:plexus-container-default:jar:1.0-alpha-9-stable-1:compile
  1519. [INFO] [DEBUG]          junit:junit:jar:3.8.1:compile
  1520. [INFO] [DEBUG]          classworlds:classworlds:jar:1.1-alpha-2:compile
  1521. [INFO] [DEBUG]    org.apache.maven:maven-archiver:jar:2.4.1:compile
  1522. [INFO] [DEBUG]       org.codehaus.plexus:plexus-interpolation:jar:1.13:compile
  1523. [INFO] [DEBUG]    org.codehaus.plexus:plexus-archiver:jar:1.0:compile
  1524. [INFO] [DEBUG]       org.codehaus.plexus:plexus-io:jar:1.0:compile
  1525. [INFO] [DEBUG]    org.codehaus.plexus:plexus-utils:jar:2.0.5:compile
  1526. [INFO] [DEBUG] Created new class realm plugin>org.apache.maven.plugins:maven-source-plugin:2.1.2
  1527. [INFO] [DEBUG] Importing foreign packages into class realm plugin>org.apache.maven.plugins:maven-source-plugin:2.1.2
  1528. [INFO] [DEBUG]   Imported:  < maven.api
  1529. [INFO] [DEBUG] Populating class realm plugin>org.apache.maven.plugins:maven-source-plugin:2.1.2
  1530. [INFO] [DEBUG]   Included: org.apache.maven.plugins:maven-source-plugin:jar:2.1.2
  1531. [INFO] [DEBUG]   Included: junit:junit:jar:3.8.1
  1532. [INFO] [DEBUG]   Included: org.apache.maven:maven-archiver:jar:2.4.1
  1533. [INFO] [DEBUG]   Included: org.codehaus.plexus:plexus-interpolation:jar:1.13
  1534. [INFO] [DEBUG]   Included: org.codehaus.plexus:plexus-archiver:jar:1.0
  1535. [INFO] [DEBUG]   Included: org.codehaus.plexus:plexus-io:jar:1.0
  1536. [INFO] [DEBUG]   Included: org.codehaus.plexus:plexus-utils:jar:2.0.5
  1537. [INFO] [DEBUG] Configuring mojo org.apache.maven.plugins:maven-source-plugin:2.1.2:jar from plugin realm ClassRealm[plugin>org.apache.maven.plugins:maven-source-plugin:2.1.2, parent: sun.misc.Launcher$AppClassLoader@55f96302]
  1538. [INFO] [DEBUG] Configuring mojo 'org.apache.maven.plugins:maven-source-plugin:2.1.2:jar' with basic configurator -->
  1539. [INFO] [DEBUG]   (f) attach = true
  1540. [INFO] [DEBUG]   (f) defaultManifestFile = C:\openmrs-workspace\openmrs-module-commonlabtest\target\checkout\target\classes\META-INF\MANIFEST.MF
  1541. [INFO] [DEBUG]   (f) excludeResources = false
  1542. [INFO] [DEBUG]   (f) finalName = commonlabtest-1.3.1
  1543. [INFO] [DEBUG]   (f) forceCreation = false
  1544. [INFO] [DEBUG]   (f) includePom = false
  1545. [INFO] [DEBUG]   (f) outputDirectory = C:\openmrs-workspace\openmrs-module-commonlabtest\target\checkout\target
  1546. [INFO] [DEBUG]   (f) project = MavenProject: org.openmrs.module:commonlabtest:1.3.1 @ C:\openmrs-workspace\openmrs-module-commonlabtest\target\checkout\pom.xml
  1547. [INFO] [DEBUG]   (f) reactorProjects = [MavenProject: org.openmrs.module:commonlabtest:1.3.1 @ C:\openmrs-workspace\openmrs-module-commonlabtest\target\checkout\pom.xml, MavenProject: org.openmrs.module:commonlabtest-api:1.3.1 @ C:\openmrs-workspace\openmrs-module-commonlabtest\target\checkout\api\pom.xml, MavenProject: org.openmrs.module:commonlabtest-omod:1.3.1 @ C:\openmrs-workspace\openmrs-module-commonlabtest\target\checkout\omod\pom.xml]
  1548. [INFO] [DEBUG]   (f) useDefaultExcludes = true
  1549. [INFO] [DEBUG]   (f) useDefaultManifestFile = false
  1550. [INFO] [DEBUG] -- end configuration --
  1551. [INFO] [INFO]
  1552. [INFO] [INFO] --- maven-javadoc-plugin:2.8.1:jar (attach-javadocs) @ commonlabtest ---
  1553. [INFO] [DEBUG] Dependency collection stats: {ConflictMarker.analyzeTime=0, ConflictMarker.markTime=0, ConflictMarker.nodeCount=256, ConflictIdSorter.graphTime=1, ConflictIdSorter.topsortTime=1, ConflictIdSorter.conflictIdCount=53, ConflictIdSorter.conflictIdCycleCount=0, ConflictResolver.totalTime=1, ConflictResolver.conflictItemCount=132, DefaultDependencyCollector.collectTime=400, DefaultDependencyCollector.transformTime=3}
  1554. [INFO] [DEBUG] org.apache.maven.plugins:maven-javadoc-plugin:jar:2.8.1:
  1555. [INFO] [DEBUG]    org.apache.maven:maven-core:jar:2.0.9:compile
  1556. [INFO] [DEBUG]       org.apache.maven:maven-plugin-parameter-documenter:jar:2.0.9:compile
  1557. [INFO] [DEBUG]       org.apache.maven:maven-profile:jar:2.0.9:compile
  1558. [INFO] [DEBUG]       org.apache.maven:maven-repository-metadata:jar:2.0.9:compile
  1559. [INFO] [DEBUG]       org.apache.maven:maven-error-diagnostics:jar:2.0.9:compile
  1560. [INFO] [DEBUG]       commons-cli:commons-cli:jar:1.0:compile
  1561. [INFO] [DEBUG]       org.apache.maven:maven-plugin-descriptor:jar:2.0.9:compile
  1562. [INFO] [DEBUG]       org.codehaus.plexus:plexus-interactivity-api:jar:1.0-alpha-4:compile
  1563. [INFO] [DEBUG]       org.apache.maven:maven-monitor:jar:2.0.9:compile
  1564. [INFO] [DEBUG]       classworlds:classworlds:jar:1.1:compile
  1565. [INFO] [DEBUG]    org.apache.maven:maven-project:jar:2.0.9:compile
  1566. [INFO] [DEBUG]       org.apache.maven:maven-plugin-registry:jar:2.0.9:compile
  1567. [INFO] [DEBUG]    org.apache.maven:maven-model:jar:2.0.9:compile
  1568. [INFO] [DEBUG]    org.apache.maven:maven-settings:jar:2.0.9:compile
  1569. [INFO] [DEBUG]    org.apache.maven:maven-plugin-api:jar:2.0.9:compile
  1570. [INFO] [DEBUG]    org.apache.maven:maven-artifact:jar:2.0.9:compile
  1571. [INFO] [DEBUG]    org.apache.maven:maven-artifact-manager:jar:2.0.9:compile
  1572. [INFO] [DEBUG]    org.apache.maven.reporting:maven-reporting-api:jar:3.0:compile
  1573. [INFO] [DEBUG]    org.apache.maven:maven-archiver:jar:2.3:compile
  1574. [INFO] [DEBUG]    org.apache.maven.shared:maven-invoker:jar:2.0.9:compile
  1575. [INFO] [DEBUG]    org.apache.maven.shared:maven-common-artifact-filters:jar:1.3:compile
  1576. [INFO] [DEBUG]    org.apache.maven.doxia:doxia-sink-api:jar:1.0:compile
  1577. [INFO] [DEBUG]    org.apache.maven.doxia:doxia-site-renderer:jar:1.0:compile
  1578. [INFO] [DEBUG]       org.apache.maven.doxia:doxia-core:jar:1.0:compile
  1579. [INFO] [DEBUG]       org.codehaus.plexus:plexus-i18n:jar:1.0-beta-7:compile
  1580. [INFO] [DEBUG]       org.codehaus.plexus:plexus-velocity:jar:1.1.7:compile
  1581. [INFO] [DEBUG]       org.apache.velocity:velocity:jar:1.5:compile
  1582. [INFO] [DEBUG]          oro:oro:jar:2.0.8:compile
  1583. [INFO] [DEBUG]       org.apache.maven.doxia:doxia-decoration-model:jar:1.0:compile
  1584. [INFO] [DEBUG]       commons-collections:commons-collections:jar:3.2:compile
  1585. [INFO] [DEBUG]       org.apache.maven.doxia:doxia-module-apt:jar:1.0:compile
  1586. [INFO] [DEBUG]       org.apache.maven.doxia:doxia-module-fml:jar:1.0:compile
  1587. [INFO] [DEBUG]       org.apache.maven.doxia:doxia-module-xdoc:jar:1.0:compile
  1588. [INFO] [DEBUG]       org.apache.maven.doxia:doxia-module-xhtml:jar:1.0:compile
  1589. [INFO] [DEBUG]    org.apache.maven.wagon:wagon-provider-api:jar:1.0-beta-6:compile
  1590. [INFO] [DEBUG]    commons-lang:commons-lang:jar:2.4:compile
  1591. [INFO] [DEBUG]    commons-httpclient:commons-httpclient:jar:3.1:compile
  1592. [INFO] [DEBUG]       commons-codec:commons-codec:jar:1.2:compile
  1593. [INFO] [DEBUG]    commons-logging:commons-logging:jar:1.1.1:compile
  1594. [INFO] [DEBUG]    log4j:log4j:jar:1.2.14:compile
  1595. [INFO] [DEBUG]    com.thoughtworks.qdox:qdox:jar:1.12:compile
  1596. [INFO] [DEBUG]    org.codehaus.plexus:plexus-container-default:jar:1.0-alpha-9:compile
  1597. [INFO] [DEBUG]       junit:junit:jar:3.8.1:compile
  1598. [INFO] [DEBUG]    org.codehaus.plexus:plexus-archiver:jar:1.0-alpha-9:compile
  1599. [INFO] [DEBUG]       org.codehaus.plexus:plexus-io:jar:1.0-alpha-1:compile
  1600. [INFO] [DEBUG]    org.apache.maven:maven-toolchain:jar:1.0:compile
  1601. [INFO] [DEBUG]    org.codehaus.plexus:plexus-utils:jar:1.5.8:compile
  1602. [INFO] [DEBUG]    org.mockito:mockito-core:jar:1.8.5:compile
  1603. [INFO] [DEBUG]       org.hamcrest:hamcrest-core:jar:1.1:compile
  1604. [INFO] [DEBUG]       org.objenesis:objenesis:jar:1.0:compile
  1605. [INFO] [DEBUG] Created new class realm plugin>org.apache.maven.plugins:maven-javadoc-plugin:2.8.1
  1606. [INFO] [DEBUG] Importing foreign packages into class realm plugin>org.apache.maven.plugins:maven-javadoc-plugin:2.8.1
  1607. [INFO] [DEBUG]   Imported:  < maven.api
  1608. [INFO] [DEBUG] Populating class realm plugin>org.apache.maven.plugins:maven-javadoc-plugin:2.8.1
  1609. [INFO] [DEBUG]   Included: org.apache.maven.plugins:maven-javadoc-plugin:jar:2.8.1
  1610. [INFO] [DEBUG]   Included: commons-cli:commons-cli:jar:1.0
  1611. [INFO] [DEBUG]   Included: org.codehaus.plexus:plexus-interactivity-api:jar:1.0-alpha-4
  1612. [INFO] [DEBUG]   Included: org.apache.maven.reporting:maven-reporting-api:jar:3.0
  1613. [INFO] [DEBUG]   Included: org.apache.maven:maven-archiver:jar:2.3
  1614. [INFO] [DEBUG]   Included: org.apache.maven.shared:maven-invoker:jar:2.0.9
  1615. [INFO] [DEBUG]   Included: org.apache.maven.shared:maven-common-artifact-filters:jar:1.3
  1616. [INFO] [DEBUG]   Included: org.apache.maven.doxia:doxia-sink-api:jar:1.0
  1617. [INFO] [DEBUG]   Included: org.apache.maven.doxia:doxia-site-renderer:jar:1.0
  1618. [INFO] [DEBUG]   Included: org.apache.maven.doxia:doxia-core:jar:1.0
  1619. [INFO] [DEBUG]   Included: org.codehaus.plexus:plexus-i18n:jar:1.0-beta-7
  1620. [INFO] [DEBUG]   Included: org.codehaus.plexus:plexus-velocity:jar:1.1.7
  1621. [INFO] [DEBUG]   Included: org.apache.velocity:velocity:jar:1.5
  1622. [INFO] [DEBUG]   Included: oro:oro:jar:2.0.8
  1623. [INFO] [DEBUG]   Included: org.apache.maven.doxia:doxia-decoration-model:jar:1.0
  1624. [INFO] [DEBUG]   Included: commons-collections:commons-collections:jar:3.2
  1625. [INFO] [DEBUG]   Included: org.apache.maven.doxia:doxia-module-apt:jar:1.0
  1626. [INFO] [DEBUG]   Included: org.apache.maven.doxia:doxia-module-fml:jar:1.0
  1627. [INFO] [DEBUG]   Included: org.apache.maven.doxia:doxia-module-xdoc:jar:1.0
  1628. [INFO] [DEBUG]   Included: org.apache.maven.doxia:doxia-module-xhtml:jar:1.0
  1629. [INFO] [DEBUG]   Included: commons-lang:commons-lang:jar:2.4
  1630. [INFO] [DEBUG]   Included: commons-httpclient:commons-httpclient:jar:3.1
  1631. [INFO] [DEBUG]   Included: commons-codec:commons-codec:jar:1.2
  1632. [INFO] [DEBUG]   Included: commons-logging:commons-logging:jar:1.1.1
  1633. [INFO] [DEBUG]   Included: log4j:log4j:jar:1.2.14
  1634. [INFO] [DEBUG]   Included: com.thoughtworks.qdox:qdox:jar:1.12
  1635. [INFO] [DEBUG]   Included: junit:junit:jar:3.8.1
  1636. [INFO] [DEBUG]   Included: org.codehaus.plexus:plexus-archiver:jar:1.0-alpha-9
  1637. [INFO] [DEBUG]   Included: org.codehaus.plexus:plexus-io:jar:1.0-alpha-1
  1638. [INFO] [DEBUG]   Included: org.codehaus.plexus:plexus-utils:jar:1.5.8
  1639. [INFO] [DEBUG]   Included: org.mockito:mockito-core:jar:1.8.5
  1640. [INFO] [DEBUG]   Included: org.hamcrest:hamcrest-core:jar:1.1
  1641. [INFO] [DEBUG]   Included: org.objenesis:objenesis:jar:1.0
  1642. [INFO] [DEBUG] Configuring mojo org.apache.maven.plugins:maven-javadoc-plugin:2.8.1:jar from plugin realm ClassRealm[plugin>org.apache.maven.plugins:maven-javadoc-plugin:2.8.1, parent: sun.misc.Launcher$AppClassLoader@55f96302]
  1643. [INFO] [DEBUG] Configuring mojo 'org.apache.maven.plugins:maven-javadoc-plugin:2.8.1:jar' with basic configurator -->
  1644. [INFO] [DEBUG]   (f) aggregate = false
  1645. [INFO] [DEBUG]   (f) attach = true
  1646. [INFO] [DEBUG]   (f) author = true
  1647. [INFO] [DEBUG]   (f) bootclasspathArtifacts = []
  1648. [INFO] [DEBUG]   (f) bottom = Copyright &#169; {inceptionYear}-{currentYear} {organizationName}. All Rights Reserved.
  1649. [INFO] [DEBUG]   (f) breakiterator = false
  1650. [INFO] [DEBUG]   (f) debug = false
  1651. [INFO] [DEBUG]   (f) defaultManifestFile = C:\openmrs-workspace\openmrs-module-commonlabtest\target\checkout\target\classes\META-INF\MANIFEST.MF
  1652. [INFO] [DEBUG]   (f) detectJavaApiLink = true
  1653. [INFO] [DEBUG]   (f) detectLinks = false
  1654. [INFO] [DEBUG]   (f) detectOfflineLinks = true
  1655. [INFO] [DEBUG]   (f) docfilessubdirs = false
  1656. [INFO] [DEBUG]   (f) docletArtifact = groupId = 'null'
  1657. [INFO] artifactId = 'null'
  1658. [INFO] version = 'null'
  1659. [INFO] [DEBUG]   (f) docletArtifacts = []
  1660. [INFO] [DEBUG]   (f) doctitle = Common Lab Test 1.3.1 API
  1661. [INFO] [DEBUG]   (f) encoding = UTF-8
  1662. [INFO] [DEBUG]   (f) failOnError = true
  1663. [INFO] [DEBUG]   (f) finalName = commonlabtest-1.3.1
  1664. [INFO] [DEBUG]   (f) groups = []
  1665. [INFO] [DEBUG]   (f) includeDependencySources = false
  1666. [INFO] [DEBUG]   (f) includeTransitiveDependencySources = false
  1667. [INFO] [DEBUG]   (f) isOffline = false
  1668. [INFO] [DEBUG]   (f) jarOutputDirectory = C:\openmrs-workspace\openmrs-module-commonlabtest\target\checkout\target
  1669. [INFO] [DEBUG]   (f) javaApiLinks = {}
  1670. [INFO] [DEBUG]   (f) javadocDirectory = C:\openmrs-workspace\openmrs-module-commonlabtest\target\checkout\src\main\javadoc
  1671. [INFO] [DEBUG]   (f) javadocOptionsDir = C:\openmrs-workspace\openmrs-module-commonlabtest\target\checkout\target\javadoc-bundle-options
  1672. [INFO] [DEBUG]   (f) keywords = false
  1673. [INFO] [DEBUG]   (f) links = []
  1674. [INFO] [DEBUG]   (f) linksource = false
  1675. [INFO] [DEBUG]   (f) localRepository =       id: local
  1676. [INFO]       url: file:///C:/Users/owais/.m2/repository/
  1677. [INFO]    layout: default
  1678. [INFO] snapshots: [enabled => true, update => always]
  1679. [INFO]  releases: [enabled => true, update => always]
  1680. [INFO]
  1681. [INFO] [DEBUG]   (f) nocomment = false
  1682. [INFO] [DEBUG]   (f) nodeprecated = false
  1683. [INFO] [DEBUG]   (f) nodeprecatedlist = false
  1684. [INFO] [DEBUG]   (f) nohelp = false
  1685. [INFO] [DEBUG]   (f) noindex = false
  1686. [INFO] [DEBUG]   (f) nonavbar = false
  1687. [INFO] [DEBUG]   (f) nooverview = false
  1688. [INFO] [DEBUG]   (f) nosince = false
  1689. [INFO] [DEBUG]   (f) notimestamp = false
  1690. [INFO] [DEBUG]   (f) notree = false
  1691. [INFO] [DEBUG]   (f) offlineLinks = []
  1692. [INFO] [DEBUG]   (f) old = false
  1693. [INFO] [DEBUG]   (f) outputDirectory = C:\openmrs-workspace\openmrs-module-commonlabtest\target\checkout\target\apidocs
  1694. [INFO] [DEBUG]   (f) overview = C:\openmrs-workspace\openmrs-module-commonlabtest\target\checkout\src\main\javadoc\overview.html
  1695. [INFO] [DEBUG]   (f) project = MavenProject: org.openmrs.module:commonlabtest:1.3.1 @ C:\openmrs-workspace\openmrs-module-commonlabtest\target\checkout\pom.xml
  1696. [INFO] [DEBUG]   (f) quiet = false
  1697. [INFO] [DEBUG]   (f) reactorProjects = [MavenProject: org.openmrs.module:commonlabtest:1.3.1 @ C:\openmrs-workspace\openmrs-module-commonlabtest\target\checkout\pom.xml, MavenProject: org.openmrs.module:commonlabtest-api:1.3.1 @ C:\openmrs-workspace\openmrs-module-commonlabtest\target\checkout\api\pom.xml, MavenProject: org.openmrs.module:commonlabtest-omod:1.3.1 @ C:\openmrs-workspace\openmrs-module-commonlabtest\target\checkout\omod\pom.xml]
  1698. [INFO] [DEBUG]   (f) remoteRepositories = [      id: openmrs-repo
  1699. [INFO]       url: http://mavenrepo.openmrs.org/nexus/content/repositories/public
  1700. [INFO]    layout: default
  1701. [INFO] snapshots: [enabled => true, update => daily]
  1702. [INFO]  releases: [enabled => true, update => daily]
  1703. [INFO] ,       id: openmrs-repo-thirdparty
  1704. [INFO]       url: http://mavenrepo.openmrs.org/nexus/content/repositories/thirdparty
  1705. [INFO]    layout: default
  1706. [INFO] snapshots: [enabled => true, update => daily]
  1707. [INFO]  releases: [enabled => true, update => daily]
  1708. [INFO] ,       id: openmrs-bintray-repo
  1709. [INFO]       url: https://dl.bintray.com/openmrs/maven/
  1710. [INFO]    layout: default
  1711. [INFO] snapshots: [enabled => true, update => daily]
  1712. [INFO]  releases: [enabled => true, update => daily]
  1713. [INFO] ,       id: central
  1714. [INFO]       url: http://repo1.maven.org/maven2
  1715. [INFO]    layout: default
  1716. [INFO] snapshots: [enabled => true, update => daily]
  1717. [INFO]  releases: [enabled => true, update => daily]
  1718. [INFO] ]
  1719. [INFO] [DEBUG]   (f) resourcesArtifacts = []
  1720. [INFO] [DEBUG]   (f) serialwarn = false
  1721. [INFO] [DEBUG]   (f) session = org.apache.maven.execution.MavenSession@155d1021
  1722. [INFO] [DEBUG]   (f) settings = org.apache.maven.execution.SettingsAdapter@68f6e55d
  1723. [INFO] [DEBUG]   (f) show = protected
  1724. [INFO] [DEBUG]   (f) skip = false
  1725. [INFO] [DEBUG]   (f) sourceDependencyCacheDir = C:\openmrs-workspace\openmrs-module-commonlabtest\target\checkout\target\distro-javadoc-sources
  1726. [INFO] [DEBUG]   (f) splitindex = false
  1727. [INFO] [DEBUG]   (f) stylesheet = java
  1728. [INFO] [DEBUG]   (f) tagletArtifact = groupId = 'null'
  1729. [INFO] artifactId = 'null'
  1730. [INFO] version = 'null'
  1731. [INFO] [DEBUG]   (f) tagletArtifacts = []
  1732. [INFO] [DEBUG]   (f) taglets = []
  1733. [INFO] [DEBUG]   (s) name = should
  1734. [INFO] [DEBUG]   (s) placement = a
  1735. [INFO] [DEBUG]   (s) head = Should:
  1736. [INFO] [DEBUG]   (f) tags = [name = 'should'
  1737. [INFO] head = 'Should:']
  1738. [INFO] [DEBUG]   (f) use = true
  1739. [INFO] [DEBUG]   (f) useDefaultManifestFile = false
  1740. [INFO] [DEBUG]   (f) useStandardDocletOptions = true
  1741. [INFO] [DEBUG]   (f) validateLinks = false
  1742. [INFO] [DEBUG]   (f) verbose = false
  1743. [INFO] [DEBUG]   (f) version = true
  1744. [INFO] [DEBUG]   (f) windowtitle = Common Lab Test 1.3.1 API
  1745. [INFO] [DEBUG] -- end configuration --
  1746. [INFO] [INFO] Not executing Javadoc as the project is not a Java classpath-capable package
  1747. [INFO] [INFO]
  1748. [INFO] [INFO] --- maven-install-plugin:2.4:install (default-install) @ commonlabtest ---
  1749. [INFO] [DEBUG] Dependency collection stats: {ConflictMarker.analyzeTime=0, ConflictMarker.markTime=0, ConflictMarker.nodeCount=38, ConflictIdSorter.graphTime=0, ConflictIdSorter.topsortTime=0, ConflictIdSorter.conflictIdCount=15, ConflictIdSorter.conflictIdCycleCount=0, ConflictResolver.totalTime=0, ConflictResolver.conflictItemCount=35, DefaultDependencyCollector.collectTime=18, DefaultDependencyCollector.transformTime=0}
  1750. [INFO] [DEBUG] org.apache.maven.plugins:maven-install-plugin:jar:2.4:
  1751. [INFO] [DEBUG]    org.apache.maven:maven-plugin-api:jar:2.0.6:compile
  1752. [INFO] [DEBUG]    org.apache.maven:maven-project:jar:2.0.6:compile
  1753. [INFO] [DEBUG]       org.apache.maven:maven-settings:jar:2.0.6:compile
  1754. [INFO] [DEBUG]       org.apache.maven:maven-profile:jar:2.0.6:compile
  1755. [INFO] [DEBUG]       org.apache.maven:maven-plugin-registry:jar:2.0.6:compile
  1756. [INFO] [DEBUG]       org.codehaus.plexus:plexus-container-default:jar:1.0-alpha-9-stable-1:compile
  1757. [INFO] [DEBUG]          junit:junit:jar:3.8.1:compile
  1758. [INFO] [DEBUG]          classworlds:classworlds:jar:1.1-alpha-2:compile
  1759. [INFO] [DEBUG]    org.apache.maven:maven-model:jar:2.0.6:compile
  1760. [INFO] [DEBUG]    org.apache.maven:maven-artifact-manager:jar:2.0.6:compile
  1761. [INFO] [DEBUG]       org.apache.maven:maven-repository-metadata:jar:2.0.6:compile
  1762. [INFO] [DEBUG]    org.apache.maven:maven-artifact:jar:2.0.6:compile
  1763. [INFO] [DEBUG]    org.codehaus.plexus:plexus-utils:jar:3.0.5:compile
  1764. [INFO] [DEBUG]    org.codehaus.plexus:plexus-digest:jar:1.0:compile
  1765. [INFO] [DEBUG] Created new class realm plugin>org.apache.maven.plugins:maven-install-plugin:2.4
  1766. [INFO] [DEBUG] Importing foreign packages into class realm plugin>org.apache.maven.plugins:maven-install-plugin:2.4
  1767. [INFO] [DEBUG]   Imported:  < maven.api
  1768. [INFO] [DEBUG] Populating class realm plugin>org.apache.maven.plugins:maven-install-plugin:2.4
  1769. [INFO] [DEBUG]   Included: org.apache.maven.plugins:maven-install-plugin:jar:2.4
  1770. [INFO] [DEBUG]   Included: junit:junit:jar:3.8.1
  1771. [INFO] [DEBUG]   Included: org.codehaus.plexus:plexus-utils:jar:3.0.5
  1772. [INFO] [DEBUG]   Included: org.codehaus.plexus:plexus-digest:jar:1.0
  1773. [INFO] [DEBUG] Configuring mojo org.apache.maven.plugins:maven-install-plugin:2.4:install from plugin realm ClassRealm[plugin>org.apache.maven.plugins:maven-install-plugin:2.4, parent: sun.misc.Launcher$AppClassLoader@55f96302]
  1774. [INFO] [DEBUG] Configuring mojo 'org.apache.maven.plugins:maven-install-plugin:2.4:install' with basic configurator -->
  1775. [INFO] [DEBUG]   (f) artifact = org.openmrs.module:commonlabtest:pom:1.3.1
  1776. [INFO] [DEBUG]   (f) attachedArtifacts = []
  1777. [INFO] [DEBUG]   (f) createChecksum = false
  1778. [INFO] [DEBUG]   (f) localRepository =       id: local
  1779. [INFO]       url: file:///C:/Users/owais/.m2/repository/
  1780. [INFO]    layout: default
  1781. [INFO] snapshots: [enabled => true, update => always]
  1782. [INFO]  releases: [enabled => true, update => always]
  1783. [INFO]
  1784. [INFO] [DEBUG]   (f) packaging = pom
  1785. [INFO] [DEBUG]   (f) pomFile = C:\openmrs-workspace\openmrs-module-commonlabtest\target\checkout\pom.xml
  1786. [INFO] [DEBUG]   (s) skip = false
  1787. [INFO] [DEBUG]   (f) updateReleaseInfo = false
  1788. [INFO] [DEBUG] -- end configuration --
  1789. [INFO] [INFO] Installing C:\openmrs-workspace\openmrs-module-commonlabtest\target\checkout\pom.xml to C:\Users\owais\.m2\repository\org\openmrs\module\commonlabtest\1.3.1\commonlabtest-1.3.1.pom
  1790. [INFO] [DEBUG] Writing tracking file C:\Users\owais\.m2\repository\org\openmrs\module\commonlabtest\1.3.1\_remote.repositories
  1791. [INFO] [DEBUG] Installing org.openmrs.module:commonlabtest/maven-metadata.xml to C:\Users\owais\.m2\repository\org\openmrs\module\commonlabtest\maven-metadata-local.xml
  1792. [INFO] [INFO]
  1793. [INFO] [INFO] --- maven-deploy-plugin:2.7:deploy (default-deploy) @ commonlabtest ---
  1794. [INFO] [DEBUG] Dependency collection stats: {ConflictMarker.analyzeTime=0, ConflictMarker.markTime=0, ConflictMarker.nodeCount=32, ConflictIdSorter.graphTime=0, ConflictIdSorter.topsortTime=0, ConflictIdSorter.conflictIdCount=14, ConflictIdSorter.conflictIdCycleCount=0, ConflictResolver.totalTime=1, ConflictResolver.conflictItemCount=32, DefaultDependencyCollector.collectTime=4, DefaultDependencyCollector.transformTime=1}
  1795. [INFO] [DEBUG] org.apache.maven.plugins:maven-deploy-plugin:jar:2.7:
  1796. [INFO] [DEBUG]    org.apache.maven:maven-plugin-api:jar:2.0.6:compile
  1797. [INFO] [DEBUG]    org.apache.maven:maven-project:jar:2.0.6:compile
  1798. [INFO] [DEBUG]       org.apache.maven:maven-settings:jar:2.0.6:compile
  1799. [INFO] [DEBUG]       org.apache.maven:maven-profile:jar:2.0.6:compile
  1800. [INFO] [DEBUG]       org.apache.maven:maven-artifact-manager:jar:2.0.6:compile
  1801. [INFO] [DEBUG]          org.apache.maven:maven-repository-metadata:jar:2.0.6:compile
  1802. [INFO] [DEBUG]       org.apache.maven:maven-plugin-registry:jar:2.0.6:compile
  1803. [INFO] [DEBUG]       org.codehaus.plexus:plexus-container-default:jar:1.0-alpha-9-stable-1:compile
  1804. [INFO] [DEBUG]          junit:junit:jar:3.8.1:compile
  1805. [INFO] [DEBUG]          classworlds:classworlds:jar:1.1-alpha-2:compile
  1806. [INFO] [DEBUG]    org.apache.maven:maven-model:jar:2.0.6:compile
  1807. [INFO] [DEBUG]    org.apache.maven:maven-artifact:jar:2.0.6:compile
  1808. [INFO] [DEBUG]    org.codehaus.plexus:plexus-utils:jar:1.5.6:compile
  1809. [INFO] [DEBUG] Created new class realm plugin>org.apache.maven.plugins:maven-deploy-plugin:2.7
  1810. [INFO] [DEBUG] Importing foreign packages into class realm plugin>org.apache.maven.plugins:maven-deploy-plugin:2.7
  1811. [INFO] [DEBUG]   Imported:  < maven.api
  1812. [INFO] [DEBUG] Populating class realm plugin>org.apache.maven.plugins:maven-deploy-plugin:2.7
  1813. [INFO] [DEBUG]   Included: org.apache.maven.plugins:maven-deploy-plugin:jar:2.7
  1814. [INFO] [DEBUG]   Included: junit:junit:jar:3.8.1
  1815. [INFO] [DEBUG]   Included: org.codehaus.plexus:plexus-utils:jar:1.5.6
  1816. [INFO] [DEBUG] Configuring mojo org.apache.maven.plugins:maven-deploy-plugin:2.7:deploy from plugin realm ClassRealm[plugin>org.apache.maven.plugins:maven-deploy-plugin:2.7, parent: sun.misc.Launcher$AppClassLoader@55f96302]
  1817. [INFO] [DEBUG] Configuring mojo 'org.apache.maven.plugins:maven-deploy-plugin:2.7:deploy' with basic configurator -->
  1818. [INFO] [DEBUG]   (f) artifact = org.openmrs.module:commonlabtest:pom:1.3.1
  1819. [INFO] [DEBUG]   (f) attachedArtifacts = []
  1820. [INFO] [DEBUG]   (s) localRepository =       id: local
  1821. [INFO]       url: file:///C:/Users/owais/.m2/repository/
  1822. [INFO]    layout: default
  1823. [INFO] snapshots: [enabled => true, update => always]
  1824. [INFO]  releases: [enabled => true, update => always]
  1825. [INFO]
  1826. [INFO] [DEBUG]   (f) offline = false
  1827. [INFO] [DEBUG]   (f) packaging = pom
  1828. [INFO] [DEBUG]   (f) pomFile = C:\openmrs-workspace\openmrs-module-commonlabtest\target\checkout\pom.xml
  1829. [INFO] [DEBUG]   (f) project = MavenProject: org.openmrs.module:commonlabtest:1.3.1 @ C:\openmrs-workspace\openmrs-module-commonlabtest\target\checkout\pom.xml
  1830. [INFO] [DEBUG]   (f) retryFailedDeploymentCount = 1
  1831. [INFO] [DEBUG]   (f) skip = false
  1832. [INFO] [DEBUG]   (f) updateReleaseInfo = false
  1833. [INFO] [DEBUG] -- end configuration --
  1834. [INFO] [DEBUG] Using transporter WagonTransporter with priority -1.0 for https://api.bintray.com/maven/seekme94/maven/openmrs-module-commonlabtest/;publish=1
  1835. [INFO] [DEBUG] Using connector BasicRepositoryConnector with priority 0.0 for https://api.bintray.com/maven/seekme94/maven/openmrs-module-commonlabtest/;publish=1 with username=seekme94, password=***
  1836. [INFO] Uploading: https://api.bintray.com/maven/seekme94/maven/openmrs-module-commonlabtest/;publish=1/org/openmrs/module/commonlabtest/1.3.1/commonlabtest-1.3.1.pom
  1837. [INFO] 2/3 KB
  1838. [INFO] 3/3 KB
  1839. [INFO]
  1840. [INFO] [INFO] ------------------------------------------------------------------------
  1841. [INFO] [INFO] Reactor Summary:
  1842. [INFO] [INFO]
  1843. [INFO] [INFO] Common Lab Test .................................... FAILURE [ 17.674 s]
  1844. [INFO] [INFO] Common Lab Test API ................................ SKIPPED
  1845. [INFO] [INFO] Common Lab Test OMOD ............................... SKIPPED
  1846. [INFO] [INFO] ------------------------------------------------------------------------
  1847. [INFO] [INFO] BUILD FAILURE
  1848. [INFO] [INFO] ------------------------------------------------------------------------
  1849. [INFO] [INFO] Total time: 18.472 s
  1850. [INFO] [INFO] Finished at: 2019-01-22T14:59:45+05:00
  1851. [INFO] [INFO] Final Memory: 30M/304M
  1852. [INFO] [INFO] ------------------------------------------------------------------------
  1853. [INFO] [WARNING] The requested profile "bintray" could not be activated because it does not exist.
  1854. [INFO] [ERROR] Failed to execute goal org.apache.maven.plugins:maven-deploy-plugin:2.7:deploy (default-deploy) on project commonlabtest: Failed to deploy artifacts: Could not find artifact org.openmrs.module:commonlabtest:pom:1.3.1 in bintray-seekme94-maven (https://api.bintray.com/maven/seekme94/maven/openmrs-module-commonlabtest/;publish=1) -> [Help 1]
  1855. [INFO] org.apache.maven.lifecycle.LifecycleExecutionException: Failed to execute goal org.apache.maven.plugins:maven-deploy-plugin:2.7:deploy (default-deploy) on project commonlabtest: Failed to deploy artifacts: Could not find artifact org.openmrs.module:commonlabtest:pom:1.3.1 in bintray-seekme94-maven (https://api.bintray.com/maven/seekme94/maven/openmrs-module-commonlabtest/;publish=1)
  1856. [INFO]  at org.apache.maven.lifecycle.internal.MojoExecutor.execute(MojoExecutor.java:216)
  1857. [INFO]  at org.apache.maven.lifecycle.internal.MojoExecutor.execute(MojoExecutor.java:153)
  1858. [INFO]  at org.apache.maven.lifecycle.internal.MojoExecutor.execute(MojoExecutor.java:145)
  1859. [INFO]  at org.apache.maven.lifecycle.internal.LifecycleModuleBuilder.buildProject(LifecycleModuleBuilder.java:116)
  1860. [INFO]  at org.apache.maven.lifecycle.internal.LifecycleModuleBuilder.buildProject(LifecycleModuleBuilder.java:80)
  1861. [INFO]  at org.apache.maven.lifecycle.internal.builder.singlethreaded.SingleThreadedBuilder.build(SingleThreadedBuilder.java:51)
  1862. [INFO]  at org.apache.maven.lifecycle.internal.LifecycleStarter.execute(LifecycleStarter.java:128)
  1863. [INFO]  at org.apache.maven.DefaultMaven.doExecute(DefaultMaven.java:307)
  1864. [INFO]  at org.apache.maven.DefaultMaven.doExecute(DefaultMaven.java:193)
  1865. [INFO]  at org.apache.maven.DefaultMaven.execute(DefaultMaven.java:106)
  1866. [INFO]  at org.apache.maven.cli.MavenCli.execute(MavenCli.java:862)
  1867. [INFO]  at org.apache.maven.cli.MavenCli.doMain(MavenCli.java:286)
  1868. [INFO]  at org.apache.maven.cli.MavenCli.main(MavenCli.java:197)
  1869. [INFO]  at sun.reflect.NativeMethodAccessorImpl.invoke0(Native Method)
  1870. [INFO]  at sun.reflect.NativeMethodAccessorImpl.invoke(NativeMethodAccessorImpl.java:62)
  1871. [INFO]  at sun.reflect.DelegatingMethodAccessorImpl.invoke(DelegatingMethodAccessorImpl.java:43)
  1872. [INFO]  at java.lang.reflect.Method.invoke(Method.java:498)
  1873. [INFO]  at org.codehaus.plexus.classworlds.launcher.Launcher.launchEnhanced(Launcher.java:289)
  1874. [INFO]  at org.codehaus.plexus.classworlds.launcher.Launcher.launch(Launcher.java:229)
  1875. [INFO]  at org.codehaus.plexus.classworlds.launcher.Launcher.mainWithExitCode(Launcher.java:415)
  1876. [INFO]  at org.codehaus.plexus.classworlds.launcher.Launcher.main(Launcher.java:356)
  1877. [INFO] Caused by: org.apache.maven.plugin.MojoExecutionException: Failed to deploy artifacts: Could not find artifact org.openmrs.module:commonlabtest:pom:1.3.1 in bintray-seekme94-maven (https://api.bintray.com/maven/seekme94/maven/openmrs-module-commonlabtest/;publish=1)
  1878. [INFO]  at org.apache.maven.plugin.deploy.DeployMojo.execute(DeployMojo.java:193)
  1879. [INFO]  at org.apache.maven.plugin.DefaultBuildPluginManager.executeMojo(DefaultBuildPluginManager.java:134)
  1880. [INFO]  at org.apache.maven.lifecycle.internal.MojoExecutor.execute(MojoExecutor.java:208)
  1881. [INFO]  ... 20 more
  1882. [INFO] Caused by: org.apache.maven.artifact.deployer.ArtifactDeploymentException: Failed to deploy artifacts: Could not find artifact org.openmrs.module:commonlabtest:pom:1.3.1 in bintray-seekme94-maven (https://api.bintray.com/maven/seekme94/maven/openmrs-module-commonlabtest/;publish=1)
  1883. [INFO]  at org.apache.maven.artifact.deployer.DefaultArtifactDeployer.deploy(DefaultArtifactDeployer.java:143)
  1884. [INFO]  at org.apache.maven.plugin.deploy.AbstractDeployMojo.deploy(AbstractDeployMojo.java:167)
  1885. [INFO]  at org.apache.maven.plugin.deploy.DeployMojo.execute(DeployMojo.java:149)
  1886. [INFO]  ... 22 more
  1887. [INFO] Caused by: org.eclipse.aether.deployment.DeploymentException: Failed to deploy artifacts: Could not find artifact org.openmrs.module:commonlabtest:pom:1.3.1 in bintray-seekme94-maven (https://api.bintray.com/maven/seekme94/maven/openmrs-module-commonlabtest/;publish=1)
  1888. [INFO]  at org.eclipse.aether.internal.impl.DefaultDeployer.deploy(DefaultDeployer.java:317)
  1889. [INFO]  at org.eclipse.aether.internal.impl.DefaultDeployer.deploy(DefaultDeployer.java:245)
  1890. [INFO]  at org.eclipse.aether.internal.impl.DefaultRepositorySystem.deploy(DefaultRepositorySystem.java:413)
  1891. [INFO]  at org.apache.maven.artifact.deployer.DefaultArtifactDeployer.deploy(DefaultArtifactDeployer.java:139)
  1892. [INFO]  ... 24 more
  1893. [INFO] Caused by: org.eclipse.aether.transfer.ArtifactNotFoundException: Could not find artifact org.openmrs.module:commonlabtest:pom:1.3.1 in bintray-seekme94-maven (https://api.bintray.com/maven/seekme94/maven/openmrs-module-commonlabtest/;publish=1)
  1894. [INFO]  at org.eclipse.aether.connector.basic.ArtifactTransportListener.transferFailed(ArtifactTransportListener.java:39)
  1895. [INFO]  at org.eclipse.aether.connector.basic.BasicRepositoryConnector$TaskRunner.run(BasicRepositoryConnector.java:355)
  1896. [INFO]  at org.eclipse.aether.connector.basic.BasicRepositoryConnector.put(BasicRepositoryConnector.java:274)
  1897. [INFO]  at org.eclipse.aether.internal.impl.DefaultDeployer.deploy(DefaultDeployer.java:311)
  1898. [INFO]  ... 27 more
  1899. [INFO] [ERROR]
  1900. [INFO] [ERROR]
  1901. [INFO] [ERROR] For more information about the errors and possible solutions, please read the following articles:
  1902. [INFO] [ERROR] [Help 1] http://cwiki.apache.org/confluence/display/MAVEN/MojoExecutionException
  1903. [INFO] ------------------------------------------------------------------------
  1904. [INFO] Reactor Summary:
  1905. [INFO]
  1906. [INFO] Common Lab Test .................................... FAILURE [ 36.145 s]
  1907. [INFO] Common Lab Test API ................................ SKIPPED
  1908. [INFO] Common Lab Test OMOD ............................... SKIPPED
  1909. [INFO] ------------------------------------------------------------------------
  1910. [INFO] BUILD FAILURE
  1911. [INFO] ------------------------------------------------------------------------
  1912. [INFO] Total time: 38.741 s
  1913. [INFO] Finished at: 2019-01-22T14:59:46+05:00
  1914. [INFO] Final Memory: 14M/155M
  1915. [INFO] ------------------------------------------------------------------------
  1916. [WARNING] The requested profile "bintray" could not be activated because it does not exist.
  1917. [ERROR] Failed to execute goal org.apache.maven.plugins:maven-release-plugin:2.5.3:perform (default-cli) on project commonlabtest: Maven execution failed, exit code: '1' -> [Help 1]
  1918. org.apache.maven.lifecycle.LifecycleExecutionException: Failed to execute goal org.apache.maven.plugins:maven-release-plugin:2.5.3:perform (default-cli) on project commonlabtest: Maven execution failed, exit code: '1'
  1919.         at org.apache.maven.lifecycle.internal.MojoExecutor.execute(MojoExecutor.java:216)
  1920.         at org.apache.maven.lifecycle.internal.MojoExecutor.execute(MojoExecutor.java:153)
  1921.         at org.apache.maven.lifecycle.internal.MojoExecutor.execute(MojoExecutor.java:145)
  1922.         at org.apache.maven.lifecycle.internal.LifecycleModuleBuilder.buildProject(LifecycleModuleBuilder.java:116)
  1923.         at org.apache.maven.lifecycle.internal.LifecycleModuleBuilder.buildProject(LifecycleModuleBuilder.java:80)
  1924.         at org.apache.maven.lifecycle.internal.builder.singlethreaded.SingleThreadedBuilder.build(SingleThreadedBuilder.java:51)
  1925.         at org.apache.maven.lifecycle.internal.LifecycleStarter.execute(LifecycleStarter.java:128)
  1926.         at org.apache.maven.DefaultMaven.doExecute(DefaultMaven.java:307)
  1927.         at org.apache.maven.DefaultMaven.doExecute(DefaultMaven.java:193)
  1928.         at org.apache.maven.DefaultMaven.execute(DefaultMaven.java:106)
  1929.         at org.apache.maven.cli.MavenCli.execute(MavenCli.java:862)
  1930.         at org.apache.maven.cli.MavenCli.doMain(MavenCli.java:286)
  1931.         at org.apache.maven.cli.MavenCli.main(MavenCli.java:197)
  1932.         at sun.reflect.NativeMethodAccessorImpl.invoke0(Native Method)
  1933.         at sun.reflect.NativeMethodAccessorImpl.invoke(NativeMethodAccessorImpl.java:62)
  1934.         at sun.reflect.DelegatingMethodAccessorImpl.invoke(DelegatingMethodAccessorImpl.java:43)
  1935.         at java.lang.reflect.Method.invoke(Method.java:498)
  1936.         at org.codehaus.plexus.classworlds.launcher.Launcher.launchEnhanced(Launcher.java:289)
  1937.         at org.codehaus.plexus.classworlds.launcher.Launcher.launch(Launcher.java:229)
  1938.         at org.codehaus.plexus.classworlds.launcher.Launcher.mainWithExitCode(Launcher.java:415)
  1939.         at org.codehaus.plexus.classworlds.launcher.Launcher.main(Launcher.java:356)
  1940. Caused by: org.apache.maven.plugin.MojoExecutionException: Maven execution failed, exit code: '1'
  1941.         at org.apache.maven.plugins.release.PerformReleaseMojo.execute(PerformReleaseMojo.java:204)
  1942.         at org.apache.maven.plugin.DefaultBuildPluginManager.executeMojo(DefaultBuildPluginManager.java:134)
  1943.         at org.apache.maven.lifecycle.internal.MojoExecutor.execute(MojoExecutor.java:208)
  1944.         ... 20 more
  1945. Caused by: org.apache.maven.shared.release.ReleaseExecutionException: Maven execution failed, exit code: '1'
  1946.         at org.apache.maven.shared.release.phase.AbstractRunGoalsPhase.execute(AbstractRunGoalsPhase.java:91)
  1947.         at org.apache.maven.shared.release.phase.RunPerformGoalsPhase.runLogic(RunPerformGoalsPhase.java:135)
  1948.         at org.apache.maven.shared.release.phase.RunPerformGoalsPhase.execute(RunPerformGoalsPhase.java:46)
  1949.         at org.apache.maven.shared.release.DefaultReleaseManager.perform(DefaultReleaseManager.java:429)
  1950.         at org.apache.maven.shared.release.DefaultReleaseManager.perform(DefaultReleaseManager.java:381)
  1951.         at org.apache.maven.plugins.release.PerformReleaseMojo.execute(PerformReleaseMojo.java:200)
  1952.         ... 22 more
  1953. Caused by: org.apache.maven.shared.release.exec.MavenExecutorException: Maven execution failed, exit code: '1'
  1954.         at org.apache.maven.shared.release.exec.InvokerMavenExecutor.executeGoals(InvokerMavenExecutor.java:433)
  1955.         at org.apache.maven.shared.release.exec.AbstractMavenExecutor.executeGoals(AbstractMavenExecutor.java:114)
  1956.         at org.apache.maven.shared.release.phase.AbstractRunGoalsPhase.execute(AbstractRunGoalsPhase.java:85)
  1957.         ... 27 more
  1958. [ERROR]
  1959. [ERROR]
  1960. [ERROR] For more information about the errors and possible solutions, please read the following articles:
  1961. [ERROR] [Help 1] http://cwiki.apache.org/confluence/display/MAVEN/MojoExecutionException
RAW Paste Data