SHARE
TWEET

Untitled

a guest Jul 17th, 2017 44 Never
Not a member of Pastebin yet? Sign Up, it unlocks many cool features!
  1. /var/lib/dkms/openswan/2.6.26+dfsg/build/modobj26/pfkey_v2.c:723: error: âstruct socketâ has no member named âfasync_listâ
  2. /var/lib/dkms/openswan/2.6.26+dfsg/build/modobj26/pfkey_v2.c:723: error: âstruct sockâ has no member named âsk_sleepâ
  3. /var/lib/dkms/openswan/2.6.26+dfsg/build/modobj26/pfkey_v2.c: In function âpfkey_get_infoâ:
  4. /var/lib/dkms/openswan/2.6.26+dfsg/build/modobj26/pfkey_v2.c:1160: error: âstruct sockâ has no member named âsk_sleepâ
  5. make[2]: *** [/var/lib/dkms/openswan/2.6.26+dfsg/build/modobj26/pfkey_v2.o] Error 1
  6. make[1]: *** [_module_/var/lib/dkms/openswan/2.6.26+dfsg/build/modobj26] Error 2
RAW Paste Data
Top