Guest User

Untitled

a guest
Nov 14th, 2020
32
0
Never
Not a member of Pastebin yet? Sign Up, it unlocks many cool features!
text 9.66 KB | None | 0 0
  1. npm run prod
  2.  
  3. > @ prod /home/stepan7/projects/laravel/kazak
  4. > npm run production
  5.  
  6.  
  7. > @ production /home/stepan7/projects/laravel/kazak
  8. > cross-env NODE_ENV=production node_modules/webpack/bin/webpack.js --no-progress --hide-modules --config=node_modules/laravel-mix/setup/webpack.config.js
  9.  
  10.  
  11.  
  12. ERROR Failed to compile with 2 errors 22:19:17
  13.  
  14. error in ./resources/sass/media.scss
  15.  
  16. Module build failed (from ./node_modules/css-loader/index.js):
  17. ModuleBuildError: Module build failed (from ./node_modules/sass-loader/dist/cjs.js):
  18. SassError: Expected string.
  19. ╷
  20. 62 │ @import("base_adaptive.scss")
  21. │ ^
  22. ╵
  23. /home/stepan7/projects/laravel/kazak/resources/sass/media.scss 62:10 root stylesheet
  24. at runLoaders (/home/stepan7/projects/laravel/kazak/node_modules/webpack/lib/NormalModule.js:316:20)
  25. at /home/stepan7/projects/laravel/kazak/node_modules/loader-runner/lib/LoaderRunner.js:367:11
  26. at /home/stepan7/projects/laravel/kazak/node_modules/loader-runner/lib/LoaderRunner.js:233:18
  27. at context.callback (/home/stepan7/projects/laravel/kazak/node_modules/loader-runner/lib/LoaderRunner.js:111:13)
  28. at render (/home/stepan7/projects/laravel/kazak/node_modules/sass-loader/dist/index.js:73:7)
  29. at Function.call$2 (/home/stepan7/projects/laravel/kazak/node_modules/sass/sass.dart.js:90243:16)
  30. at _render_closure1.call$2 (/home/stepan7/projects/laravel/kazak/node_modules/sass/sass.dart.js:79388:12)
  31. at _RootZone.runBinary$3$3 (/home/stepan7/projects/laravel/kazak/node_modules/sass/sass.dart.js:27016:18)
  32. at _FutureListener.handleError$1 (/home/stepan7/projects/laravel/kazak/node_modules/sass/sass.dart.js:25544:19)
  33. at _Future__propagateToListeners_handleError.call$0 (/home/stepan7/projects/laravel/kazak/node_modules/sass/sass.dart.js:25841:49)
  34. at Object._Future__propagateToListeners (/home/stepan7/projects/laravel/kazak/node_modules/sass/sass.dart.js:4539:77)
  35. at _Future._completeError$2 (/home/stepan7/projects/laravel/kazak/node_modules/sass/sass.dart.js:25674:9)
  36. at _AsyncAwaitCompleter.completeError$2 (/home/stepan7/projects/laravel/kazak/node_modules/sass/sass.dart.js:25017:12)
  37. at Object._asyncRethrow (/home/stepan7/projects/laravel/kazak/node_modules/sass/sass.dart.js:4288:17)
  38. at /home/stepan7/projects/laravel/kazak/node_modules/sass/sass.dart.js:13156:20
  39. at _wrapJsFunctionForAsync_closure.$protected (/home/stepan7/projects/laravel/kazak/node_modules/sass/sass.dart.js:4313:15)
  40. at _wrapJsFunctionForAsync_closure.call$2 (/home/stepan7/projects/laravel/kazak/node_modules/sass/sass.dart.js:25038:12)
  41. at _awaitOnObject_closure0.call$2 (/home/stepan7/projects/laravel/kazak/node_modules/sass/sass.dart.js:25030:25)
  42. at _RootZone.runBinary$3$3 (/home/stepan7/projects/laravel/kazak/node_modules/sass/sass.dart.js:27016:18)
  43. at _FutureListener.handleError$1 (/home/stepan7/projects/laravel/kazak/node_modules/sass/sass.dart.js:25544:19)
  44. at _Future__propagateToListeners_handleError.call$0 (/home/stepan7/projects/laravel/kazak/node_modules/sass/sass.dart.js:25841:49)
  45. at Object._Future__propagateToListeners (/home/stepan7/projects/laravel/kazak/node_modules/sass/sass.dart.js:4539:77)
  46. at _Future._completeError$2 (/home/stepan7/projects/laravel/kazak/node_modules/sass/sass.dart.js:25674:9)
  47. at _Future__asyncCompleteError_closure.call$0 (/home/stepan7/projects/laravel/kazak/node_modules/sass/sass.dart.js:25763:18)
  48. at Object._microtaskLoop (/home/stepan7/projects/laravel/kazak/node_modules/sass/sass.dart.js:4590:24)
  49. at StaticClosure._startMicrotaskLoop (/home/stepan7/projects/laravel/kazak/node_modules/sass/sass.dart.js:4596:11)
  50. at _AsyncRun__scheduleImmediateJsOverride_internalCallback.call$0 (/home/stepan7/projects/laravel/kazak/node_modules/sass/sass.dart.js:24928:21)
  51. at invokeClosure (/home/stepan7/projects/laravel/kazak/node_modules/sass/sass.dart.js:1397:26)
  52. at Immediate.<anonymous> (/home/stepan7/projects/laravel/kazak/node_modules/sass/sass.dart.js:1418:18)
  53. at runCallback (timers.js:705:18)
  54. at tryOnImmediate (timers.js:676:5)
  55. at processImmediate (timers.js:658:5)
  56.  
  57. error in ./resources/sass/media.scss
  58.  
  59. Module build failed (from ./node_modules/sass-loader/dist/cjs.js):
  60. SassError: Expected string.
  61. ╷
  62. 62 │ @import("base_adaptive.scss")
  63. │ ^
  64. ╵
  65. /home/stepan7/projects/laravel/kazak/resources/sass/media.scss 62:10 root stylesheet
  66.  
  67. @ ./resources/sass/media.scss 2:14-198
  68.  
  69. 5 assets
  70.  
  71. ERROR in ./resources/sass/media.scss
  72. Module build failed (from ./node_modules/css-loader/index.js):
  73. ModuleBuildError: Module build failed (from ./node_modules/sass-loader/dist/cjs.js):
  74. SassError: Expected string.
  75. ╷
  76. 62 │ @import("base_adaptive.scss")
  77. │ ^
  78. ╵
  79. /home/stepan7/projects/laravel/kazak/resources/sass/media.scss 62:10 root stylesheet
  80. at runLoaders (/home/stepan7/projects/laravel/kazak/node_modules/webpack/lib/NormalModule.js:316:20)
  81. at /home/stepan7/projects/laravel/kazak/node_modules/loader-runner/lib/LoaderRunner.js:367:11
  82. at /home/stepan7/projects/laravel/kazak/node_modules/loader-runner/lib/LoaderRunner.js:233:18
  83. at context.callback (/home/stepan7/projects/laravel/kazak/node_modules/loader-runner/lib/LoaderRunner.js:111:13)
  84. at render (/home/stepan7/projects/laravel/kazak/node_modules/sass-loader/dist/index.js:73:7)
  85. at Function.call$2 (/home/stepan7/projects/laravel/kazak/node_modules/sass/sass.dart.js:90243:16)
  86. at _render_closure1.call$2 (/home/stepan7/projects/laravel/kazak/node_modules/sass/sass.dart.js:79388:12)
  87. at _RootZone.runBinary$3$3 (/home/stepan7/projects/laravel/kazak/node_modules/sass/sass.dart.js:27016:18)
  88. at _FutureListener.handleError$1 (/home/stepan7/projects/laravel/kazak/node_modules/sass/sass.dart.js:25544:19)
  89. at _Future__propagateToListeners_handleError.call$0 (/home/stepan7/projects/laravel/kazak/node_modules/sass/sass.dart.js:25841:49)
  90. at Object._Future__propagateToListeners (/home/stepan7/projects/laravel/kazak/node_modules/sass/sass.dart.js:4539:77)
  91. at _Future._completeError$2 (/home/stepan7/projects/laravel/kazak/node_modules/sass/sass.dart.js:25674:9)
  92. at _AsyncAwaitCompleter.completeError$2 (/home/stepan7/projects/laravel/kazak/node_modules/sass/sass.dart.js:25017:12)
  93. at Object._asyncRethrow (/home/stepan7/projects/laravel/kazak/node_modules/sass/sass.dart.js:4288:17)
  94. at /home/stepan7/projects/laravel/kazak/node_modules/sass/sass.dart.js:13156:20
  95. at _wrapJsFunctionForAsync_closure.$protected (/home/stepan7/projects/laravel/kazak/node_modules/sass/sass.dart.js:4313:15)
  96. at _wrapJsFunctionForAsync_closure.call$2 (/home/stepan7/projects/laravel/kazak/node_modules/sass/sass.dart.js:25038:12)
  97. at _awaitOnObject_closure0.call$2 (/home/stepan7/projects/laravel/kazak/node_modules/sass/sass.dart.js:25030:25)
  98. at _RootZone.runBinary$3$3 (/home/stepan7/projects/laravel/kazak/node_modules/sass/sass.dart.js:27016:18)
  99. at _FutureListener.handleError$1 (/home/stepan7/projects/laravel/kazak/node_modules/sass/sass.dart.js:25544:19)
  100. at _Future__propagateToListeners_handleError.call$0 (/home/stepan7/projects/laravel/kazak/node_modules/sass/sass.dart.js:25841:49)
  101. at Object._Future__propagateToListeners (/home/stepan7/projects/laravel/kazak/node_modules/sass/sass.dart.js:4539:77)
  102. at _Future._completeError$2 (/home/stepan7/projects/laravel/kazak/node_modules/sass/sass.dart.js:25674:9)
  103. at _Future__asyncCompleteError_closure.call$0 (/home/stepan7/projects/laravel/kazak/node_modules/sass/sass.dart.js:25763:18)
  104. at Object._microtaskLoop (/home/stepan7/projects/laravel/kazak/node_modules/sass/sass.dart.js:4590:24)
  105. at StaticClosure._startMicrotaskLoop (/home/stepan7/projects/laravel/kazak/node_modules/sass/sass.dart.js:4596:11)
  106. at _AsyncRun__scheduleImmediateJsOverride_internalCallback.call$0 (/home/stepan7/projects/laravel/kazak/node_modules/sass/sass.dart.js:24928:21)
  107. at invokeClosure (/home/stepan7/projects/laravel/kazak/node_modules/sass/sass.dart.js:1397:26)
  108. at Immediate.<anonymous> (/home/stepan7/projects/laravel/kazak/node_modules/sass/sass.dart.js:1418:18)
  109. at runCallback (timers.js:705:18)
  110. at tryOnImmediate (timers.js:676:5)
  111. at processImmediate (timers.js:658:5)
  112. @ ./resources/sass/media.scss
  113.  
  114. ERROR in ./resources/sass/media.scss (./node_modules/css-loader??ref--6-2!./node_modules/postcss-loader/src??postcss1!./node_modules/sass-loader/dist/cjs.js??ref--6-4!./resources/sass/media.scss)
  115. Module build failed (from ./node_modules/sass-loader/dist/cjs.js):
  116. SassError: Expected string.
  117. ╷
  118. 62 │ @import("base_adaptive.scss")
  119. │ ^
  120. ╵
  121. /home/stepan7/projects/laravel/kazak/resources/sass/media.scss 62:10 root stylesheet
  122. @ ./resources/sass/media.scss 2:14-198
  123. npm ERR! code ELIFECYCLE
  124. npm ERR! errno 2
  125. npm ERR! @ production: `cross-env NODE_ENV=production node_modules/webpack/bin/webpack.js --no-progress --hide-modules --config=node_modules/laravel-mix/setup/webpack.config.js`
  126. npm ERR! Exit status 2
  127. npm ERR!
  128. npm ERR! Failed at the @ production script.
  129. npm ERR! This is probably not a problem with npm. There is likely additional logging output above.
  130.  
  131. npm ERR! A complete log of this run can be found in:
  132. npm ERR! /home/stepan7/.npm/_logs/2020-11-14T19_19_18_251Z-debug.log
  133. npm ERR! code ELIFECYCLE
  134. npm ERR! errno 2
  135. npm ERR! @ prod: `npm run production`
  136. npm ERR! Exit status 2
  137. npm ERR!
  138. npm ERR! Failed at the @ prod script.
  139. npm ERR! This is probably not a problem with npm. There is likely additional logging output above.
  140.  
  141. npm ERR! A complete log of this run can be found in:
  142. npm ERR! /home/stepan7/.npm/_logs/2020-11-14T19_19_18_375Z-debug.log
  143.  
Advertisement
Add Comment
Please, Sign In to add comment