daily pastebin goal
11%
SHARE
TWEET

Untitled

a guest Aug 29th, 2015 10 Never
Not a member of Pastebin yet? Sign Up, it unlocks many cool features!
  1. mon/files.cpp -o Build/openjkded.i386/qcommon/files.o
  2. In file included from qcommon/files.cpp:40:
  3. ../lib/minizip/unzip.h:54:18: error: zlib.h: No such file or directory
  4. In file included from ../lib/minizip/unzip.h:57,
  5.                  from qcommon/files.cpp:40:
  6. ../lib/minizip/ioapi.h:38: error: ISO C++ forbids declaration of 'voidpf' with no type
  7. ../lib/minizip/ioapi.h:38: error: typedef 'voidpf' is initialized (use __typeof__ instead)
  8. ../lib/minizip/ioapi.h:38: error: 'open_file_func' was not declared in this scope
  9. ../lib/minizip/ioapi.h:39: error: ISO C++ forbids declaration of 'uLong' with no type
  10. ../lib/minizip/ioapi.h:39: error: typedef 'uLong' is initialized (use __typeof__ instead)
  11. ../lib/minizip/ioapi.h:39: error: 'read_file_func' was not declared in this scope
  12. ../lib/minizip/ioapi.h:40: error: ISO C++ forbids declaration of 'uLong' with no type
  13. ../lib/minizip/ioapi.h:40: error: typedef 'uLong' is initialized (use __typeof__ instead)
  14. ../lib/minizip/ioapi.h:40: error: 'write_file_func' was not declared in this scope
  15. ../lib/minizip/ioapi.h:41: error: expected initializer before 'OF'
  16. ../lib/minizip/ioapi.h:42: error: expected initializer before 'OF'
  17. ../lib/minizip/ioapi.h:43: error: expected initializer before 'OF'
  18. ../lib/minizip/ioapi.h:44: error: expected initializer before 'OF'
  19. ../lib/minizip/ioapi.h:48: error: 'open_file_func' does not name a type
  20. ../lib/minizip/ioapi.h:49: error: 'read_file_func' does not name a type
  21. ../lib/minizip/ioapi.h:50: error: 'write_file_func' does not name a type
  22. ../lib/minizip/ioapi.h:51: error: 'tell_file_func' does not name a type
  23. ../lib/minizip/ioapi.h:52: error: 'seek_file_func' does not name a type
  24. ../lib/minizip/ioapi.h:53: error: 'close_file_func' does not name a type
  25. ../lib/minizip/ioapi.h:54: error: 'testerror_file_func' does not name a type
  26. ../lib/minizip/ioapi.h:55: error: 'voidpf' does not name a type
  27. ../lib/minizip/ioapi.h:60: error: expected initializer before 'OF'
  28. In file included from qcommon/files.cpp:40:
  29. ../lib/minizip/unzip.h:67: error: 'voidp' does not name a type
  30. ../lib/minizip/unzip.h:83: error: 'uInt' does not name a type
  31. ../lib/minizip/unzip.h:84: error: 'uInt' does not name a type
  32. ../lib/minizip/unzip.h:85: error: 'uInt' does not name a type
  33. ../lib/minizip/unzip.h:86: error: 'uInt' does not name a type
  34. ../lib/minizip/unzip.h:87: error: 'uInt' does not name a type
  35. ../lib/minizip/unzip.h:88: error: 'uInt' does not name a type
  36. ../lib/minizip/unzip.h:95: error: 'uLong' does not name a type
  37. ../lib/minizip/unzip.h:97: error: 'uLong' does not name a type
  38. ../lib/minizip/unzip.h:104: error: 'uLong' does not name a type
  39. ../lib/minizip/unzip.h:105: error: 'uLong' does not name a type
  40. ../lib/minizip/unzip.h:106: error: 'uLong' does not name a type
  41. ../lib/minizip/unzip.h:107: error: 'uLong' does not name a type
  42. ../lib/minizip/unzip.h:108: error: 'uLong' does not name a type
  43. ../lib/minizip/unzip.h:109: error: 'uLong' does not name a type
  44. ../lib/minizip/unzip.h:110: error: 'uLong' does not name a type
  45. ../lib/minizip/unzip.h:111: error: 'uLong' does not name a type
  46. ../lib/minizip/unzip.h:112: error: 'uLong' does not name a type
  47. ../lib/minizip/unzip.h:113: error: 'uLong' does not name a type
  48. ../lib/minizip/unzip.h:114: error: 'uLong' does not name a type
  49. ../lib/minizip/unzip.h:116: error: 'uLong' does not name a type
  50. ../lib/minizip/unzip.h:117: error: 'uLong' does not name a type
  51. ../lib/minizip/unzip.h:118: error: 'uLong' does not name a type
  52. ../lib/minizip/unzip.h:126: error: 'uLong' does not name a type
  53. ../lib/minizip/unzip.h:135: error: 'z_stream' does not name a type
  54. ../lib/minizip/unzip.h:137: error: 'uLong' does not name a type
  55. ../lib/minizip/unzip.h:138: error: 'uLong' does not name a type
  56. ../lib/minizip/unzip.h:140: error: 'uLong' does not name a type
  57. ../lib/minizip/unzip.h:141: error: 'uInt' does not name a type
  58. ../lib/minizip/unzip.h:142: error: 'uLong' does not name a type
  59. ../lib/minizip/unzip.h:144: error: 'uLong' does not name a type
  60. ../lib/minizip/unzip.h:145: error: 'uLong' does not name a type
  61. ../lib/minizip/unzip.h:146: error: 'uLong' does not name a type
  62. ../lib/minizip/unzip.h:147: error: 'uLong' does not name a type
  63. ../lib/minizip/unzip.h:149: error: 'voidpf' does not name a type
  64. ../lib/minizip/unzip.h:150: error: 'uLong' does not name a type
  65. ../lib/minizip/unzip.h:151: error: 'uLong' does not name a type
  66. ../lib/minizip/unzip.h:161: error: 'voidpf' does not name a type
  67. ../lib/minizip/unzip.h:163: error: 'uLong' does not name a type
  68. ../lib/minizip/unzip.h:164: error: 'uLong' does not name a type
  69. ../lib/minizip/unzip.h:165: error: 'uLong' does not name a type
  70. ../lib/minizip/unzip.h:166: error: 'uLong' does not name a type
  71. ../lib/minizip/unzip.h:167: error: 'uLong' does not name a type
  72. ../lib/minizip/unzip.h:169: error: 'uLong' does not name a type
  73. ../lib/minizip/unzip.h:170: error: 'uLong' does not name a type
  74. ../lib/minizip/unzip.h:189: error: expected initializer before 'unzStringFileNameCompare'
  75. ../lib/minizip/unzip.h:202: error: 'unzFile' does not name a type
  76. ../lib/minizip/unzip.h:213: error: 'unzFile' does not name a type
  77. ../lib/minizip/unzip.h:220: error: expected initializer before 'unzClose'
  78. ../lib/minizip/unzip.h:227: error: expected initializer before 'unzGetGlobalInfo'
  79. ../lib/minizip/unzip.h:235: error: expected initializer before 'unzGetGlobalComment'
  80. ../lib/minizip/unzip.h:248: error: expected initializer before 'unzGoToFirstFile'
  81. ../lib/minizip/unzip.h:254: error: expected initializer before 'unzGoToNextFile'
  82. ../lib/minizip/unzip.h:261: error: expected initializer before 'unzLocateFile'
  83. ../lib/minizip/unzip.h:279: error: 'uLong' does not name a type
  84. ../lib/minizip/unzip.h:280: error: 'uLong' does not name a type
  85. ../lib/minizip/unzip.h:283: error: expected initializer before 'unzGetFilePos'
  86. ../lib/minizip/unzip.h:287: error: expected initializer before 'unzGoToFilePos'
  87. ../lib/minizip/unzip.h:293: error: expected initializer before 'unzGetCurrentFileInfo'
  88. ../lib/minizip/unzip.h:319: error: expected initializer before 'unzOpenCurrentFile'
  89. ../lib/minizip/unzip.h:325: error: expected initializer before 'unzOpenCurrentFilePassword'
  90. ../lib/minizip/unzip.h:333: error: expected initializer before 'unzOpenCurrentFile2'
  91. ../lib/minizip/unzip.h:346: error: expected initializer before 'unzOpenCurrentFile3'
  92. ../lib/minizip/unzip.h:361: error: expected initializer before 'unzCloseCurrentFile'
  93. ../lib/minizip/unzip.h:367: error: expected initializer before 'unzReadCurrentFile'
  94. ../lib/minizip/unzip.h:381: error: 'z_off_t' does not name a type
  95. ../lib/minizip/unzip.h:386: error: expected initializer before 'unzeof'
  96. ../lib/minizip/unzip.h:391: error: expected initializer before 'unzGetLocalExtrafield'
  97. ../lib/minizip/unzip.h:410: error: 'uLong' does not name a type
  98. ../lib/minizip/unzip.h:413: error: expected initializer before 'unzSetOffset'
  99. qcommon/files.cpp:208: error: 'unzFile' does not name a type
  100. qcommon/files.cpp:257: error: 'unzFile' does not name a type
  101. qcommon/files.cpp: In function 'void FS_FCloseFile(fileHandle_t)':
  102. qcommon/files.cpp:1005: error: 'union qfile_gut' has no member named 'z'
  103. qcommon/files.cpp:1005: error: 'unzCloseCurrentFile' was not declared in this scope
  104. qcommon/files.cpp:1007: error: 'union qfile_gut' has no member named 'z'
  105. qcommon/files.cpp:1007: error: 'unzClose' was not declared in this scope
  106. qcommon/files.cpp: In function 'long int FS_FOpenFileRead(const char*, fileHandle_t*, qboolean)':
  107. qcommon/files.cpp:1410: error: 'union qfile_gut' has no member named 'z'
  108. qcommon/files.cpp:1410: error: 'unzOpen' was not declared in this scope
  109. qcommon/files.cpp:1411: error: 'union qfile_gut' has no member named 'z'
  110. qcommon/files.cpp:1415: error: 'union qfile_gut' has no member named 'z'
  111. qcommon/files.cpp:1415: error: 'struct pack_s' has no member named 'handle'
  112. qcommon/files.cpp:1421: error: 'union qfile_gut' has no member named 'z'
  113. qcommon/files.cpp:1421: error: 'unzSetOffset' was not declared in this scope
  114. qcommon/files.cpp:1424: error: 'union qfile_gut' has no member named 'z'
  115. qcommon/files.cpp:1424: error: 'unzOpenCurrentFile' was not declared in this scope
  116. qcommon/files.cpp: In function 'int FS_Read(void*, int, fileHandle_t)':
  117. qcommon/files.cpp:1671: error: 'union qfile_gut' has no member named 'z'
  118. qcommon/files.cpp:1671: error: 'unzReadCurrentFile' was not declared in this scope
  119. qcommon/files.cpp: In function 'int FS_Seek(fileHandle_t, long int, int)':
  120. qcommon/files.cpp:1796: error: 'union qfile_gut' has no member named 'z'
  121. qcommon/files.cpp:1796: error: 'unzSetOffset' was not declared in this scope
  122. qcommon/files.cpp:1797: error: 'union qfile_gut' has no member named 'z'
  123. qcommon/files.cpp:1797: error: 'unzOpenCurrentFile' was not declared in this scope
  124. qcommon/files.cpp: In function 'pack_t* FS_LoadZipFile(const char*, const char*)':
  125. qcommon/files.cpp:2109: error: 'unzFile' was not declared in this scope
  126. qcommon/files.cpp:2109: error: expected `;' before 'uf'
  127. qcommon/files.cpp:2123: error: 'uf' was not declared in this scope
  128. qcommon/files.cpp:2123: error: 'unzOpen' was not declared in this scope
  129. qcommon/files.cpp:2124: error: 'unzGetGlobalInfo' was not declared in this scope
  130. qcommon/files.cpp:2130: error: 'unzGoToFirstFile' was not declared in this scope
  131. qcommon/files.cpp:2131: error: 'struct unz_global_info' has no member named 'number_entry'
  132. qcommon/files.cpp:2133: error: 'unzGetCurrentFileInfo' was not declared in this scope
  133. qcommon/files.cpp:2138: error: 'unzGoToNextFile' was not declared in this scope
  134. qcommon/files.cpp:2141: error: 'struct unz_global_info' has no member named 'number_entry'
  135. qcommon/files.cpp:2142: error: 'struct unz_global_info' has no member named 'number_entry'
  136. qcommon/files.cpp:2143: error: 'struct unz_global_info' has no member named 'number_entry'
  137. qcommon/files.cpp:2149: error: 'struct unz_global_info' has no member named 'number_entry'
  138. qcommon/files.cpp:2169: error: 'struct pack_s' has no member named 'handle'
  139. qcommon/files.cpp:2170: error: 'struct unz_global_info' has no member named 'number_entry'
  140. qcommon/files.cpp:2173: error: 'struct unz_global_info' has no member named 'number_entry'
  141. qcommon/files.cpp:2175: error: 'unzGetCurrentFileInfo' was not declared in this scope
  142. qcommon/files.cpp:2179: error: 'struct unz_file_info' has no member named 'uncompressed_size'
  143. qcommon/files.cpp:2180: error: 'struct unz_file_info' has no member named 'crc'
  144. qcommon/files.cpp:2188: error: 'unzGetOffset' was not declared in this scope
  145. qcommon/files.cpp:2189: error: 'struct unz_file_info' has no member named 'uncompressed_size'
  146. qcommon/files.cpp:2192: error: 'unzGoToNextFile' was not declared in this scope
  147. qcommon/files.cpp: In function 'void FS_FreePak(pack_t*)':
  148. qcommon/files.cpp:2216: error: 'struct pack_s' has no member named 'handle'
  149. qcommon/files.cpp:2216: error: 'unzClose' was not declared in this scope
  150. qcommon/files.cpp: In function 'int FS_FTell(fileHandle_t)':
  151. qcommon/files.cpp:3991: error: 'union qfile_gut' has no member named 'z'
  152. qcommon/files.cpp:3991: error: 'unztell' was not declared in this scope
  153. make: *** [Build/openjkded.i386/qcommon/files.o] Error 1
RAW Paste Data
We use cookies for various purposes including analytics. By continuing to use Pastebin, you agree to our use of cookies as described in the Cookies Policy. OK, I Understand
 
Top