Guest User

Untitled

a guest
Jan 8th, 2024
153
0
Never
Not a member of Pastebin yet? Sign Up, it unlocks many cool features!
Bash 17.24 KB | None | 0 0
  1. ==> CMakeFiles/CMakeError.log <==
  2. Determining if the function memset_s exists failed with the following output:
  3. Change Dir: /root/ceph/ceph-18.2.1/obj-x86_64-linux-gnu/CMakeFiles/CMakeScratch/TryCompile-aaqt5o
  4.  
  5. Run Build Command(s):/usr/bin/gmake -f Makefile cmTC_695aa/fast && gmake[3]: Entering directory '/root/ceph/ceph-18.2.1/obj-x86_64-linux-gnu/CMakeFiles/CMakeScratch/TryCompile-aaqt5o'
  6. /usr/bin/gmake  -f CMakeFiles/cmTC_695aa.dir/build.make CMakeFiles/cmTC_695aa.dir/build
  7. gmake[4]: Entering directory '/root/ceph/ceph-18.2.1/obj-x86_64-linux-gnu/CMakeFiles/CMakeScratch/TryCompile-aaqt5o'
  8. Building C object CMakeFiles/cmTC_695aa.dir/CheckFunctionExists.c.o
  9. /usr/bin/cc   -g -O2 -ffile-prefix-map=/root/ceph/ceph-18.2.1=. -fstack-protector-strong -Wformat -Werror=format-security -O1 -Wdate-time -D_FORTIFY_SOURCE=2 -DCHECK_FUNCTION_EXISTS=memset_s -o CMakeFiles/cmTC_695aa.dir/CheckFunctionExists.c.o -c /root/ceph/ceph-18.2.1/obj-x86_64-linux-gnu/CMakeFiles/CMakeScratch/TryCompile-aaqt5o/CheckFunctionExists.c
  10. Linking C executable cmTC_695aa
  11. /usr/bin/cmake -E cmake_link_script CMakeFiles/cmTC_695aa.dir/link.txt --verbose=1
  12. /usr/bin/cc -g -O2 -ffile-prefix-map=/root/ceph/ceph-18.2.1=. -fstack-protector-strong -Wformat -Werror=format-security -O1 -Wdate-time -D_FORTIFY_SOURCE=2 -DCHECK_FUNCTION_EXISTS=memset_s -Wl,-z,relro  CMakeFiles/cmTC_695aa.dir/CheckFunctionExists.c.o -o cmTC_695aa
  13. /usr/bin/ld: CMakeFiles/cmTC_695aa.dir/CheckFunctionExists.c.o: in function `main':
  14. ./obj-x86_64-linux-gnu/CMakeFiles/CMakeScratch/TryCompile-aaqt5o/./obj-x86_64-linux-gnu/CMakeFiles/CMakeScratch/TryCompile-aaqt5o/CheckFunctionExists.c:17: undefined reference to `memset_s'
  15. collect2: error: ld returned 1 exit status
  16. gmake[4]: *** [CMakeFiles/cmTC_695aa.dir/build.make:99: cmTC_695aa] Error 1
  17. gmake[4]: Leaving directory '/root/ceph/ceph-18.2.1/obj-x86_64-linux-gnu/CMakeFiles/CMakeScratch/TryCompile-aaqt5o'
  18. gmake[3]: *** [Makefile:127: cmTC_695aa/fast] Error 2
  19. gmake[3]: Leaving directory '/root/ceph/ceph-18.2.1/obj-x86_64-linux-gnu/CMakeFiles/CMakeScratch/TryCompile-aaqt5o'
  20.  
  21.  
  22.  
  23. Determining if the function pthread_set_name_np exists failed with the following output:
  24. Change Dir: /root/ceph/ceph-18.2.1/obj-x86_64-linux-gnu/CMakeFiles/CMakeScratch/TryCompile-6gGFP7
  25.  
  26. Run Build Command(s):/usr/bin/gmake -f Makefile cmTC_71add/fast && gmake[3]: Entering directory '/root/ceph/ceph-18.2.1/obj-x86_64-linux-gnu/CMakeFiles/CMakeScratch/TryCompile-6gGFP7'
  27. /usr/bin/gmake  -f CMakeFiles/cmTC_71add.dir/build.make CMakeFiles/cmTC_71add.dir/build
  28. gmake[4]: Entering directory '/root/ceph/ceph-18.2.1/obj-x86_64-linux-gnu/CMakeFiles/CMakeScratch/TryCompile-6gGFP7'
  29. Building C object CMakeFiles/cmTC_71add.dir/CheckFunctionExists.c.o
  30. /usr/bin/cc   -g -O2 -ffile-prefix-map=/root/ceph/ceph-18.2.1=. -fstack-protector-strong -Wformat -Werror=format-security -O1 -Wdate-time -D_FORTIFY_SOURCE=2 -DCHECK_FUNCTION_EXISTS=pthread_set_name_np -o CMakeFiles/cmTC_71add.dir/CheckFunctionExists.c.o -c /root/ceph/ceph-18.2.1/obj-x86_64-linux-gnu/CMakeFiles/CMakeScratch/TryCompile-6gGFP7/CheckFunctionExists.c
  31. Linking C executable cmTC_71add
  32. /usr/bin/cmake -E cmake_link_script CMakeFiles/cmTC_71add.dir/link.txt --verbose=1
  33. /usr/bin/cc -g -O2 -ffile-prefix-map=/root/ceph/ceph-18.2.1=. -fstack-protector-strong -Wformat -Werror=format-security -O1 -Wdate-time -D_FORTIFY_SOURCE=2 -DCHECK_FUNCTION_EXISTS=pthread_set_name_np -Wl,-z,relro  CMakeFiles/cmTC_71add.dir/CheckFunctionExists.c.o -o cmTC_71add  -lpthread
  34. /usr/bin/ld: CMakeFiles/cmTC_71add.dir/CheckFunctionExists.c.o: in function `main':
  35. ./obj-x86_64-linux-gnu/CMakeFiles/CMakeScratch/TryCompile-6gGFP7/./obj-x86_64-linux-gnu/CMakeFiles/CMakeScratch/TryCompile-6gGFP7/CheckFunctionExists.c:17: undefined reference to `pthread_set_name_np'
  36. collect2: error: ld returned 1 exit status
  37. gmake[4]: *** [CMakeFiles/cmTC_71add.dir/build.make:99: cmTC_71add] Error 1
  38. gmake[4]: Leaving directory '/root/ceph/ceph-18.2.1/obj-x86_64-linux-gnu/CMakeFiles/CMakeScratch/TryCompile-6gGFP7'
  39. gmake[3]: *** [Makefile:127: cmTC_71add/fast] Error 2
  40. gmake[3]: Leaving directory '/root/ceph/ceph-18.2.1/obj-x86_64-linux-gnu/CMakeFiles/CMakeScratch/TryCompile-6gGFP7'
  41.  
  42.  
  43.  
  44. Determining if the function pthread_get_name_np exists failed with the following output:
  45. Change Dir: /root/ceph/ceph-18.2.1/obj-x86_64-linux-gnu/CMakeFiles/CMakeScratch/TryCompile-b2sA6L
  46.  
  47. Run Build Command(s):/usr/bin/gmake -f Makefile cmTC_9466c/fast && gmake[3]: Entering directory '/root/ceph/ceph-18.2.1/obj-x86_64-linux-gnu/CMakeFiles/CMakeScratch/TryCompile-b2sA6L'
  48. /usr/bin/gmake  -f CMakeFiles/cmTC_9466c.dir/build.make CMakeFiles/cmTC_9466c.dir/build
  49. gmake[4]: Entering directory '/root/ceph/ceph-18.2.1/obj-x86_64-linux-gnu/CMakeFiles/CMakeScratch/TryCompile-b2sA6L'
  50. Building C object CMakeFiles/cmTC_9466c.dir/CheckFunctionExists.c.o
  51. /usr/bin/cc   -g -O2 -ffile-prefix-map=/root/ceph/ceph-18.2.1=. -fstack-protector-strong -Wformat -Werror=format-security -O1 -Wdate-time -D_FORTIFY_SOURCE=2 -DCHECK_FUNCTION_EXISTS=pthread_get_name_np -o CMakeFiles/cmTC_9466c.dir/CheckFunctionExists.c.o -c /root/ceph/ceph-18.2.1/obj-x86_64-linux-gnu/CMakeFiles/CMakeScratch/TryCompile-b2sA6L/CheckFunctionExists.c
  52. Linking C executable cmTC_9466c
  53. /usr/bin/cmake -E cmake_link_script CMakeFiles/cmTC_9466c.dir/link.txt --verbose=1
  54. /usr/bin/cc -g -O2 -ffile-prefix-map=/root/ceph/ceph-18.2.1=. -fstack-protector-strong -Wformat -Werror=format-security -O1 -Wdate-time -D_FORTIFY_SOURCE=2 -DCHECK_FUNCTION_EXISTS=pthread_get_name_np -Wl,-z,relro  CMakeFiles/cmTC_9466c.dir/CheckFunctionExists.c.o -o cmTC_9466c  -lpthread
  55. /usr/bin/ld: CMakeFiles/cmTC_9466c.dir/CheckFunctionExists.c.o: in function `main':
  56. ./obj-x86_64-linux-gnu/CMakeFiles/CMakeScratch/TryCompile-b2sA6L/./obj-x86_64-linux-gnu/CMakeFiles/CMakeScratch/TryCompile-b2sA6L/CheckFunctionExists.c:17: undefined reference to `pthread_get_name_np'
  57. collect2: error: ld returned 1 exit status
  58. gmake[4]: *** [CMakeFiles/cmTC_9466c.dir/build.make:99: cmTC_9466c] Error 1
  59. gmake[4]: Leaving directory '/root/ceph/ceph-18.2.1/obj-x86_64-linux-gnu/CMakeFiles/CMakeScratch/TryCompile-b2sA6L'
  60. gmake[3]: *** [Makefile:127: cmTC_9466c/fast] Error 2
  61. gmake[3]: Leaving directory '/root/ceph/ceph-18.2.1/obj-x86_64-linux-gnu/CMakeFiles/CMakeScratch/TryCompile-b2sA6L'
  62.  
  63.  
  64.  
  65. Determining if the function getprogname exists failed with the following output:
  66. Change Dir: /root/ceph/ceph-18.2.1/obj-x86_64-linux-gnu/CMakeFiles/CMakeScratch/TryCompile-pJAk3p
  67.  
  68. Run Build Command(s):/usr/bin/gmake -f Makefile cmTC_2f940/fast && gmake[3]: Entering directory '/root/ceph/ceph-18.2.1/obj-x86_64-linux-gnu/CMakeFiles/CMakeScratch/TryCompile-pJAk3p'
  69. /usr/bin/gmake  -f CMakeFiles/cmTC_2f940.dir/build.make CMakeFiles/cmTC_2f940.dir/build
  70. gmake[4]: Entering directory '/root/ceph/ceph-18.2.1/obj-x86_64-linux-gnu/CMakeFiles/CMakeScratch/TryCompile-pJAk3p'
  71. Building C object CMakeFiles/cmTC_2f940.dir/CheckFunctionExists.c.o
  72. /usr/bin/cc   -g -O2 -ffile-prefix-map=/root/ceph/ceph-18.2.1=. -fstack-protector-strong -Wformat -Werror=format-security -O1 -Wdate-time -D_FORTIFY_SOURCE=2 -DCHECK_FUNCTION_EXISTS=getprogname -o CMakeFiles/cmTC_2f940.dir/CheckFunctionExists.c.o -c /root/ceph/ceph-18.2.1/obj-x86_64-linux-gnu/CMakeFiles/CMakeScratch/TryCompile-pJAk3p/CheckFunctionExists.c
  73. Linking C executable cmTC_2f940
  74. /usr/bin/cmake -E cmake_link_script CMakeFiles/cmTC_2f940.dir/link.txt --verbose=1
  75. /usr/bin/cc -g -O2 -ffile-prefix-map=/root/ceph/ceph-18.2.1=. -fstack-protector-strong -Wformat -Werror=format-security -O1 -Wdate-time -D_FORTIFY_SOURCE=2 -DCHECK_FUNCTION_EXISTS=getprogname -Wl,-z,relro  CMakeFiles/cmTC_2f940.dir/CheckFunctionExists.c.o -o cmTC_2f940
  76. /usr/bin/ld: CMakeFiles/cmTC_2f940.dir/CheckFunctionExists.c.o: in function `main':
  77. ./obj-x86_64-linux-gnu/CMakeFiles/CMakeScratch/TryCompile-pJAk3p/./obj-x86_64-linux-gnu/CMakeFiles/CMakeScratch/TryCompile-pJAk3p/CheckFunctionExists.c:17: undefined reference to `getprogname'
  78. collect2: error: ld returned 1 exit status
  79. gmake[4]: *** [CMakeFiles/cmTC_2f940.dir/build.make:99: cmTC_2f940] Error 1
  80. gmake[4]: Leaving directory '/root/ceph/ceph-18.2.1/obj-x86_64-linux-gnu/CMakeFiles/CMakeScratch/TryCompile-pJAk3p'
  81. gmake[3]: *** [Makefile:127: cmTC_2f940/fast] Error 2
  82. gmake[3]: Leaving directory '/root/ceph/ceph-18.2.1/obj-x86_64-linux-gnu/CMakeFiles/CMakeScratch/TryCompile-pJAk3p'
  83.  
  84.  
  85.  
  86. Performing C SOURCE FILE Test HAVE_STAT_ST_MTIMESPEC_TV_NSEC failed with the following output:
  87. Change Dir: /root/ceph/ceph-18.2.1/obj-x86_64-linux-gnu/CMakeFiles/CMakeScratch/TryCompile-P1L6PR
  88.  
  89. Run Build Command(s):/usr/bin/gmake -f Makefile cmTC_a83ac/fast && gmake[3]: Entering directory '/root/ceph/ceph-18.2.1/obj-x86_64-linux-gnu/CMakeFiles/CMakeScratch/TryCompile-P1L6PR'
  90. /usr/bin/gmake  -f CMakeFiles/cmTC_a83ac.dir/build.make CMakeFiles/cmTC_a83ac.dir/build
  91. gmake[4]: Entering directory '/root/ceph/ceph-18.2.1/obj-x86_64-linux-gnu/CMakeFiles/CMakeScratch/TryCompile-P1L6PR'
  92. Building C object CMakeFiles/cmTC_a83ac.dir/src.c.o
  93. /usr/bin/cc -DHAVE_STAT_ST_MTIMESPEC_TV_NSEC  -g -O2 -ffile-prefix-map=/root/ceph/ceph-18.2.1=. -fstack-protector-strong -Wformat -Werror=format-security -O1 -Wdate-time -D_FORTIFY_SOURCE=2  -o CMakeFiles/cmTC_a83ac.dir/src.c.o -c /root/ceph/ceph-18.2.1/obj-x86_64-linux-gnu/CMakeFiles/CMakeScratch/TryCompile-P1L6PR/src.c
  94. /root/ceph/ceph-18.2.1/obj-x86_64-linux-gnu/CMakeFiles/CMakeScratch/TryCompile-P1L6PR/src.c: In function ‘main’:
  95. /root/ceph/ceph-18.2.1/obj-x86_64-linux-gnu/CMakeFiles/CMakeScratch/TryCompile-P1L6PR/src.c:6:34: error: ‘struct stat’ has no member named ‘st_mtimespec’
  96.     6 |   (void)sizeof(((struct stat *)0)->st_mtimespec.tv_nsec);
  97.       |                                  ^~
  98. gmake[4]: *** [CMakeFiles/cmTC_a83ac.dir/build.make:78: CMakeFiles/cmTC_a83ac.dir/src.c.o] Error 1
  99. gmake[4]: Leaving directory '/root/ceph/ceph-18.2.1/obj-x86_64-linux-gnu/CMakeFiles/CMakeScratch/TryCompile-P1L6PR'
  100. gmake[3]: *** [Makefile:127: cmTC_a83ac/fast] Error 2
  101. gmake[3]: Leaving directory '/root/ceph/ceph-18.2.1/obj-x86_64-linux-gnu/CMakeFiles/CMakeScratch/TryCompile-P1L6PR'
  102.  
  103.  
  104. Source file was:
  105.  
  106. #include <sys/stat.h>
  107.  
  108. int main()
  109. {
  110.   (void)sizeof(((struct stat *)0)->st_mtimespec.tv_nsec);
  111.   return 0;
  112. }
  113.  
  114.  
  115. Performing C++ SOURCE FILE Test HAVE_CXX11_ATOMIC failed with the following output:
  116. Change Dir: /root/ceph/ceph-18.2.1/obj-x86_64-linux-gnu/CMakeFiles/CMakeScratch/TryCompile-HEfdF8
  117.  
  118. Run Build Command(s):/usr/bin/gmake -f Makefile cmTC_f51b7/fast && gmake[3]: Entering directory '/root/ceph/ceph-18.2.1/obj-x86_64-linux-gnu/CMakeFiles/CMakeScratch/TryCompile-HEfdF8'
  119. /usr/bin/gmake  -f CMakeFiles/cmTC_f51b7.dir/build.make CMakeFiles/cmTC_f51b7.dir/build
  120. gmake[4]: Entering directory '/root/ceph/ceph-18.2.1/obj-x86_64-linux-gnu/CMakeFiles/CMakeScratch/TryCompile-HEfdF8'
  121. Building CXX object CMakeFiles/cmTC_f51b7.dir/src.cxx.o
  122. /usr/bin/c++ -DHAVE_CXX11_ATOMIC  -g -O2 -ffile-prefix-map=/root/ceph/ceph-18.2.1=. -fstack-protector-strong -Wformat -Werror=format-security -O1 -Wdate-time -D_FORTIFY_SOURCE=2  -std=c++11 -fPIE -o CMakeFiles/cmTC_f51b7.dir/src.cxx.o -c /root/ceph/ceph-18.2.1/obj-x86_64-linux-gnu/CMakeFiles/CMakeScratch/TryCompile-HEfdF8/src.cxx
  123. Linking CXX executable cmTC_f51b7
  124. /usr/bin/cmake -E cmake_link_script CMakeFiles/cmTC_f51b7.dir/link.txt --verbose=1
  125. /usr/bin/c++ -g -O2 -ffile-prefix-map=/root/ceph/ceph-18.2.1=. -fstack-protector-strong -Wformat -Werror=format-security -O1 -Wdate-time -D_FORTIFY_SOURCE=2  -std=c++11 -Wl,-z,relro  CMakeFiles/cmTC_f51b7.dir/src.cxx.o -o cmTC_f51b7
  126. /usr/bin/ld: CMakeFiles/cmTC_f51b7.dir/src.cxx.o: in function `std::atomic<tagged_ptr>::store(tagged_ptr, std::memory_order)':
  127. /usr/include/c++/12/atomic:271: undefined reference to `__atomic_store_16'
  128. /usr/bin/ld: CMakeFiles/cmTC_f51b7.dir/src.cxx.o: in function `std::atomic<tagged_ptr>::load(std::memory_order) const':
  129. /usr/include/c++/12/atomic:285: undefined reference to `__atomic_load_16'
  130. /usr/bin/ld: CMakeFiles/cmTC_f51b7.dir/src.cxx.o: in function `std::atomic<tagged_ptr>::compare_exchange_strong(tagged_ptr&, tagged_ptr, std::memory_order, std::memory_order)':
  131. /usr/include/c++/12/atomic:361: undefined reference to `__atomic_compare_exchange_16'
  132. collect2: error: ld returned 1 exit status
  133. gmake[4]: *** [CMakeFiles/cmTC_f51b7.dir/build.make:99: cmTC_f51b7] Error 1
  134. gmake[4]: Leaving directory '/root/ceph/ceph-18.2.1/obj-x86_64-linux-gnu/CMakeFiles/CMakeScratch/TryCompile-HEfdF8'
  135. gmake[3]: *** [Makefile:127: cmTC_f51b7/fast] Error 2
  136. gmake[3]: Leaving directory '/root/ceph/ceph-18.2.1/obj-x86_64-linux-gnu/CMakeFiles/CMakeScratch/TryCompile-HEfdF8'
  137.  
  138.  
  139. Source file was:
  140.  
  141. #include <atomic>
  142. #include <cstdint>
  143. #include <cstddef>
  144.  
  145. #if defined(__SIZEOF_INT128__)
  146. // Boost needs 16-byte atomics for tagged pointers.
  147. // These are implemented via inline instructions on the platform
  148. // if 16-byte alignment can be proven, and are delegated to libatomic
  149. // library routines otherwise.  Whether or not alignment is provably
  150. // OK for a std::atomic unfortunately depends on compiler version and
  151. // optimization levels, and also on the details of the expression.
  152. // We specifically test access via an otherwise unknown pointer here
  153. // to ensure we get the most complex case.  If this access can be
  154. // done without libatomic, then all accesses can be done.
  155. struct tagged_ptr {
  156.   int* ptr;
  157.   std::size_t tag;
  158. };
  159.  
  160. void atomic16(std::atomic<tagged_ptr> *ptr) __attribute__ ((used));
  161. void atomic16(std::atomic<tagged_ptr> *ptr)
  162. {
  163.   tagged_ptr p{nullptr, 1};
  164.   ptr->store(p);
  165.   tagged_ptr f = ptr->load();
  166.   tagged_ptr new_tag{nullptr, 0};
  167.   ptr->compare_exchange_strong(f, new_tag);
  168. }
  169. #endif
  170.  
  171. int main() {
  172. #if defined(__SIZEOF_INT128__)
  173.   std::atomic<tagged_ptr> ptr;
  174.   atomic16(&ptr);
  175. #endif
  176.   std::atomic<uint8_t> w1;
  177.   std::atomic<uint16_t> w2;
  178.   std::atomic<uint32_t> w4;
  179.   std::atomic<uint64_t> w8;
  180.   return w1 + w2 + w4 + w8;
  181. }
  182.  
  183.  
  184. Performing C++ SOURCE FILE Test HAVE_IBV_EXP failed with the following output:
  185. Change Dir: /root/ceph/ceph-18.2.1/obj-x86_64-linux-gnu/CMakeFiles/CMakeScratch/TryCompile-YzVoTy
  186.  
  187. Run Build Command(s):/usr/bin/gmake -f Makefile cmTC_785fd/fast && gmake[3]: Entering directory '/root/ceph/ceph-18.2.1/obj-x86_64-linux-gnu/CMakeFiles/CMakeScratch/TryCompile-YzVoTy'
  188. /usr/bin/gmake  -f CMakeFiles/cmTC_785fd.dir/build.make CMakeFiles/cmTC_785fd.dir/build
  189. gmake[4]: Entering directory '/root/ceph/ceph-18.2.1/obj-x86_64-linux-gnu/CMakeFiles/CMakeScratch/TryCompile-YzVoTy'
  190. Building CXX object CMakeFiles/cmTC_785fd.dir/src.cxx.o
  191. /usr/bin/c++ -DHAVE_IBV_EXP  -g -O2 -ffile-prefix-map=/root/ceph/ceph-18.2.1=. -fstack-protector-strong -Wformat -Werror=format-security -O1 -Wdate-time -D_FORTIFY_SOURCE=2  -fPIE -o CMakeFiles/cmTC_785fd.dir/src.cxx.o -c /root/ceph/ceph-18.2.1/obj-x86_64-linux-gnu/CMakeFiles/CMakeScratch/TryCompile-YzVoTy/src.cxx
  192. /root/ceph/ceph-18.2.1/obj-x86_64-linux-gnu/CMakeFiles/CMakeScratch/TryCompile-YzVoTy/src.cxx: In function ‘int main()’:
  193. /root/ceph/ceph-18.2.1/obj-x86_64-linux-gnu/CMakeFiles/CMakeScratch/TryCompile-YzVoTy/src.cxx:5:31: error: aggregate ‘main()::ibv_exp_gid_attr gid_attr’ has incomplete type and cannot be defined
  194.     5 |       struct ibv_exp_gid_attr gid_attr;
  195.       |                               ^~~~~~~~
  196. /root/ceph/ceph-18.2.1/obj-x86_64-linux-gnu/CMakeFiles/CMakeScratch/TryCompile-YzVoTy/src.cxx:6:7: error: ‘ibv_exp_query_gid_attr’ was not declared in this scope; did you mean ‘ibv_exp_gid_attr’?
  197.     6 |       ibv_exp_query_gid_attr(ctxt, 1, 0, &gid_attr);
  198.       |       ^~~~~~~~~~~~~~~~~~~~~~
  199.       |       ibv_exp_gid_attr
  200. gmake[4]: *** [CMakeFiles/cmTC_785fd.dir/build.make:78: CMakeFiles/cmTC_785fd.dir/src.cxx.o] Error 1
  201. gmake[4]: Leaving directory '/root/ceph/ceph-18.2.1/obj-x86_64-linux-gnu/CMakeFiles/CMakeScratch/TryCompile-YzVoTy'
  202. gmake[3]: *** [Makefile:127: cmTC_785fd/fast] Error 2
  203. gmake[3]: Leaving directory '/root/ceph/ceph-18.2.1/obj-x86_64-linux-gnu/CMakeFiles/CMakeScratch/TryCompile-YzVoTy'
  204.  
  205.  
  206. Source file was:
  207.  
  208.     #include <infiniband/verbs.h>
  209.     int main() {
  210.       struct ibv_context* ctxt;
  211.       struct ibv_exp_gid_attr gid_attr;
  212.       ibv_exp_query_gid_attr(ctxt, 1, 0, &gid_attr);
  213.       return 0;
  214.     }
  215.  
  216. dh_auto_configure: error: cd obj-x86_64-linux-gnu && cmake -DCMAKE_INSTALL_PREFIX=/usr -DCMAKE_BUILD_TYPE=None -DCMAKE_INSTALL_SYSCONFDIR=/etc -DCMAKE_INSTALL_LOCALSTATEDIR=/var -DCMAKE_EXPORT_NO_PACKAGE_REGISTRY=ON -DCMAKE_FIND_USE_PACKAGE_REGISTRY=OFF -DCMAKE_FIND_PACKAGE_NO_PACKAGE_REGISTRY=ON -DFETCHCONTENT_FULLY_DISCONNECTED=ON -DCMAKE_INSTALL_RUNSTATEDIR=/run "-GUnix Makefiles" -DCMAKE_VERBOSE_MAKEFILE=ON -DCMAKE_INSTALL_LIBDIR=lib/x86_64-linux-gnu -DWITH_JAEGER=ON -DWITH_SYSTEM_UTF8PROC=ON -DWITH_OCF=ON -DWITH_LTTNG=ON -DWITH_MGR_DASHBOARD_FRONTEND=OFF -DWITH_PYTHON3=3 -DWITH_CEPHFS_JAVA=ON -DWITH_CEPHFS_SHELL=ON -DWITH_SYSTEMD=ON -DCEPH_SYSTEMD_ENV_DIR=/etc/default -DWITH_GRAFANA=ON -DWITH_RBD_RWL=ON -DWITH_RBD_SSD_CACHE=ON -DCMAKE_INSTALL_LIBDIR=/usr/lib -DCMAKE_INSTALL_LIBEXECDIR=/usr/libexec -DCMAKE_INSTALL_SYSCONFDIR=/etc -DBOOST_J=8 .. returned exit code 1
  217. make[2]: *** [debian/rules:66: override_dh_auto_configure] Error 255
  218. make[2]: Leaving directory '/root/ceph/ceph-18.2.1'
  219. make[1]: *** [debian/rules:62: build] Error 2
  220. make[1]: Leaving directory '/root/ceph/ceph-18.2.1'
  221. dpkg-buildpackage: error: debian/rules build subprocess returned exit status 2
  222. make: *** [Makefile:93: ceph_18.2.1-pve1_amd64.deb] Error 2
  223. root@proxmox2:~/ceph#
  224.  
Advertisement
Add Comment
Please, Sign In to add comment