daily pastebin goal
37%
SHARE
TWEET

Untitled

a guest Jan 27th, 2019 12 Never
Not a member of Pastebin yet? Sign Up, it unlocks many cool features!
  1.     :: Checking for conflicts...
  2. :: Checking for inner conflicts...
  3. [Aur: 1]  python-tornado-4.4-4.4.3-1
  4.  
  5.   1 python-tornado-4.4                       (Build Files Exist)
  6. ==> Packages to cleanBuild?
  7. ==> [N]one [A]ll [Ab]ort [I]nstalled [No]tInstalled or (1 2 3, 1-3, ^4)
  8. ==> :: Deleting (1/1): /home/mgr/.cache/yay/python-tornado-4.4
  9. :: Downloaded PKGBUILD (1/1): python-tornado-4.4
  10.   1 python-tornado-4.4                       (Build Files Exist)
  11. ==> [N]one [A]ll [Ab]ort [I]nstalled [No]tInstalled or (1 2 3, 1-3, ^4)
  12. ==> Diffs to show?
  13. ==> :: Parsing SRCINFO (1/1): python-tornado-4.4
  14. ==> Making package: python-tornado-4.4 4.4.3-1 (Sun Jan 27 19:53:01 2019)
  15. ==> Retrieving sources...
  16.   -> Downloading python-tornado-4.4-4.4.3.tar.gz...
  17.   % Total    % Received % Xferd  Average Speed   Time    Time     Time  Current
  18.                                  Dload  Upload   Total   Spent    Left  Speed
  19.  
  20.   0     0    0     0    0     0      0      0 --:--:-- --:--:-- --:--:--     0
  21.   0     0    0     0    0     0      0      0 --:--:-- --:--:-- --:--:--     0
  22. 100   126    0   126    0     0    258      0 --:--:-- --:--:-- --:--:--   258
  23.  
  24. 100 13270    0 13270    0     0   9234      0 --:--:--  0:00:01 --:--:--  9234
  25. 100  473k    0  473k    0     0   221k      0 --:--:--  0:00:02 --:--:--  655k
  26.   -> Found 0001-use_system_ca_certificates.patch
  27. ==> Validating source files with sha512sums...
  28.     python-tornado-4.4-4.4.3.tar.gz ... Passed
  29.     0001-use_system_ca_certificates.patch ... Passed
  30. ==> Cleaning up...
  31. ==> Making package: python-tornado-4.4 4.4.3-1 (Sun Jan 27 19:53:04 2019)
  32. ==> Checking runtime dependencies...
  33. ==> Checking buildtime dependencies...
  34. ==> Retrieving sources...
  35.   -> Found python-tornado-4.4-4.4.3.tar.gz
  36.   -> Found 0001-use_system_ca_certificates.patch
  37. ==> Validating source files with sha512sums...
  38.     python-tornado-4.4-4.4.3.tar.gz ... Passed
  39.     0001-use_system_ca_certificates.patch ... Passed
  40. ==> Removing existing $srcdir/ directory...
  41. ==> Extracting sources...
  42.   -> Extracting python-tornado-4.4-4.4.3.tar.gz with bsdtar
  43. ==> Starting prepare()...
  44. patching file setup.py
  45. patch unexpectedly ends in middle of line
  46. Hunk #1 succeeded at 136 with fuzz 1 (offset 16 lines).
  47. ==> Sources are ready.
  48. ==> Making package: python-tornado-4.4 4.4.3-1 (Sun Jan 27 19:53:07 2019)
  49. ==> Checking runtime dependencies...
  50. ==> Checking buildtime dependencies...
  51. ==> WARNING: Using existing $srcdir/ tree
  52. ==> Starting build()...
  53. running build
  54. running build_py
  55. creating build
  56. creating build/lib.linux-x86_64-3.7
  57. creating build/lib.linux-x86_64-3.7/tornado
  58. copying tornado/stack_context.py -> build/lib.linux-x86_64-3.7/tornado
  59. copying tornado/httpclient.py -> build/lib.linux-x86_64-3.7/tornado
  60. copying tornado/auth.py -> build/lib.linux-x86_64-3.7/tornado
  61. copying tornado/simple_httpclient.py -> build/lib.linux-x86_64-3.7/tornado
  62. copying tornado/httputil.py -> build/lib.linux-x86_64-3.7/tornado
  63. copying tornado/ioloop.py -> build/lib.linux-x86_64-3.7/tornado
  64. copying tornado/iostream.py -> build/lib.linux-x86_64-3.7/tornado
  65. copying tornado/__init__.py -> build/lib.linux-x86_64-3.7/tornado
  66. copying tornado/queues.py -> build/lib.linux-x86_64-3.7/tornado
  67. copying tornado/util.py -> build/lib.linux-x86_64-3.7/tornado
  68. copying tornado/escape.py -> build/lib.linux-x86_64-3.7/tornado
  69. copying tornado/template.py -> build/lib.linux-x86_64-3.7/tornado
  70. copying tornado/wsgi.py -> build/lib.linux-x86_64-3.7/tornado
  71. copying tornado/testing.py -> build/lib.linux-x86_64-3.7/tornado
  72. copying tornado/process.py -> build/lib.linux-x86_64-3.7/tornado
  73. copying tornado/web.py -> build/lib.linux-x86_64-3.7/tornado
  74. copying tornado/tcpserver.py -> build/lib.linux-x86_64-3.7/tornado
  75. copying tornado/netutil.py -> build/lib.linux-x86_64-3.7/tornado
  76. copying tornado/tcpclient.py -> build/lib.linux-x86_64-3.7/tornado
  77. copying tornado/gen.py -> build/lib.linux-x86_64-3.7/tornado
  78. copying tornado/autoreload.py -> build/lib.linux-x86_64-3.7/tornado
  79. copying tornado/_locale_data.py -> build/lib.linux-x86_64-3.7/tornado
  80. copying tornado/http1connection.py -> build/lib.linux-x86_64-3.7/tornado
  81. copying tornado/options.py -> build/lib.linux-x86_64-3.7/tornado
  82. copying tornado/log.py -> build/lib.linux-x86_64-3.7/tornado
  83. copying tornado/locale.py -> build/lib.linux-x86_64-3.7/tornado
  84. copying tornado/httpserver.py -> build/lib.linux-x86_64-3.7/tornado
  85. copying tornado/concurrent.py -> build/lib.linux-x86_64-3.7/tornado
  86. copying tornado/curl_httpclient.py -> build/lib.linux-x86_64-3.7/tornado
  87. copying tornado/locks.py -> build/lib.linux-x86_64-3.7/tornado
  88. copying tornado/websocket.py -> build/lib.linux-x86_64-3.7/tornado
  89. creating build/lib.linux-x86_64-3.7/tornado/test
  90. copying tornado/test/escape_test.py -> build/lib.linux-x86_64-3.7/tornado/test
  91. copying tornado/test/tcpserver_test.py -> build/lib.linux-x86_64-3.7/tornado/test
  92. copying tornado/test/auth_test.py -> build/lib.linux-x86_64-3.7/tornado/test
  93. copying tornado/test/twisted_test.py -> build/lib.linux-x86_64-3.7/tornado/test
  94. copying tornado/test/tcpclient_test.py -> build/lib.linux-x86_64-3.7/tornado/test
  95. copying tornado/test/import_test.py -> build/lib.linux-x86_64-3.7/tornado/test
  96. copying tornado/test/queues_test.py -> build/lib.linux-x86_64-3.7/tornado/test
  97. copying tornado/test/curl_httpclient_test.py -> build/lib.linux-x86_64-3.7/tornado/test
  98. copying tornado/test/options_test.py -> build/lib.linux-x86_64-3.7/tornado/test
  99. copying tornado/test/ioloop_test.py -> build/lib.linux-x86_64-3.7/tornado/test
  100. copying tornado/test/concurrent_test.py -> build/lib.linux-x86_64-3.7/tornado/test
  101. copying tornado/test/__init__.py -> build/lib.linux-x86_64-3.7/tornado/test
  102. copying tornado/test/util.py -> build/lib.linux-x86_64-3.7/tornado/test
  103. copying tornado/test/testing_test.py -> build/lib.linux-x86_64-3.7/tornado/test
  104. copying tornado/test/asyncio_test.py -> build/lib.linux-x86_64-3.7/tornado/test
  105. copying tornado/test/netutil_test.py -> build/lib.linux-x86_64-3.7/tornado/test
  106. copying tornado/test/httpserver_test.py -> build/lib.linux-x86_64-3.7/tornado/test
  107. copying tornado/test/websocket_test.py -> build/lib.linux-x86_64-3.7/tornado/test
  108. copying tornado/test/simple_httpclient_test.py -> build/lib.linux-x86_64-3.7/tornado/test
  109. copying tornado/test/__main__.py -> build/lib.linux-x86_64-3.7/tornado/test
  110. copying tornado/test/locale_test.py -> build/lib.linux-x86_64-3.7/tornado/test
  111. copying tornado/test/util_test.py -> build/lib.linux-x86_64-3.7/tornado/test
  112. copying tornado/test/http1connection_test.py -> build/lib.linux-x86_64-3.7/tornado/test
  113. copying tornado/test/gen_test.py -> build/lib.linux-x86_64-3.7/tornado/test
  114. copying tornado/test/wsgi_test.py -> build/lib.linux-x86_64-3.7/tornado/test
  115. copying tornado/test/template_test.py -> build/lib.linux-x86_64-3.7/tornado/test
  116. copying tornado/test/process_test.py -> build/lib.linux-x86_64-3.7/tornado/test
  117. copying tornado/test/iostream_test.py -> build/lib.linux-x86_64-3.7/tornado/test
  118. copying tornado/test/windows_test.py -> build/lib.linux-x86_64-3.7/tornado/test
  119. copying tornado/test/stack_context_test.py -> build/lib.linux-x86_64-3.7/tornado/test
  120. copying tornado/test/httpclient_test.py -> build/lib.linux-x86_64-3.7/tornado/test
  121. copying tornado/test/log_test.py -> build/lib.linux-x86_64-3.7/tornado/test
  122. copying tornado/test/web_test.py -> build/lib.linux-x86_64-3.7/tornado/test
  123. copying tornado/test/resolve_test_helper.py -> build/lib.linux-x86_64-3.7/tornado/test
  124. copying tornado/test/runtests.py -> build/lib.linux-x86_64-3.7/tornado/test
  125. copying tornado/test/httputil_test.py -> build/lib.linux-x86_64-3.7/tornado/test
  126. copying tornado/test/locks_test.py -> build/lib.linux-x86_64-3.7/tornado/test
  127. creating build/lib.linux-x86_64-3.7/tornado/platform
  128. copying tornado/platform/select.py -> build/lib.linux-x86_64-3.7/tornado/platform
  129. copying tornado/platform/kqueue.py -> build/lib.linux-x86_64-3.7/tornado/platform
  130. copying tornado/platform/auto.py -> build/lib.linux-x86_64-3.7/tornado/platform
  131. copying tornado/platform/__init__.py -> build/lib.linux-x86_64-3.7/tornado/platform
  132. copying tornado/platform/interface.py -> build/lib.linux-x86_64-3.7/tornado/platform
  133. copying tornado/platform/twisted.py -> build/lib.linux-x86_64-3.7/tornado/platform
  134. copying tornado/platform/epoll.py -> build/lib.linux-x86_64-3.7/tornado/platform
  135. copying tornado/platform/common.py -> build/lib.linux-x86_64-3.7/tornado/platform
  136. copying tornado/platform/asyncio.py -> build/lib.linux-x86_64-3.7/tornado/platform
  137. copying tornado/platform/caresresolver.py -> build/lib.linux-x86_64-3.7/tornado/platform
  138. copying tornado/platform/windows.py -> build/lib.linux-x86_64-3.7/tornado/platform
  139. copying tornado/platform/posix.py -> build/lib.linux-x86_64-3.7/tornado/platform
  140. creating build/lib.linux-x86_64-3.7/tornado/test/csv_translations
  141. copying tornado/test/csv_translations/fr_FR.csv -> build/lib.linux-x86_64-3.7/tornado/test/csv_translations
  142. creating build/lib.linux-x86_64-3.7/tornado/test/gettext_translations
  143. creating build/lib.linux-x86_64-3.7/tornado/test/gettext_translations/fr_FR
  144. creating build/lib.linux-x86_64-3.7/tornado/test/gettext_translations/fr_FR/LC_MESSAGES
  145. copying tornado/test/gettext_translations/fr_FR/LC_MESSAGES/tornado_test.mo -> build/lib.linux-x86_64-3.7/tornado/test/gettext_translations/fr_FR/LC_MESSAGES
  146. copying tornado/test/gettext_translations/fr_FR/LC_MESSAGES/tornado_test.po -> build/lib.linux-x86_64-3.7/tornado/test/gettext_translations/fr_FR/LC_MESSAGES
  147. copying tornado/test/options_test.cfg -> build/lib.linux-x86_64-3.7/tornado/test
  148. creating build/lib.linux-x86_64-3.7/tornado/test/static
  149. copying tornado/test/static/robots.txt -> build/lib.linux-x86_64-3.7/tornado/test/static
  150. copying tornado/test/static/sample.xml -> build/lib.linux-x86_64-3.7/tornado/test/static
  151. copying tornado/test/static/sample.xml.gz -> build/lib.linux-x86_64-3.7/tornado/test/static
  152. copying tornado/test/static/sample.xml.bz2 -> build/lib.linux-x86_64-3.7/tornado/test/static
  153. creating build/lib.linux-x86_64-3.7/tornado/test/static/dir
  154. copying tornado/test/static/dir/index.html -> build/lib.linux-x86_64-3.7/tornado/test/static/dir
  155. copying tornado/test/static_foo.txt -> build/lib.linux-x86_64-3.7/tornado/test
  156. creating build/lib.linux-x86_64-3.7/tornado/test/templates
  157. copying tornado/test/templates/utf8.html -> build/lib.linux-x86_64-3.7/tornado/test/templates
  158. copying tornado/test/test.crt -> build/lib.linux-x86_64-3.7/tornado/test
  159. copying tornado/test/test.key -> build/lib.linux-x86_64-3.7/tornado/test
  160. running build_ext
  161. building 'tornado.speedups' extension
  162. creating build/temp.linux-x86_64-3.7
  163. creating build/temp.linux-x86_64-3.7/tornado
  164. gcc -pthread -DNDEBUG -g -fwrapv -O3 -Wall -march=x86-64 -mtune=generic -O2 -pipe -fno-plt -D_FORTIFY_SOURCE=2 -fPIC -I/usr/include/python3.7m -c tornado/speedups.c -o build/temp.linux-x86_64-3.7/tornado/speedups.o
  165. gcc -pthread -shared -Wl,-O1,--sort-common,--as-needed,-z,relro,-z,now -Wl,-O1,--sort-common,--as-needed,-z,relro,-z,now -Wl,-O1,--sort-common,--as-needed,-z,relro,-z,now -march=x86-64 -mtune=generic -O2 -pipe -fno-plt -D_FORTIFY_SOURCE=2 build/temp.linux-x86_64-3.7/tornado/speedups.o -L/usr/lib -lpython3.7m -o build/lib.linux-x86_64-3.7/tornado/speedups.cpython-37m-x86_64-linux-gnu.so
  166. running build
  167. running build_py
  168. creating build
  169. creating build/lib.linux-x86_64-2.7
  170. creating build/lib.linux-x86_64-2.7/tornado
  171. copying tornado/stack_context.py -> build/lib.linux-x86_64-2.7/tornado
  172. copying tornado/httpclient.py -> build/lib.linux-x86_64-2.7/tornado
  173. copying tornado/auth.py -> build/lib.linux-x86_64-2.7/tornado
  174. copying tornado/simple_httpclient.py -> build/lib.linux-x86_64-2.7/tornado
  175. copying tornado/httputil.py -> build/lib.linux-x86_64-2.7/tornado
  176. copying tornado/ioloop.py -> build/lib.linux-x86_64-2.7/tornado
  177. copying tornado/iostream.py -> build/lib.linux-x86_64-2.7/tornado
  178. copying tornado/__init__.py -> build/lib.linux-x86_64-2.7/tornado
  179. copying tornado/queues.py -> build/lib.linux-x86_64-2.7/tornado
  180. copying tornado/util.py -> build/lib.linux-x86_64-2.7/tornado
  181. copying tornado/escape.py -> build/lib.linux-x86_64-2.7/tornado
  182. copying tornado/template.py -> build/lib.linux-x86_64-2.7/tornado
  183. copying tornado/wsgi.py -> build/lib.linux-x86_64-2.7/tornado
  184. copying tornado/testing.py -> build/lib.linux-x86_64-2.7/tornado
  185. copying tornado/process.py -> build/lib.linux-x86_64-2.7/tornado
  186. copying tornado/web.py -> build/lib.linux-x86_64-2.7/tornado
  187. copying tornado/tcpserver.py -> build/lib.linux-x86_64-2.7/tornado
  188. copying tornado/netutil.py -> build/lib.linux-x86_64-2.7/tornado
  189. copying tornado/tcpclient.py -> build/lib.linux-x86_64-2.7/tornado
  190. copying tornado/gen.py -> build/lib.linux-x86_64-2.7/tornado
  191. copying tornado/autoreload.py -> build/lib.linux-x86_64-2.7/tornado
  192. copying tornado/_locale_data.py -> build/lib.linux-x86_64-2.7/tornado
  193. copying tornado/http1connection.py -> build/lib.linux-x86_64-2.7/tornado
  194. copying tornado/options.py -> build/lib.linux-x86_64-2.7/tornado
  195. copying tornado/log.py -> build/lib.linux-x86_64-2.7/tornado
  196. copying tornado/locale.py -> build/lib.linux-x86_64-2.7/tornado
  197. copying tornado/httpserver.py -> build/lib.linux-x86_64-2.7/tornado
  198. copying tornado/concurrent.py -> build/lib.linux-x86_64-2.7/tornado
  199. copying tornado/curl_httpclient.py -> build/lib.linux-x86_64-2.7/tornado
  200. copying tornado/locks.py -> build/lib.linux-x86_64-2.7/tornado
  201. copying tornado/websocket.py -> build/lib.linux-x86_64-2.7/tornado
  202. creating build/lib.linux-x86_64-2.7/tornado/test
  203. copying tornado/test/escape_test.py -> build/lib.linux-x86_64-2.7/tornado/test
  204. copying tornado/test/tcpserver_test.py -> build/lib.linux-x86_64-2.7/tornado/test
  205. copying tornado/test/auth_test.py -> build/lib.linux-x86_64-2.7/tornado/test
  206. copying tornado/test/twisted_test.py -> build/lib.linux-x86_64-2.7/tornado/test
  207. copying tornado/test/tcpclient_test.py -> build/lib.linux-x86_64-2.7/tornado/test
  208. copying tornado/test/import_test.py -> build/lib.linux-x86_64-2.7/tornado/test
  209. copying tornado/test/queues_test.py -> build/lib.linux-x86_64-2.7/tornado/test
  210. copying tornado/test/curl_httpclient_test.py -> build/lib.linux-x86_64-2.7/tornado/test
  211. copying tornado/test/options_test.py -> build/lib.linux-x86_64-2.7/tornado/test
  212. copying tornado/test/ioloop_test.py -> build/lib.linux-x86_64-2.7/tornado/test
  213. copying tornado/test/concurrent_test.py -> build/lib.linux-x86_64-2.7/tornado/test
  214. copying tornado/test/__init__.py -> build/lib.linux-x86_64-2.7/tornado/test
  215. copying tornado/test/util.py -> build/lib.linux-x86_64-2.7/tornado/test
  216. copying tornado/test/testing_test.py -> build/lib.linux-x86_64-2.7/tornado/test
  217. copying tornado/test/asyncio_test.py -> build/lib.linux-x86_64-2.7/tornado/test
  218. copying tornado/test/netutil_test.py -> build/lib.linux-x86_64-2.7/tornado/test
  219. copying tornado/test/httpserver_test.py -> build/lib.linux-x86_64-2.7/tornado/test
  220. copying tornado/test/websocket_test.py -> build/lib.linux-x86_64-2.7/tornado/test
  221. copying tornado/test/simple_httpclient_test.py -> build/lib.linux-x86_64-2.7/tornado/test
  222. copying tornado/test/__main__.py -> build/lib.linux-x86_64-2.7/tornado/test
  223. copying tornado/test/locale_test.py -> build/lib.linux-x86_64-2.7/tornado/test
  224. copying tornado/test/util_test.py -> build/lib.linux-x86_64-2.7/tornado/test
  225. copying tornado/test/http1connection_test.py -> build/lib.linux-x86_64-2.7/tornado/test
  226. copying tornado/test/gen_test.py -> build/lib.linux-x86_64-2.7/tornado/test
  227. copying tornado/test/wsgi_test.py -> build/lib.linux-x86_64-2.7/tornado/test
  228. copying tornado/test/template_test.py -> build/lib.linux-x86_64-2.7/tornado/test
  229. copying tornado/test/process_test.py -> build/lib.linux-x86_64-2.7/tornado/test
  230. copying tornado/test/iostream_test.py -> build/lib.linux-x86_64-2.7/tornado/test
  231. copying tornado/test/windows_test.py -> build/lib.linux-x86_64-2.7/tornado/test
  232. copying tornado/test/stack_context_test.py -> build/lib.linux-x86_64-2.7/tornado/test
  233. copying tornado/test/httpclient_test.py -> build/lib.linux-x86_64-2.7/tornado/test
  234. copying tornado/test/log_test.py -> build/lib.linux-x86_64-2.7/tornado/test
  235. copying tornado/test/web_test.py -> build/lib.linux-x86_64-2.7/tornado/test
  236. copying tornado/test/resolve_test_helper.py -> build/lib.linux-x86_64-2.7/tornado/test
  237. copying tornado/test/runtests.py -> build/lib.linux-x86_64-2.7/tornado/test
  238. copying tornado/test/httputil_test.py -> build/lib.linux-x86_64-2.7/tornado/test
  239. copying tornado/test/locks_test.py -> build/lib.linux-x86_64-2.7/tornado/test
  240. creating build/lib.linux-x86_64-2.7/tornado/platform
  241. copying tornado/platform/select.py -> build/lib.linux-x86_64-2.7/tornado/platform
  242. copying tornado/platform/kqueue.py -> build/lib.linux-x86_64-2.7/tornado/platform
  243. copying tornado/platform/auto.py -> build/lib.linux-x86_64-2.7/tornado/platform
  244. copying tornado/platform/__init__.py -> build/lib.linux-x86_64-2.7/tornado/platform
  245. copying tornado/platform/interface.py -> build/lib.linux-x86_64-2.7/tornado/platform
  246. copying tornado/platform/twisted.py -> build/lib.linux-x86_64-2.7/tornado/platform
  247. copying tornado/platform/epoll.py -> build/lib.linux-x86_64-2.7/tornado/platform
  248. copying tornado/platform/common.py -> build/lib.linux-x86_64-2.7/tornado/platform
  249. copying tornado/platform/asyncio.py -> build/lib.linux-x86_64-2.7/tornado/platform
  250. copying tornado/platform/caresresolver.py -> build/lib.linux-x86_64-2.7/tornado/platform
  251. copying tornado/platform/windows.py -> build/lib.linux-x86_64-2.7/tornado/platform
  252. copying tornado/platform/posix.py -> build/lib.linux-x86_64-2.7/tornado/platform
  253. creating build/lib.linux-x86_64-2.7/tornado/test/csv_translations
  254. copying tornado/test/csv_translations/fr_FR.csv -> build/lib.linux-x86_64-2.7/tornado/test/csv_translations
  255. creating build/lib.linux-x86_64-2.7/tornado/test/gettext_translations
  256. creating build/lib.linux-x86_64-2.7/tornado/test/gettext_translations/fr_FR
  257. creating build/lib.linux-x86_64-2.7/tornado/test/gettext_translations/fr_FR/LC_MESSAGES
  258. copying tornado/test/gettext_translations/fr_FR/LC_MESSAGES/tornado_test.mo -> build/lib.linux-x86_64-2.7/tornado/test/gettext_translations/fr_FR/LC_MESSAGES
  259. copying tornado/test/gettext_translations/fr_FR/LC_MESSAGES/tornado_test.po -> build/lib.linux-x86_64-2.7/tornado/test/gettext_translations/fr_FR/LC_MESSAGES
  260. copying tornado/test/options_test.cfg -> build/lib.linux-x86_64-2.7/tornado/test
  261. creating build/lib.linux-x86_64-2.7/tornado/test/static
  262. copying tornado/test/static/robots.txt -> build/lib.linux-x86_64-2.7/tornado/test/static
  263. copying tornado/test/static/sample.xml -> build/lib.linux-x86_64-2.7/tornado/test/static
  264. copying tornado/test/static/sample.xml.gz -> build/lib.linux-x86_64-2.7/tornado/test/static
  265. copying tornado/test/static/sample.xml.bz2 -> build/lib.linux-x86_64-2.7/tornado/test/static
  266. creating build/lib.linux-x86_64-2.7/tornado/test/static/dir
  267. copying tornado/test/static/dir/index.html -> build/lib.linux-x86_64-2.7/tornado/test/static/dir
  268. copying tornado/test/static_foo.txt -> build/lib.linux-x86_64-2.7/tornado/test
  269. creating build/lib.linux-x86_64-2.7/tornado/test/templates
  270. copying tornado/test/templates/utf8.html -> build/lib.linux-x86_64-2.7/tornado/test/templates
  271. copying tornado/test/test.crt -> build/lib.linux-x86_64-2.7/tornado/test
  272. copying tornado/test/test.key -> build/lib.linux-x86_64-2.7/tornado/test
  273. running build_ext
  274. building 'tornado.speedups' extension
  275. creating build/temp.linux-x86_64-2.7
  276. creating build/temp.linux-x86_64-2.7/tornado
  277. gcc -pthread -DNDEBUG -march=x86-64 -mtune=generic -O2 -pipe -fstack-protector-strong -fno-plt -march=x86-64 -mtune=generic -O2 -pipe -fno-plt -D_FORTIFY_SOURCE=2 -fPIC -I/usr/include/python2.7 -c tornado/speedups.c -o build/temp.linux-x86_64-2.7/tornado/speedups.o
  278. gcc -pthread -shared -Wl,-O1,--sort-common,--as-needed,-z,relro,-z,now -Wl,-O1,--sort-common,--as-needed,-z,relro,-z,now -march=x86-64 -mtune=generic -O2 -pipe -fno-plt -D_FORTIFY_SOURCE=2 build/temp.linux-x86_64-2.7/tornado/speedups.o -L/usr/lib -lpython2.7 -o build/lib.linux-x86_64-2.7/tornado/speedups.so
  279. ==> Starting check()...
  280. running install
  281. running build
  282. running build_py
  283. running build_ext
  284. running install_lib
  285. creating /home/mgr/.cache/yay/python-tornado-4.4/src/tornado-4.4.3/tmp_install
  286. creating /home/mgr/.cache/yay/python-tornado-4.4/src/tornado-4.4.3/tmp_install/usr
  287. creating /home/mgr/.cache/yay/python-tornado-4.4/src/tornado-4.4.3/tmp_install/usr/lib
  288. creating /home/mgr/.cache/yay/python-tornado-4.4/src/tornado-4.4.3/tmp_install/usr/lib/python3.7
  289. creating /home/mgr/.cache/yay/python-tornado-4.4/src/tornado-4.4.3/tmp_install/usr/lib/python3.7/site-packages
  290. creating /home/mgr/.cache/yay/python-tornado-4.4/src/tornado-4.4.3/tmp_install/usr/lib/python3.7/site-packages/tornado
  291. copying build/lib.linux-x86_64-3.7/tornado/stack_context.py -> /home/mgr/.cache/yay/python-tornado-4.4/src/tornado-4.4.3/tmp_install/usr/lib/python3.7/site-packages/tornado
  292. copying build/lib.linux-x86_64-3.7/tornado/httpclient.py -> /home/mgr/.cache/yay/python-tornado-4.4/src/tornado-4.4.3/tmp_install/usr/lib/python3.7/site-packages/tornado
  293. copying build/lib.linux-x86_64-3.7/tornado/auth.py -> /home/mgr/.cache/yay/python-tornado-4.4/src/tornado-4.4.3/tmp_install/usr/lib/python3.7/site-packages/tornado
  294. copying build/lib.linux-x86_64-3.7/tornado/simple_httpclient.py -> /home/mgr/.cache/yay/python-tornado-4.4/src/tornado-4.4.3/tmp_install/usr/lib/python3.7/site-packages/tornado
  295. copying build/lib.linux-x86_64-3.7/tornado/httputil.py -> /home/mgr/.cache/yay/python-tornado-4.4/src/tornado-4.4.3/tmp_install/usr/lib/python3.7/site-packages/tornado
  296. copying build/lib.linux-x86_64-3.7/tornado/ioloop.py -> /home/mgr/.cache/yay/python-tornado-4.4/src/tornado-4.4.3/tmp_install/usr/lib/python3.7/site-packages/tornado
  297. copying build/lib.linux-x86_64-3.7/tornado/iostream.py -> /home/mgr/.cache/yay/python-tornado-4.4/src/tornado-4.4.3/tmp_install/usr/lib/python3.7/site-packages/tornado
  298. copying build/lib.linux-x86_64-3.7/tornado/__init__.py -> /home/mgr/.cache/yay/python-tornado-4.4/src/tornado-4.4.3/tmp_install/usr/lib/python3.7/site-packages/tornado
  299. copying build/lib.linux-x86_64-3.7/tornado/queues.py -> /home/mgr/.cache/yay/python-tornado-4.4/src/tornado-4.4.3/tmp_install/usr/lib/python3.7/site-packages/tornado
  300. copying build/lib.linux-x86_64-3.7/tornado/util.py -> /home/mgr/.cache/yay/python-tornado-4.4/src/tornado-4.4.3/tmp_install/usr/lib/python3.7/site-packages/tornado
  301. copying build/lib.linux-x86_64-3.7/tornado/escape.py -> /home/mgr/.cache/yay/python-tornado-4.4/src/tornado-4.4.3/tmp_install/usr/lib/python3.7/site-packages/tornado
  302. copying build/lib.linux-x86_64-3.7/tornado/template.py -> /home/mgr/.cache/yay/python-tornado-4.4/src/tornado-4.4.3/tmp_install/usr/lib/python3.7/site-packages/tornado
  303. copying build/lib.linux-x86_64-3.7/tornado/wsgi.py -> /home/mgr/.cache/yay/python-tornado-4.4/src/tornado-4.4.3/tmp_install/usr/lib/python3.7/site-packages/tornado
  304. copying build/lib.linux-x86_64-3.7/tornado/testing.py -> /home/mgr/.cache/yay/python-tornado-4.4/src/tornado-4.4.3/tmp_install/usr/lib/python3.7/site-packages/tornado
  305. copying build/lib.linux-x86_64-3.7/tornado/process.py -> /home/mgr/.cache/yay/python-tornado-4.4/src/tornado-4.4.3/tmp_install/usr/lib/python3.7/site-packages/tornado
  306. creating /home/mgr/.cache/yay/python-tornado-4.4/src/tornado-4.4.3/tmp_install/usr/lib/python3.7/site-packages/tornado/platform
  307. copying build/lib.linux-x86_64-3.7/tornado/platform/select.py -> /home/mgr/.cache/yay/python-tornado-4.4/src/tornado-4.4.3/tmp_install/usr/lib/python3.7/site-packages/tornado/platform
  308. copying build/lib.linux-x86_64-3.7/tornado/platform/kqueue.py -> /home/mgr/.cache/yay/python-tornado-4.4/src/tornado-4.4.3/tmp_install/usr/lib/python3.7/site-packages/tornado/platform
  309. copying build/lib.linux-x86_64-3.7/tornado/platform/auto.py -> /home/mgr/.cache/yay/python-tornado-4.4/src/tornado-4.4.3/tmp_install/usr/lib/python3.7/site-packages/tornado/platform
  310. copying build/lib.linux-x86_64-3.7/tornado/platform/__init__.py -> /home/mgr/.cache/yay/python-tornado-4.4/src/tornado-4.4.3/tmp_install/usr/lib/python3.7/site-packages/tornado/platform
  311. copying build/lib.linux-x86_64-3.7/tornado/platform/interface.py -> /home/mgr/.cache/yay/python-tornado-4.4/src/tornado-4.4.3/tmp_install/usr/lib/python3.7/site-packages/tornado/platform
  312. copying build/lib.linux-x86_64-3.7/tornado/platform/twisted.py -> /home/mgr/.cache/yay/python-tornado-4.4/src/tornado-4.4.3/tmp_install/usr/lib/python3.7/site-packages/tornado/platform
  313. copying build/lib.linux-x86_64-3.7/tornado/platform/epoll.py -> /home/mgr/.cache/yay/python-tornado-4.4/src/tornado-4.4.3/tmp_install/usr/lib/python3.7/site-packages/tornado/platform
  314. copying build/lib.linux-x86_64-3.7/tornado/platform/common.py -> /home/mgr/.cache/yay/python-tornado-4.4/src/tornado-4.4.3/tmp_install/usr/lib/python3.7/site-packages/tornado/platform
  315. copying build/lib.linux-x86_64-3.7/tornado/platform/asyncio.py -> /home/mgr/.cache/yay/python-tornado-4.4/src/tornado-4.4.3/tmp_install/usr/lib/python3.7/site-packages/tornado/platform
  316. copying build/lib.linux-x86_64-3.7/tornado/platform/caresresolver.py -> /home/mgr/.cache/yay/python-tornado-4.4/src/tornado-4.4.3/tmp_install/usr/lib/python3.7/site-packages/tornado/platform
  317. copying build/lib.linux-x86_64-3.7/tornado/platform/windows.py -> /home/mgr/.cache/yay/python-tornado-4.4/src/tornado-4.4.3/tmp_install/usr/lib/python3.7/site-packages/tornado/platform
  318. copying build/lib.linux-x86_64-3.7/tornado/platform/posix.py -> /home/mgr/.cache/yay/python-tornado-4.4/src/tornado-4.4.3/tmp_install/usr/lib/python3.7/site-packages/tornado/platform
  319. copying build/lib.linux-x86_64-3.7/tornado/speedups.cpython-37m-x86_64-linux-gnu.so -> /home/mgr/.cache/yay/python-tornado-4.4/src/tornado-4.4.3/tmp_install/usr/lib/python3.7/site-packages/tornado
  320. copying build/lib.linux-x86_64-3.7/tornado/web.py -> /home/mgr/.cache/yay/python-tornado-4.4/src/tornado-4.4.3/tmp_install/usr/lib/python3.7/site-packages/tornado
  321. copying build/lib.linux-x86_64-3.7/tornado/tcpserver.py -> /home/mgr/.cache/yay/python-tornado-4.4/src/tornado-4.4.3/tmp_install/usr/lib/python3.7/site-packages/tornado
  322. copying build/lib.linux-x86_64-3.7/tornado/netutil.py -> /home/mgr/.cache/yay/python-tornado-4.4/src/tornado-4.4.3/tmp_install/usr/lib/python3.7/site-packages/tornado
  323. copying build/lib.linux-x86_64-3.7/tornado/tcpclient.py -> /home/mgr/.cache/yay/python-tornado-4.4/src/tornado-4.4.3/tmp_install/usr/lib/python3.7/site-packages/tornado
  324. creating /home/mgr/.cache/yay/python-tornado-4.4/src/tornado-4.4.3/tmp_install/usr/lib/python3.7/site-packages/tornado/test
  325. copying build/lib.linux-x86_64-3.7/tornado/test/escape_test.py -> /home/mgr/.cache/yay/python-tornado-4.4/src/tornado-4.4.3/tmp_install/usr/lib/python3.7/site-packages/tornado/test
  326. copying build/lib.linux-x86_64-3.7/tornado/test/tcpserver_test.py -> /home/mgr/.cache/yay/python-tornado-4.4/src/tornado-4.4.3/tmp_install/usr/lib/python3.7/site-packages/tornado/test
  327. copying build/lib.linux-x86_64-3.7/tornado/test/auth_test.py -> /home/mgr/.cache/yay/python-tornado-4.4/src/tornado-4.4.3/tmp_install/usr/lib/python3.7/site-packages/tornado/test
  328. copying build/lib.linux-x86_64-3.7/tornado/test/twisted_test.py -> /home/mgr/.cache/yay/python-tornado-4.4/src/tornado-4.4.3/tmp_install/usr/lib/python3.7/site-packages/tornado/test
  329. copying build/lib.linux-x86_64-3.7/tornado/test/test.key -> /home/mgr/.cache/yay/python-tornado-4.4/src/tornado-4.4.3/tmp_install/usr/lib/python3.7/site-packages/tornado/test
  330. copying build/lib.linux-x86_64-3.7/tornado/test/tcpclient_test.py -> /home/mgr/.cache/yay/python-tornado-4.4/src/tornado-4.4.3/tmp_install/usr/lib/python3.7/site-packages/tornado/test
  331. copying build/lib.linux-x86_64-3.7/tornado/test/import_test.py -> /home/mgr/.cache/yay/python-tornado-4.4/src/tornado-4.4.3/tmp_install/usr/lib/python3.7/site-packages/tornado/test
  332. copying build/lib.linux-x86_64-3.7/tornado/test/queues_test.py -> /home/mgr/.cache/yay/python-tornado-4.4/src/tornado-4.4.3/tmp_install/usr/lib/python3.7/site-packages/tornado/test
  333. copying build/lib.linux-x86_64-3.7/tornado/test/curl_httpclient_test.py -> /home/mgr/.cache/yay/python-tornado-4.4/src/tornado-4.4.3/tmp_install/usr/lib/python3.7/site-packages/tornado/test
  334. copying build/lib.linux-x86_64-3.7/tornado/test/options_test.py -> /home/mgr/.cache/yay/python-tornado-4.4/src/tornado-4.4.3/tmp_install/usr/lib/python3.7/site-packages/tornado/test
  335. copying build/lib.linux-x86_64-3.7/tornado/test/ioloop_test.py -> /home/mgr/.cache/yay/python-tornado-4.4/src/tornado-4.4.3/tmp_install/usr/lib/python3.7/site-packages/tornado/test
  336. copying build/lib.linux-x86_64-3.7/tornado/test/concurrent_test.py -> /home/mgr/.cache/yay/python-tornado-4.4/src/tornado-4.4.3/tmp_install/usr/lib/python3.7/site-packages/tornado/test
  337. copying build/lib.linux-x86_64-3.7/tornado/test/__init__.py -> /home/mgr/.cache/yay/python-tornado-4.4/src/tornado-4.4.3/tmp_install/usr/lib/python3.7/site-packages/tornado/test
  338. creating /home/mgr/.cache/yay/python-tornado-4.4/src/tornado-4.4.3/tmp_install/usr/lib/python3.7/site-packages/tornado/test/csv_translations
  339. copying build/lib.linux-x86_64-3.7/tornado/test/csv_translations/fr_FR.csv -> /home/mgr/.cache/yay/python-tornado-4.4/src/tornado-4.4.3/tmp_install/usr/lib/python3.7/site-packages/tornado/test/csv_translations
  340. copying build/lib.linux-x86_64-3.7/tornado/test/util.py -> /home/mgr/.cache/yay/python-tornado-4.4/src/tornado-4.4.3/tmp_install/usr/lib/python3.7/site-packages/tornado/test
  341. copying build/lib.linux-x86_64-3.7/tornado/test/testing_test.py -> /home/mgr/.cache/yay/python-tornado-4.4/src/tornado-4.4.3/tmp_install/usr/lib/python3.7/site-packages/tornado/test
  342. copying build/lib.linux-x86_64-3.7/tornado/test/options_test.cfg -> /home/mgr/.cache/yay/python-tornado-4.4/src/tornado-4.4.3/tmp_install/usr/lib/python3.7/site-packages/tornado/test
  343. copying build/lib.linux-x86_64-3.7/tornado/test/asyncio_test.py -> /home/mgr/.cache/yay/python-tornado-4.4/src/tornado-4.4.3/tmp_install/usr/lib/python3.7/site-packages/tornado/test
  344. copying build/lib.linux-x86_64-3.7/tornado/test/netutil_test.py -> /home/mgr/.cache/yay/python-tornado-4.4/src/tornado-4.4.3/tmp_install/usr/lib/python3.7/site-packages/tornado/test
  345. copying build/lib.linux-x86_64-3.7/tornado/test/httpserver_test.py -> /home/mgr/.cache/yay/python-tornado-4.4/src/tornado-4.4.3/tmp_install/usr/lib/python3.7/site-packages/tornado/test
  346. creating /home/mgr/.cache/yay/python-tornado-4.4/src/tornado-4.4.3/tmp_install/usr/lib/python3.7/site-packages/tornado/test/templates
  347. copying build/lib.linux-x86_64-3.7/tornado/test/templates/utf8.html -> /home/mgr/.cache/yay/python-tornado-4.4/src/tornado-4.4.3/tmp_install/usr/lib/python3.7/site-packages/tornado/test/templates
  348. copying build/lib.linux-x86_64-3.7/tornado/test/websocket_test.py -> /home/mgr/.cache/yay/python-tornado-4.4/src/tornado-4.4.3/tmp_install/usr/lib/python3.7/site-packages/tornado/test
  349. copying build/lib.linux-x86_64-3.7/tornado/test/simple_httpclient_test.py -> /home/mgr/.cache/yay/python-tornado-4.4/src/tornado-4.4.3/tmp_install/usr/lib/python3.7/site-packages/tornado/test
  350. copying build/lib.linux-x86_64-3.7/tornado/test/__main__.py -> /home/mgr/.cache/yay/python-tornado-4.4/src/tornado-4.4.3/tmp_install/usr/lib/python3.7/site-packages/tornado/test
  351. copying build/lib.linux-x86_64-3.7/tornado/test/locale_test.py -> /home/mgr/.cache/yay/python-tornado-4.4/src/tornado-4.4.3/tmp_install/usr/lib/python3.7/site-packages/tornado/test
  352. copying build/lib.linux-x86_64-3.7/tornado/test/util_test.py -> /home/mgr/.cache/yay/python-tornado-4.4/src/tornado-4.4.3/tmp_install/usr/lib/python3.7/site-packages/tornado/test
  353. copying build/lib.linux-x86_64-3.7/tornado/test/http1connection_test.py -> /home/mgr/.cache/yay/python-tornado-4.4/src/tornado-4.4.3/tmp_install/usr/lib/python3.7/site-packages/tornado/test
  354. copying build/lib.linux-x86_64-3.7/tornado/test/static_foo.txt -> /home/mgr/.cache/yay/python-tornado-4.4/src/tornado-4.4.3/tmp_install/usr/lib/python3.7/site-packages/tornado/test
  355. copying build/lib.linux-x86_64-3.7/tornado/test/gen_test.py -> /home/mgr/.cache/yay/python-tornado-4.4/src/tornado-4.4.3/tmp_install/usr/lib/python3.7/site-packages/tornado/test
  356. copying build/lib.linux-x86_64-3.7/tornado/test/test.crt -> /home/mgr/.cache/yay/python-tornado-4.4/src/tornado-4.4.3/tmp_install/usr/lib/python3.7/site-packages/tornado/test
  357. copying build/lib.linux-x86_64-3.7/tornado/test/wsgi_test.py -> /home/mgr/.cache/yay/python-tornado-4.4/src/tornado-4.4.3/tmp_install/usr/lib/python3.7/site-packages/tornado/test
  358. creating /home/mgr/.cache/yay/python-tornado-4.4/src/tornado-4.4.3/tmp_install/usr/lib/python3.7/site-packages/tornado/test/static
  359. copying build/lib.linux-x86_64-3.7/tornado/test/static/sample.xml.bz2 -> /home/mgr/.cache/yay/python-tornado-4.4/src/tornado-4.4.3/tmp_install/usr/lib/python3.7/site-packages/tornado/test/static
  360. copying build/lib.linux-x86_64-3.7/tornado/test/static/robots.txt -> /home/mgr/.cache/yay/python-tornado-4.4/src/tornado-4.4.3/tmp_install/usr/lib/python3.7/site-packages/tornado/test/static
  361. copying build/lib.linux-x86_64-3.7/tornado/test/static/sample.xml -> /home/mgr/.cache/yay/python-tornado-4.4/src/tornado-4.4.3/tmp_install/usr/lib/python3.7/site-packages/tornado/test/static
  362. creating /home/mgr/.cache/yay/python-tornado-4.4/src/tornado-4.4.3/tmp_install/usr/lib/python3.7/site-packages/tornado/test/static/dir
  363. copying build/lib.linux-x86_64-3.7/tornado/test/static/dir/index.html -> /home/mgr/.cache/yay/python-tornado-4.4/src/tornado-4.4.3/tmp_install/usr/lib/python3.7/site-packages/tornado/test/static/dir
  364. copying build/lib.linux-x86_64-3.7/tornado/test/static/sample.xml.gz -> /home/mgr/.cache/yay/python-tornado-4.4/src/tornado-4.4.3/tmp_install/usr/lib/python3.7/site-packages/tornado/test/static
  365. copying build/lib.linux-x86_64-3.7/tornado/test/template_test.py -> /home/mgr/.cache/yay/python-tornado-4.4/src/tornado-4.4.3/tmp_install/usr/lib/python3.7/site-packages/tornado/test
  366. copying build/lib.linux-x86_64-3.7/tornado/test/process_test.py -> /home/mgr/.cache/yay/python-tornado-4.4/src/tornado-4.4.3/tmp_install/usr/lib/python3.7/site-packages/tornado/test
  367. copying build/lib.linux-x86_64-3.7/tornado/test/iostream_test.py -> /home/mgr/.cache/yay/python-tornado-4.4/src/tornado-4.4.3/tmp_install/usr/lib/python3.7/site-packages/tornado/test
  368. copying build/lib.linux-x86_64-3.7/tornado/test/windows_test.py -> /home/mgr/.cache/yay/python-tornado-4.4/src/tornado-4.4.3/tmp_install/usr/lib/python3.7/site-packages/tornado/test
  369. copying build/lib.linux-x86_64-3.7/tornado/test/stack_context_test.py -> /home/mgr/.cache/yay/python-tornado-4.4/src/tornado-4.4.3/tmp_install/usr/lib/python3.7/site-packages/tornado/test
  370. copying build/lib.linux-x86_64-3.7/tornado/test/httpclient_test.py -> /home/mgr/.cache/yay/python-tornado-4.4/src/tornado-4.4.3/tmp_install/usr/lib/python3.7/site-packages/tornado/test
  371. copying build/lib.linux-x86_64-3.7/tornado/test/log_test.py -> /home/mgr/.cache/yay/python-tornado-4.4/src/tornado-4.4.3/tmp_install/usr/lib/python3.7/site-packages/tornado/test
  372. copying build/lib.linux-x86_64-3.7/tornado/test/web_test.py -> /home/mgr/.cache/yay/python-tornado-4.4/src/tornado-4.4.3/tmp_install/usr/lib/python3.7/site-packages/tornado/test
  373. creating /home/mgr/.cache/yay/python-tornado-4.4/src/tornado-4.4.3/tmp_install/usr/lib/python3.7/site-packages/tornado/test/gettext_translations
  374. creating /home/mgr/.cache/yay/python-tornado-4.4/src/tornado-4.4.3/tmp_install/usr/lib/python3.7/site-packages/tornado/test/gettext_translations/fr_FR
  375. creating /home/mgr/.cache/yay/python-tornado-4.4/src/tornado-4.4.3/tmp_install/usr/lib/python3.7/site-packages/tornado/test/gettext_translations/fr_FR/LC_MESSAGES
  376. copying build/lib.linux-x86_64-3.7/tornado/test/gettext_translations/fr_FR/LC_MESSAGES/tornado_test.po -> /home/mgr/.cache/yay/python-tornado-4.4/src/tornado-4.4.3/tmp_install/usr/lib/python3.7/site-packages/tornado/test/gettext_translations/fr_FR/LC_MESSAGES
  377. copying build/lib.linux-x86_64-3.7/tornado/test/gettext_translations/fr_FR/LC_MESSAGES/tornado_test.mo -> /home/mgr/.cache/yay/python-tornado-4.4/src/tornado-4.4.3/tmp_install/usr/lib/python3.7/site-packages/tornado/test/gettext_translations/fr_FR/LC_MESSAGES
  378. copying build/lib.linux-x86_64-3.7/tornado/test/resolve_test_helper.py -> /home/mgr/.cache/yay/python-tornado-4.4/src/tornado-4.4.3/tmp_install/usr/lib/python3.7/site-packages/tornado/test
  379. copying build/lib.linux-x86_64-3.7/tornado/test/runtests.py -> /home/mgr/.cache/yay/python-tornado-4.4/src/tornado-4.4.3/tmp_install/usr/lib/python3.7/site-packages/tornado/test
  380. copying build/lib.linux-x86_64-3.7/tornado/test/httputil_test.py -> /home/mgr/.cache/yay/python-tornado-4.4/src/tornado-4.4.3/tmp_install/usr/lib/python3.7/site-packages/tornado/test
  381. copying build/lib.linux-x86_64-3.7/tornado/test/locks_test.py -> /home/mgr/.cache/yay/python-tornado-4.4/src/tornado-4.4.3/tmp_install/usr/lib/python3.7/site-packages/tornado/test
  382. copying build/lib.linux-x86_64-3.7/tornado/gen.py -> /home/mgr/.cache/yay/python-tornado-4.4/src/tornado-4.4.3/tmp_install/usr/lib/python3.7/site-packages/tornado
  383. copying build/lib.linux-x86_64-3.7/tornado/autoreload.py -> /home/mgr/.cache/yay/python-tornado-4.4/src/tornado-4.4.3/tmp_install/usr/lib/python3.7/site-packages/tornado
  384. copying build/lib.linux-x86_64-3.7/tornado/_locale_data.py -> /home/mgr/.cache/yay/python-tornado-4.4/src/tornado-4.4.3/tmp_install/usr/lib/python3.7/site-packages/tornado
  385. copying build/lib.linux-x86_64-3.7/tornado/http1connection.py -> /home/mgr/.cache/yay/python-tornado-4.4/src/tornado-4.4.3/tmp_install/usr/lib/python3.7/site-packages/tornado
  386. copying build/lib.linux-x86_64-3.7/tornado/options.py -> /home/mgr/.cache/yay/python-tornado-4.4/src/tornado-4.4.3/tmp_install/usr/lib/python3.7/site-packages/tornado
  387. copying build/lib.linux-x86_64-3.7/tornado/log.py -> /home/mgr/.cache/yay/python-tornado-4.4/src/tornado-4.4.3/tmp_install/usr/lib/python3.7/site-packages/tornado
  388. copying build/lib.linux-x86_64-3.7/tornado/locale.py -> /home/mgr/.cache/yay/python-tornado-4.4/src/tornado-4.4.3/tmp_install/usr/lib/python3.7/site-packages/tornado
  389. copying build/lib.linux-x86_64-3.7/tornado/httpserver.py -> /home/mgr/.cache/yay/python-tornado-4.4/src/tornado-4.4.3/tmp_install/usr/lib/python3.7/site-packages/tornado
  390. copying build/lib.linux-x86_64-3.7/tornado/concurrent.py -> /home/mgr/.cache/yay/python-tornado-4.4/src/tornado-4.4.3/tmp_install/usr/lib/python3.7/site-packages/tornado
  391. copying build/lib.linux-x86_64-3.7/tornado/curl_httpclient.py -> /home/mgr/.cache/yay/python-tornado-4.4/src/tornado-4.4.3/tmp_install/usr/lib/python3.7/site-packages/tornado
  392. copying build/lib.linux-x86_64-3.7/tornado/locks.py -> /home/mgr/.cache/yay/python-tornado-4.4/src/tornado-4.4.3/tmp_install/usr/lib/python3.7/site-packages/tornado
  393. copying build/lib.linux-x86_64-3.7/tornado/websocket.py -> /home/mgr/.cache/yay/python-tornado-4.4/src/tornado-4.4.3/tmp_install/usr/lib/python3.7/site-packages/tornado
  394. byte-compiling /home/mgr/.cache/yay/python-tornado-4.4/src/tornado-4.4.3/tmp_install/usr/lib/python3.7/site-packages/tornado/stack_context.py to stack_context.cpython-37.pyc
  395. byte-compiling /home/mgr/.cache/yay/python-tornado-4.4/src/tornado-4.4.3/tmp_install/usr/lib/python3.7/site-packages/tornado/httpclient.py to httpclient.cpython-37.pyc
  396. byte-compiling /home/mgr/.cache/yay/python-tornado-4.4/src/tornado-4.4.3/tmp_install/usr/lib/python3.7/site-packages/tornado/auth.py to auth.cpython-37.pyc
  397. byte-compiling /home/mgr/.cache/yay/python-tornado-4.4/src/tornado-4.4.3/tmp_install/usr/lib/python3.7/site-packages/tornado/simple_httpclient.py to simple_httpclient.cpython-37.pyc
  398. byte-compiling /home/mgr/.cache/yay/python-tornado-4.4/src/tornado-4.4.3/tmp_install/usr/lib/python3.7/site-packages/tornado/httputil.py to httputil.cpython-37.pyc
  399. byte-compiling /home/mgr/.cache/yay/python-tornado-4.4/src/tornado-4.4.3/tmp_install/usr/lib/python3.7/site-packages/tornado/ioloop.py to ioloop.cpython-37.pyc
  400. byte-compiling /home/mgr/.cache/yay/python-tornado-4.4/src/tornado-4.4.3/tmp_install/usr/lib/python3.7/site-packages/tornado/iostream.py to iostream.cpython-37.pyc
  401. byte-compiling /home/mgr/.cache/yay/python-tornado-4.4/src/tornado-4.4.3/tmp_install/usr/lib/python3.7/site-packages/tornado/__init__.py to __init__.cpython-37.pyc
  402. byte-compiling /home/mgr/.cache/yay/python-tornado-4.4/src/tornado-4.4.3/tmp_install/usr/lib/python3.7/site-packages/tornado/queues.py to queues.cpython-37.pyc
  403. byte-compiling /home/mgr/.cache/yay/python-tornado-4.4/src/tornado-4.4.3/tmp_install/usr/lib/python3.7/site-packages/tornado/util.py to util.cpython-37.pyc
  404. byte-compiling /home/mgr/.cache/yay/python-tornado-4.4/src/tornado-4.4.3/tmp_install/usr/lib/python3.7/site-packages/tornado/escape.py to escape.cpython-37.pyc
  405. byte-compiling /home/mgr/.cache/yay/python-tornado-4.4/src/tornado-4.4.3/tmp_install/usr/lib/python3.7/site-packages/tornado/template.py to template.cpython-37.pyc
  406. byte-compiling /home/mgr/.cache/yay/python-tornado-4.4/src/tornado-4.4.3/tmp_install/usr/lib/python3.7/site-packages/tornado/wsgi.py to wsgi.cpython-37.pyc
  407. byte-compiling /home/mgr/.cache/yay/python-tornado-4.4/src/tornado-4.4.3/tmp_install/usr/lib/python3.7/site-packages/tornado/testing.py to testing.cpython-37.pyc
  408. byte-compiling /home/mgr/.cache/yay/python-tornado-4.4/src/tornado-4.4.3/tmp_install/usr/lib/python3.7/site-packages/tornado/process.py to process.cpython-37.pyc
  409. byte-compiling /home/mgr/.cache/yay/python-tornado-4.4/src/tornado-4.4.3/tmp_install/usr/lib/python3.7/site-packages/tornado/platform/select.py to select.cpython-37.pyc
  410. byte-compiling /home/mgr/.cache/yay/python-tornado-4.4/src/tornado-4.4.3/tmp_install/usr/lib/python3.7/site-packages/tornado/platform/kqueue.py to kqueue.cpython-37.pyc
  411. byte-compiling /home/mgr/.cache/yay/python-tornado-4.4/src/tornado-4.4.3/tmp_install/usr/lib/python3.7/site-packages/tornado/platform/auto.py to auto.cpython-37.pyc
  412. byte-compiling /home/mgr/.cache/yay/python-tornado-4.4/src/tornado-4.4.3/tmp_install/usr/lib/python3.7/site-packages/tornado/platform/__init__.py to __init__.cpython-37.pyc
  413. byte-compiling /home/mgr/.cache/yay/python-tornado-4.4/src/tornado-4.4.3/tmp_install/usr/lib/python3.7/site-packages/tornado/platform/interface.py to interface.cpython-37.pyc
  414. byte-compiling /home/mgr/.cache/yay/python-tornado-4.4/src/tornado-4.4.3/tmp_install/usr/lib/python3.7/site-packages/tornado/platform/twisted.py to twisted.cpython-37.pyc
  415. byte-compiling /home/mgr/.cache/yay/python-tornado-4.4/src/tornado-4.4.3/tmp_install/usr/lib/python3.7/site-packages/tornado/platform/epoll.py to epoll.cpython-37.pyc
  416. byte-compiling /home/mgr/.cache/yay/python-tornado-4.4/src/tornado-4.4.3/tmp_install/usr/lib/python3.7/site-packages/tornado/platform/common.py to common.cpython-37.pyc
  417. byte-compiling /home/mgr/.cache/yay/python-tornado-4.4/src/tornado-4.4.3/tmp_install/usr/lib/python3.7/site-packages/tornado/platform/asyncio.py to asyncio.cpython-37.pyc
  418. byte-compiling /home/mgr/.cache/yay/python-tornado-4.4/src/tornado-4.4.3/tmp_install/usr/lib/python3.7/site-packages/tornado/platform/caresresolver.py to caresresolver.cpython-37.pyc
  419. byte-compiling /home/mgr/.cache/yay/python-tornado-4.4/src/tornado-4.4.3/tmp_install/usr/lib/python3.7/site-packages/tornado/platform/windows.py to windows.cpython-37.pyc
  420. byte-compiling /home/mgr/.cache/yay/python-tornado-4.4/src/tornado-4.4.3/tmp_install/usr/lib/python3.7/site-packages/tornado/platform/posix.py to posix.cpython-37.pyc
  421. byte-compiling /home/mgr/.cache/yay/python-tornado-4.4/src/tornado-4.4.3/tmp_install/usr/lib/python3.7/site-packages/tornado/web.py to web.cpython-37.pyc
  422. byte-compiling /home/mgr/.cache/yay/python-tornado-4.4/src/tornado-4.4.3/tmp_install/usr/lib/python3.7/site-packages/tornado/tcpserver.py to tcpserver.cpython-37.pyc
  423. byte-compiling /home/mgr/.cache/yay/python-tornado-4.4/src/tornado-4.4.3/tmp_install/usr/lib/python3.7/site-packages/tornado/netutil.py to netutil.cpython-37.pyc
  424. byte-compiling /home/mgr/.cache/yay/python-tornado-4.4/src/tornado-4.4.3/tmp_install/usr/lib/python3.7/site-packages/tornado/tcpclient.py to tcpclient.cpython-37.pyc
  425. byte-compiling /home/mgr/.cache/yay/python-tornado-4.4/src/tornado-4.4.3/tmp_install/usr/lib/python3.7/site-packages/tornado/test/escape_test.py to escape_test.cpython-37.pyc
  426. byte-compiling /home/mgr/.cache/yay/python-tornado-4.4/src/tornado-4.4.3/tmp_install/usr/lib/python3.7/site-packages/tornado/test/tcpserver_test.py to tcpserver_test.cpython-37.pyc
  427. byte-compiling /home/mgr/.cache/yay/python-tornado-4.4/src/tornado-4.4.3/tmp_install/usr/lib/python3.7/site-packages/tornado/test/auth_test.py to auth_test.cpython-37.pyc
  428. byte-compiling /home/mgr/.cache/yay/python-tornado-4.4/src/tornado-4.4.3/tmp_install/usr/lib/python3.7/site-packages/tornado/test/twisted_test.py to twisted_test.cpython-37.pyc
  429. byte-compiling /home/mgr/.cache/yay/python-tornado-4.4/src/tornado-4.4.3/tmp_install/usr/lib/python3.7/site-packages/tornado/test/tcpclient_test.py to tcpclient_test.cpython-37.pyc
  430. byte-compiling /home/mgr/.cache/yay/python-tornado-4.4/src/tornado-4.4.3/tmp_install/usr/lib/python3.7/site-packages/tornado/test/import_test.py to import_test.cpython-37.pyc
  431. byte-compiling /home/mgr/.cache/yay/python-tornado-4.4/src/tornado-4.4.3/tmp_install/usr/lib/python3.7/site-packages/tornado/test/queues_test.py to queues_test.cpython-37.pyc
  432. byte-compiling /home/mgr/.cache/yay/python-tornado-4.4/src/tornado-4.4.3/tmp_install/usr/lib/python3.7/site-packages/tornado/test/curl_httpclient_test.py to curl_httpclient_test.cpython-37.pyc
  433. byte-compiling /home/mgr/.cache/yay/python-tornado-4.4/src/tornado-4.4.3/tmp_install/usr/lib/python3.7/site-packages/tornado/test/options_test.py to options_test.cpython-37.pyc
  434. byte-compiling /home/mgr/.cache/yay/python-tornado-4.4/src/tornado-4.4.3/tmp_install/usr/lib/python3.7/site-packages/tornado/test/ioloop_test.py to ioloop_test.cpython-37.pyc
  435. byte-compiling /home/mgr/.cache/yay/python-tornado-4.4/src/tornado-4.4.3/tmp_install/usr/lib/python3.7/site-packages/tornado/test/concurrent_test.py to concurrent_test.cpython-37.pyc
  436. byte-compiling /home/mgr/.cache/yay/python-tornado-4.4/src/tornado-4.4.3/tmp_install/usr/lib/python3.7/site-packages/tornado/test/__init__.py to __init__.cpython-37.pyc
  437. byte-compiling /home/mgr/.cache/yay/python-tornado-4.4/src/tornado-4.4.3/tmp_install/usr/lib/python3.7/site-packages/tornado/test/util.py to util.cpython-37.pyc
  438. byte-compiling /home/mgr/.cache/yay/python-tornado-4.4/src/tornado-4.4.3/tmp_install/usr/lib/python3.7/site-packages/tornado/test/testing_test.py to testing_test.cpython-37.pyc
  439. byte-compiling /home/mgr/.cache/yay/python-tornado-4.4/src/tornado-4.4.3/tmp_install/usr/lib/python3.7/site-packages/tornado/test/asyncio_test.py to asyncio_test.cpython-37.pyc
  440. byte-compiling /home/mgr/.cache/yay/python-tornado-4.4/src/tornado-4.4.3/tmp_install/usr/lib/python3.7/site-packages/tornado/test/netutil_test.py to netutil_test.cpython-37.pyc
  441. byte-compiling /home/mgr/.cache/yay/python-tornado-4.4/src/tornado-4.4.3/tmp_install/usr/lib/python3.7/site-packages/tornado/test/httpserver_test.py to httpserver_test.cpython-37.pyc
  442. byte-compiling /home/mgr/.cache/yay/python-tornado-4.4/src/tornado-4.4.3/tmp_install/usr/lib/python3.7/site-packages/tornado/test/websocket_test.py to websocket_test.cpython-37.pyc
  443. byte-compiling /home/mgr/.cache/yay/python-tornado-4.4/src/tornado-4.4.3/tmp_install/usr/lib/python3.7/site-packages/tornado/test/simple_httpclient_test.py to simple_httpclient_test.cpython-37.pyc
  444. byte-compiling /home/mgr/.cache/yay/python-tornado-4.4/src/tornado-4.4.3/tmp_install/usr/lib/python3.7/site-packages/tornado/test/__main__.py to __main__.cpython-37.pyc
  445. byte-compiling /home/mgr/.cache/yay/python-tornado-4.4/src/tornado-4.4.3/tmp_install/usr/lib/python3.7/site-packages/tornado/test/locale_test.py to locale_test.cpython-37.pyc
  446. byte-compiling /home/mgr/.cache/yay/python-tornado-4.4/src/tornado-4.4.3/tmp_install/usr/lib/python3.7/site-packages/tornado/test/util_test.py to util_test.cpython-37.pyc
  447. byte-compiling /home/mgr/.cache/yay/python-tornado-4.4/src/tornado-4.4.3/tmp_install/usr/lib/python3.7/site-packages/tornado/test/http1connection_test.py to http1connection_test.cpython-37.pyc
  448. byte-compiling /home/mgr/.cache/yay/python-tornado-4.4/src/tornado-4.4.3/tmp_install/usr/lib/python3.7/site-packages/tornado/test/gen_test.py to gen_test.cpython-37.pyc
  449. byte-compiling /home/mgr/.cache/yay/python-tornado-4.4/src/tornado-4.4.3/tmp_install/usr/lib/python3.7/site-packages/tornado/test/wsgi_test.py to wsgi_test.cpython-37.pyc
  450. byte-compiling /home/mgr/.cache/yay/python-tornado-4.4/src/tornado-4.4.3/tmp_install/usr/lib/python3.7/site-packages/tornado/test/template_test.py to template_test.cpython-37.pyc
  451. byte-compiling /home/mgr/.cache/yay/python-tornado-4.4/src/tornado-4.4.3/tmp_install/usr/lib/python3.7/site-packages/tornado/test/process_test.py to process_test.cpython-37.pyc
  452. byte-compiling /home/mgr/.cache/yay/python-tornado-4.4/src/tornado-4.4.3/tmp_install/usr/lib/python3.7/site-packages/tornado/test/iostream_test.py to iostream_test.cpython-37.pyc
  453. byte-compiling /home/mgr/.cache/yay/python-tornado-4.4/src/tornado-4.4.3/tmp_install/usr/lib/python3.7/site-packages/tornado/test/windows_test.py to windows_test.cpython-37.pyc
  454. byte-compiling /home/mgr/.cache/yay/python-tornado-4.4/src/tornado-4.4.3/tmp_install/usr/lib/python3.7/site-packages/tornado/test/stack_context_test.py to stack_context_test.cpython-37.pyc
  455. byte-compiling /home/mgr/.cache/yay/python-tornado-4.4/src/tornado-4.4.3/tmp_install/usr/lib/python3.7/site-packages/tornado/test/httpclient_test.py to httpclient_test.cpython-37.pyc
  456. byte-compiling /home/mgr/.cache/yay/python-tornado-4.4/src/tornado-4.4.3/tmp_install/usr/lib/python3.7/site-packages/tornado/test/log_test.py to log_test.cpython-37.pyc
  457. byte-compiling /home/mgr/.cache/yay/python-tornado-4.4/src/tornado-4.4.3/tmp_install/usr/lib/python3.7/site-packages/tornado/test/web_test.py to web_test.cpython-37.pyc
  458. byte-compiling /home/mgr/.cache/yay/python-tornado-4.4/src/tornado-4.4.3/tmp_install/usr/lib/python3.7/site-packages/tornado/test/resolve_test_helper.py to resolve_test_helper.cpython-37.pyc
  459. byte-compiling /home/mgr/.cache/yay/python-tornado-4.4/src/tornado-4.4.3/tmp_install/usr/lib/python3.7/site-packages/tornado/test/runtests.py to runtests.cpython-37.pyc
  460. byte-compiling /home/mgr/.cache/yay/python-tornado-4.4/src/tornado-4.4.3/tmp_install/usr/lib/python3.7/site-packages/tornado/test/httputil_test.py to httputil_test.cpython-37.pyc
  461. byte-compiling /home/mgr/.cache/yay/python-tornado-4.4/src/tornado-4.4.3/tmp_install/usr/lib/python3.7/site-packages/tornado/test/locks_test.py to locks_test.cpython-37.pyc
  462. byte-compiling /home/mgr/.cache/yay/python-tornado-4.4/src/tornado-4.4.3/tmp_install/usr/lib/python3.7/site-packages/tornado/gen.py to gen.cpython-37.pyc
  463. byte-compiling /home/mgr/.cache/yay/python-tornado-4.4/src/tornado-4.4.3/tmp_install/usr/lib/python3.7/site-packages/tornado/autoreload.py to autoreload.cpython-37.pyc
  464. byte-compiling /home/mgr/.cache/yay/python-tornado-4.4/src/tornado-4.4.3/tmp_install/usr/lib/python3.7/site-packages/tornado/_locale_data.py to _locale_data.cpython-37.pyc
  465. byte-compiling /home/mgr/.cache/yay/python-tornado-4.4/src/tornado-4.4.3/tmp_install/usr/lib/python3.7/site-packages/tornado/http1connection.py to http1connection.cpython-37.pyc
  466. byte-compiling /home/mgr/.cache/yay/python-tornado-4.4/src/tornado-4.4.3/tmp_install/usr/lib/python3.7/site-packages/tornado/options.py to options.cpython-37.pyc
  467. byte-compiling /home/mgr/.cache/yay/python-tornado-4.4/src/tornado-4.4.3/tmp_install/usr/lib/python3.7/site-packages/tornado/log.py to log.cpython-37.pyc
  468. byte-compiling /home/mgr/.cache/yay/python-tornado-4.4/src/tornado-4.4.3/tmp_install/usr/lib/python3.7/site-packages/tornado/locale.py to locale.cpython-37.pyc
  469. byte-compiling /home/mgr/.cache/yay/python-tornado-4.4/src/tornado-4.4.3/tmp_install/usr/lib/python3.7/site-packages/tornado/httpserver.py to httpserver.cpython-37.pyc
  470. byte-compiling /home/mgr/.cache/yay/python-tornado-4.4/src/tornado-4.4.3/tmp_install/usr/lib/python3.7/site-packages/tornado/concurrent.py to concurrent.cpython-37.pyc
  471. byte-compiling /home/mgr/.cache/yay/python-tornado-4.4/src/tornado-4.4.3/tmp_install/usr/lib/python3.7/site-packages/tornado/curl_httpclient.py to curl_httpclient.cpython-37.pyc
  472. byte-compiling /home/mgr/.cache/yay/python-tornado-4.4/src/tornado-4.4.3/tmp_install/usr/lib/python3.7/site-packages/tornado/locks.py to locks.cpython-37.pyc
  473. byte-compiling /home/mgr/.cache/yay/python-tornado-4.4/src/tornado-4.4.3/tmp_install/usr/lib/python3.7/site-packages/tornado/websocket.py to websocket.cpython-37.pyc
  474. writing byte-compilation script '/tmp/tmpk_t9dk18.py'
  475. /usr/bin/python /tmp/tmpk_t9dk18.py
  476.   File "/usr/lib/python3.7/site-packages/tornado/test/asyncio_test.py", line 45
  477.     x = yield asyncio.async(
  478.                           ^
  479. SyntaxError: invalid syntax
  480.  
  481. removing /tmp/tmpk_t9dk18.py
  482. running install_egg_info
  483. running egg_info
  484. creating tornado.egg-info
  485. writing tornado.egg-info/PKG-INFO
  486. writing dependency_links to tornado.egg-info/dependency_links.txt
  487. writing top-level names to tornado.egg-info/top_level.txt
  488. writing manifest file 'tornado.egg-info/SOURCES.txt'
  489. reading manifest file 'tornado.egg-info/SOURCES.txt'
  490. reading manifest template 'MANIFEST.in'
  491.   File "/usr/lib/python3.7/site-packages/tornado/test/asyncio_test.py", line 45
  492.     x = yield asyncio.async(
  493.                           ^
  494. SyntaxError: invalid syntax
  495.  
  496. no previously-included directories found matching 'docs/build'
  497. warning: no files found matching 'tornado/test/README'
  498. writing manifest file 'tornado.egg-info/SOURCES.txt'
  499. Copying tornado.egg-info to /home/mgr/.cache/yay/python-tornado-4.4/src/tornado-4.4.3/tmp_install/usr/lib/python3.7/site-packages/tornado-4.4.3-py3.7.egg-info
  500. running install_scripts
  501. Traceback (most recent call last):
  502.   File "/usr/lib/python3.7/site-packages/twisted/internet/_sslverify.py", line 141, in _selectVerifyImplementation
  503.     from service_identity import VerificationError
  504. ModuleNotFoundError: No module named 'service_identity'
  505.  
  506. During handling of the above exception, another exception occurred:
  507.  
  508. Traceback (most recent call last):
  509.   File "/usr/lib/python3.7/runpy.py", line 193, in _run_module_as_main
  510.     "__main__", mod_spec)
  511.   File "/usr/lib/python3.7/runpy.py", line 85, in _run_code
  512.     exec(code, run_globals)
  513.   File "/usr/lib/python3.7/site-packages/tornado/test/runtests.py", line 219, in <module>
  514.     main()
  515.   File "/usr/lib/python3.7/site-packages/tornado/test/runtests.py", line 204, in main
  516.     tornado.testing.main(**kwargs)
  517.   File "/usr/lib/python3.7/site-packages/tornado/testing.py", line 720, in main
  518.     unittest.main(defaultTest="all", argv=argv, **kwargs)
  519.   File "/usr/lib/python3.7/unittest/main.py", line 100, in __init__
  520.     self.parseArgs(argv)
  521.   File "/usr/lib/python3.7/unittest/main.py", line 147, in parseArgs
  522.     self.createTests()
  523.   File "/usr/lib/python3.7/unittest/main.py", line 159, in createTests
  524.     self.module)
  525.   File "/usr/lib/python3.7/unittest/loader.py", line 220, in loadTestsFromNames
  526.     suites = [self.loadTestsFromName(name, module) for name in names]
  527.   File "/usr/lib/python3.7/unittest/loader.py", line 220, in <listcomp>
  528.     suites = [self.loadTestsFromName(name, module) for name in names]
  529.   File "/usr/lib/python3.7/unittest/loader.py", line 205, in loadTestsFromName
  530.     test = obj()
  531.   File "/usr/lib/python3.7/site-packages/tornado/test/runtests.py", line 65, in all
  532.     return unittest.defaultTestLoader.loadTestsFromNames(TEST_MODULES)
  533.   File "/usr/lib/python3.7/unittest/loader.py", line 220, in loadTestsFromNames
  534.     suites = [self.loadTestsFromName(name, module) for name in names]
  535.   File "/usr/lib/python3.7/unittest/loader.py", line 220, in <listcomp>
  536.     suites = [self.loadTestsFromName(name, module) for name in names]
  537.   File "/usr/lib/python3.7/unittest/loader.py", line 154, in loadTestsFromName
  538.     module = __import__(module_name)
  539.   File "/usr/lib/python3.7/site-packages/tornado/test/netutil_test.py", line 36, in <module>
  540.     from tornado.platform.twisted import TwistedResolver
  541.   File "/usr/lib/python3.7/site-packages/tornado/platform/twisted.py", line 34, in <module>
  542.     from twisted.internet.posixbase import PosixReactorBase  # type: ignore
  543.   File "/usr/lib/python3.7/site-packages/twisted/internet/posixbase.py", line 18, in <module>
  544.     from twisted.internet import error, udp, tcp
  545.   File "/usr/lib/python3.7/site-packages/twisted/internet/tcp.py", line 31, in <module>
  546.     from twisted.internet._newtls import (
  547.   File "/usr/lib/python3.7/site-packages/twisted/internet/_newtls.py", line 21, in <module>
  548.     from twisted.protocols.tls import TLSMemoryBIOFactory, TLSMemoryBIOProtocol
  549.   File "/usr/lib/python3.7/site-packages/twisted/protocols/tls.py", line 63, in <module>
  550.     from twisted.internet._sslverify import _setAcceptableProtocols
  551.   File "/usr/lib/python3.7/site-packages/twisted/internet/_sslverify.py", line 158, in <module>
  552.     verifyHostname, VerificationError = _selectVerifyImplementation()
  553.   File "/usr/lib/python3.7/site-packages/twisted/internet/_sslverify.py", line 153, in _selectVerifyImplementation
  554.     category=UserWarning, filename="", lineno=0)
  555. UserWarning: You do not have a working installation of the service_identity module: 'No module named 'service_identity''.  Please install it from <https://pypi.python.org/pypi/service_identity> and make sure all of its dependencies are satisfied.  Without the service_identity module, Twisted can perform only rudimentary TLS client hostname verification.  Many valid certificate/hostname mappings may be rejected.
  556. Traceback (most recent call last):
  557.   File "/usr/lib/python3.7/runpy.py", line 193, in _run_module_as_main
  558.     "__main__", mod_spec)
  559.   File "/usr/lib/python3.7/runpy.py", line 85, in _run_code
  560.     exec(code, run_globals)
  561.   File "/usr/lib/python3.7/site-packages/tornado/test/runtests.py", line 219, in <module>
  562.     main()
  563.   File "/usr/lib/python3.7/site-packages/tornado/test/runtests.py", line 204, in main
  564.     tornado.testing.main(**kwargs)
  565.   File "/usr/lib/python3.7/site-packages/tornado/testing.py", line 692, in main
  566.     argv = [sys.argv[0]] + parse_command_line(sys.argv)
  567.   File "/usr/lib/python3.7/site-packages/tornado/options.py", line 626, in parse_command_line
  568.     return options.parse_command_line(args, final=final)
  569.   File "/usr/lib/python3.7/site-packages/tornado/options.py", line 316, in parse_command_line
  570.     self.run_parse_callbacks()
  571.   File "/usr/lib/python3.7/site-packages/tornado/options.py", line 428, in run_parse_callbacks
  572.     callback()
  573.   File "/usr/lib/python3.7/site-packages/tornado/stack_context.py", line 300, in null_wrapper
  574.     return fn(*args, **kwargs)
  575.   File "/usr/lib/python3.7/site-packages/tornado/test/runtests.py", line 180, in configure_ioloop
  576.     IOLoop.configure(options.ioloop, **kwargs)
  577.   File "/usr/lib/python3.7/site-packages/tornado/ioloop.py", line 198, in configure
  578.     "only AsyncIOLoop is allowed when asyncio is available")
  579. RuntimeError: only AsyncIOLoop is allowed when asyncio is available
  580. Traceback (most recent call last):
  581.   File "/usr/lib/python3.7/site-packages/twisted/internet/_sslverify.py", line 141, in _selectVerifyImplementation
  582.     from service_identity import VerificationError
  583. ModuleNotFoundError: No module named 'service_identity'
  584.  
  585. During handling of the above exception, another exception occurred:
  586.  
  587. Traceback (most recent call last):
  588.   File "/usr/lib/python3.7/runpy.py", line 193, in _run_module_as_main
  589.     "__main__", mod_spec)
  590.   File "/usr/lib/python3.7/runpy.py", line 85, in _run_code
  591.     exec(code, run_globals)
  592.   File "/usr/lib/python3.7/site-packages/tornado/test/runtests.py", line 219, in <module>
  593.     main()
  594.   File "/usr/lib/python3.7/site-packages/tornado/test/runtests.py", line 204, in main
  595.     tornado.testing.main(**kwargs)
  596.   File "/usr/lib/python3.7/site-packages/tornado/testing.py", line 720, in main
  597.     unittest.main(defaultTest="all", argv=argv, **kwargs)
  598.   File "/usr/lib/python3.7/unittest/main.py", line 100, in __init__
  599.     self.parseArgs(argv)
  600.   File "/usr/lib/python3.7/unittest/main.py", line 147, in parseArgs
  601.     self.createTests()
  602.   File "/usr/lib/python3.7/unittest/main.py", line 159, in createTests
  603.     self.module)
  604.   File "/usr/lib/python3.7/unittest/loader.py", line 220, in loadTestsFromNames
  605.     suites = [self.loadTestsFromName(name, module) for name in names]
  606.   File "/usr/lib/python3.7/unittest/loader.py", line 220, in <listcomp>
  607.     suites = [self.loadTestsFromName(name, module) for name in names]
  608.   File "/usr/lib/python3.7/unittest/loader.py", line 205, in loadTestsFromName
  609.     test = obj()
  610.   File "/usr/lib/python3.7/site-packages/tornado/test/runtests.py", line 65, in all
  611.     return unittest.defaultTestLoader.loadTestsFromNames(TEST_MODULES)
  612.   File "/usr/lib/python3.7/unittest/loader.py", line 220, in loadTestsFromNames
  613.     suites = [self.loadTestsFromName(name, module) for name in names]
  614.   File "/usr/lib/python3.7/unittest/loader.py", line 220, in <listcomp>
  615.     suites = [self.loadTestsFromName(name, module) for name in names]
  616.   File "/usr/lib/python3.7/unittest/loader.py", line 154, in loadTestsFromName
  617.     module = __import__(module_name)
  618.   File "/usr/lib/python3.7/site-packages/tornado/test/netutil_test.py", line 36, in <module>
  619.     from tornado.platform.twisted import TwistedResolver
  620.   File "/usr/lib/python3.7/site-packages/tornado/platform/twisted.py", line 34, in <module>
  621.     from twisted.internet.posixbase import PosixReactorBase  # type: ignore
  622.   File "/usr/lib/python3.7/site-packages/twisted/internet/posixbase.py", line 18, in <module>
  623.     from twisted.internet import error, udp, tcp
  624.   File "/usr/lib/python3.7/site-packages/twisted/internet/tcp.py", line 31, in <module>
  625.     from twisted.internet._newtls import (
  626.   File "/usr/lib/python3.7/site-packages/twisted/internet/_newtls.py", line 21, in <module>
  627.     from twisted.protocols.tls import TLSMemoryBIOFactory, TLSMemoryBIOProtocol
  628.   File "/usr/lib/python3.7/site-packages/twisted/protocols/tls.py", line 63, in <module>
  629.     from twisted.internet._sslverify import _setAcceptableProtocols
  630.   File "/usr/lib/python3.7/site-packages/twisted/internet/_sslverify.py", line 158, in <module>
  631.     verifyHostname, VerificationError = _selectVerifyImplementation()
  632.   File "/usr/lib/python3.7/site-packages/twisted/internet/_sslverify.py", line 153, in _selectVerifyImplementation
  633.     category=UserWarning, filename="", lineno=0)
  634. UserWarning: You do not have a working installation of the service_identity module: 'No module named 'service_identity''.  Please install it from <https://pypi.python.org/pypi/service_identity> and make sure all of its dependencies are satisfied.  Without the service_identity module, Twisted can perform only rudimentary TLS client hostname verification.  Many valid certificate/hostname mappings may be rejected.
  635. Traceback (most recent call last):
  636.   File "/usr/lib/python3.7/runpy.py", line 193, in _run_module_as_main
  637.     "__main__", mod_spec)
  638.   File "/usr/lib/python3.7/runpy.py", line 85, in _run_code
  639.     exec(code, run_globals)
  640.   File "/usr/lib/python3.7/site-packages/tornado/test/runtests.py", line 219, in <module>
  641.     main()
  642.   File "/usr/lib/python3.7/site-packages/tornado/test/runtests.py", line 204, in main
  643.     tornado.testing.main(**kwargs)
  644.   File "/usr/lib/python3.7/site-packages/tornado/testing.py", line 692, in main
  645.     argv = [sys.argv[0]] + parse_command_line(sys.argv)
  646.   File "/usr/lib/python3.7/site-packages/tornado/options.py", line 626, in parse_command_line
  647.     return options.parse_command_line(args, final=final)
  648.   File "/usr/lib/python3.7/site-packages/tornado/options.py", line 316, in parse_command_line
  649.     self.run_parse_callbacks()
  650.   File "/usr/lib/python3.7/site-packages/tornado/options.py", line 428, in run_parse_callbacks
  651.     callback()
  652.   File "/usr/lib/python3.7/site-packages/tornado/stack_context.py", line 300, in null_wrapper
  653.     return fn(*args, **kwargs)
  654.   File "/usr/lib/python3.7/site-packages/tornado/test/runtests.py", line 180, in configure_ioloop
  655.     IOLoop.configure(options.ioloop, **kwargs)
  656.   File "/usr/lib/python3.7/site-packages/tornado/ioloop.py", line 196, in configure
  657.     if not issubclass(impl, BaseAsyncIOLoop):
  658. TypeError: issubclass() arg 1 must be a class
  659. Traceback (most recent call last):
  660.   File "/usr/lib/python3.7/site-packages/twisted/internet/_sslverify.py", line 141, in _selectVerifyImplementation
  661.     from service_identity import VerificationError
  662. ModuleNotFoundError: No module named 'service_identity'
  663.  
  664. During handling of the above exception, another exception occurred:
  665.  
  666. Traceback (most recent call last):
  667.   File "/usr/lib/python3.7/runpy.py", line 193, in _run_module_as_main
  668.     "__main__", mod_spec)
  669.   File "/usr/lib/python3.7/runpy.py", line 85, in _run_code
  670.     exec(code, run_globals)
  671.   File "/usr/lib/python3.7/site-packages/tornado/test/runtests.py", line 219, in <module>
  672.     main()
  673.   File "/usr/lib/python3.7/site-packages/tornado/test/runtests.py", line 204, in main
  674.     tornado.testing.main(**kwargs)
  675.   File "/usr/lib/python3.7/site-packages/tornado/testing.py", line 692, in main
  676.     argv = [sys.argv[0]] + parse_command_line(sys.argv)
  677.   File "/usr/lib/python3.7/site-packages/tornado/options.py", line 626, in parse_command_line
  678.     return options.parse_command_line(args, final=final)
  679.   File "/usr/lib/python3.7/site-packages/tornado/options.py", line 316, in parse_command_line
  680.     self.run_parse_callbacks()
  681.   File "/usr/lib/python3.7/site-packages/tornado/options.py", line 428, in run_parse_callbacks
  682.     callback()
  683.   File "/usr/lib/python3.7/site-packages/tornado/stack_context.py", line 300, in null_wrapper
  684.     return fn(*args, **kwargs)
  685.   File "/usr/lib/python3.7/site-packages/tornado/test/runtests.py", line 180, in configure_ioloop
  686.     IOLoop.configure(options.ioloop, **kwargs)
  687.   File "/usr/lib/python3.7/site-packages/tornado/ioloop.py", line 195, in configure
  688.     impl = import_object(impl)
  689.   File "/usr/lib/python3.7/site-packages/tornado/util.py", line 181, in import_object
  690.     obj = __import__('.'.join(parts[:-1]), None, None, [parts[-1]], 0)
  691.   File "/usr/lib/python3.7/site-packages/tornado/platform/twisted.py", line 34, in <module>
  692.     from twisted.internet.posixbase import PosixReactorBase  # type: ignore
  693.   File "/usr/lib/python3.7/site-packages/twisted/internet/posixbase.py", line 18, in <module>
  694.     from twisted.internet import error, udp, tcp
  695.   File "/usr/lib/python3.7/site-packages/twisted/internet/tcp.py", line 31, in <module>
  696.     from twisted.internet._newtls import (
  697.   File "/usr/lib/python3.7/site-packages/twisted/internet/_newtls.py", line 21, in <module>
  698.     from twisted.protocols.tls import TLSMemoryBIOFactory, TLSMemoryBIOProtocol
  699.   File "/usr/lib/python3.7/site-packages/twisted/protocols/tls.py", line 63, in <module>
  700.     from twisted.internet._sslverify import _setAcceptableProtocols
  701.   File "/usr/lib/python3.7/site-packages/twisted/internet/_sslverify.py", line 158, in <module>
  702.     verifyHostname, VerificationError = _selectVerifyImplementation()
  703.   File "/usr/lib/python3.7/site-packages/twisted/internet/_sslverify.py", line 153, in _selectVerifyImplementation
  704.     category=UserWarning, filename="", lineno=0)
  705. UserWarning: You do not have a working installation of the service_identity module: 'No module named 'service_identity''.  Please install it from <https://pypi.python.org/pypi/service_identity> and make sure all of its dependencies are satisfied.  Without the service_identity module, Twisted can perform only rudimentary TLS client hostname verification.  Many valid certificate/hostname mappings may be rejected.
  706. Traceback (most recent call last):
  707.   File "/usr/lib/python3.7/site-packages/twisted/internet/_sslverify.py", line 141, in _selectVerifyImplementation
  708.     from service_identity import VerificationError
  709. ModuleNotFoundError: No module named 'service_identity'
  710.  
  711. During handling of the above exception, another exception occurred:
  712.  
  713. Traceback (most recent call last):
  714.   File "/usr/lib/python3.7/runpy.py", line 193, in _run_module_as_main
  715.     "__main__", mod_spec)
  716.   File "/usr/lib/python3.7/runpy.py", line 85, in _run_code
  717.     exec(code, run_globals)
  718.   File "/usr/lib/python3.7/site-packages/tornado/test/runtests.py", line 219, in <module>
  719.     main()
  720.   File "/usr/lib/python3.7/site-packages/tornado/test/runtests.py", line 204, in main
  721.     tornado.testing.main(**kwargs)
  722.   File "/usr/lib/python3.7/site-packages/tornado/testing.py", line 720, in main
  723.     unittest.main(defaultTest="all", argv=argv, **kwargs)
  724.   File "/usr/lib/python3.7/unittest/main.py", line 100, in __init__
  725.     self.parseArgs(argv)
  726.   File "/usr/lib/python3.7/unittest/main.py", line 147, in parseArgs
  727.     self.createTests()
  728.   File "/usr/lib/python3.7/unittest/main.py", line 159, in createTests
  729.     self.module)
  730.   File "/usr/lib/python3.7/unittest/loader.py", line 220, in loadTestsFromNames
  731.     suites = [self.loadTestsFromName(name, module) for name in names]
  732.   File "/usr/lib/python3.7/unittest/loader.py", line 220, in <listcomp>
  733.     suites = [self.loadTestsFromName(name, module) for name in names]
  734.   File "/usr/lib/python3.7/unittest/loader.py", line 205, in loadTestsFromName
  735.     test = obj()
  736.   File "/usr/lib/python3.7/site-packages/tornado/test/runtests.py", line 65, in all
  737.     return unittest.defaultTestLoader.loadTestsFromNames(TEST_MODULES)
  738.   File "/usr/lib/python3.7/unittest/loader.py", line 220, in loadTestsFromNames
  739.     suites = [self.loadTestsFromName(name, module) for name in names]
  740.   File "/usr/lib/python3.7/unittest/loader.py", line 220, in <listcomp>
  741.     suites = [self.loadTestsFromName(name, module) for name in names]
  742.   File "/usr/lib/python3.7/unittest/loader.py", line 154, in loadTestsFromName
  743.     module = __import__(module_name)
  744.   File "/usr/lib/python3.7/site-packages/tornado/test/netutil_test.py", line 36, in <module>
  745.     from tornado.platform.twisted import TwistedResolver
  746.   File "/usr/lib/python3.7/site-packages/tornado/platform/twisted.py", line 34, in <module>
  747.     from twisted.internet.posixbase import PosixReactorBase  # type: ignore
  748.   File "/usr/lib/python3.7/site-packages/twisted/internet/posixbase.py", line 18, in <module>
  749.     from twisted.internet import error, udp, tcp
  750.   File "/usr/lib/python3.7/site-packages/twisted/internet/tcp.py", line 31, in <module>
  751.     from twisted.internet._newtls import (
  752.   File "/usr/lib/python3.7/site-packages/twisted/internet/_newtls.py", line 21, in <module>
  753.     from twisted.protocols.tls import TLSMemoryBIOFactory, TLSMemoryBIOProtocol
  754.   File "/usr/lib/python3.7/site-packages/twisted/protocols/tls.py", line 63, in <module>
  755.     from twisted.internet._sslverify import _setAcceptableProtocols
  756.   File "/usr/lib/python3.7/site-packages/twisted/internet/_sslverify.py", line 158, in <module>
  757.     verifyHostname, VerificationError = _selectVerifyImplementation()
  758.   File "/usr/lib/python3.7/site-packages/twisted/internet/_sslverify.py", line 153, in _selectVerifyImplementation
  759.     category=UserWarning, filename="", lineno=0)
  760. UserWarning: You do not have a working installation of the service_identity module: 'No module named 'service_identity''.  Please install it from <https://pypi.python.org/pypi/service_identity> and make sure all of its dependencies are satisfied.  Without the service_identity module, Twisted can perform only rudimentary TLS client hostname verification.  Many valid certificate/hostname mappings may be rejected.
  761. Traceback (most recent call last):
  762.   File "/usr/lib/python3.7/site-packages/twisted/internet/_sslverify.py", line 141, in _selectVerifyImplementation
  763.     from service_identity import VerificationError
  764. ModuleNotFoundError: No module named 'service_identity'
  765.  
  766. During handling of the above exception, another exception occurred:
  767.  
  768. Traceback (most recent call last):
  769.   File "/usr/lib/python3.7/runpy.py", line 193, in _run_module_as_main
  770.     "__main__", mod_spec)
  771.   File "/usr/lib/python3.7/runpy.py", line 85, in _run_code
  772.     exec(code, run_globals)
  773.   File "/usr/lib/python3.7/site-packages/tornado/test/runtests.py", line 219, in <module>
  774.     main()
  775.   File "/usr/lib/python3.7/site-packages/tornado/test/runtests.py", line 204, in main
  776.     tornado.testing.main(**kwargs)
  777.   File "/usr/lib/python3.7/site-packages/tornado/testing.py", line 720, in main
  778.     unittest.main(defaultTest="all", argv=argv, **kwargs)
  779.   File "/usr/lib/python3.7/unittest/main.py", line 100, in __init__
  780.     self.parseArgs(argv)
  781.   File "/usr/lib/python3.7/unittest/main.py", line 147, in parseArgs
  782.     self.createTests()
  783.   File "/usr/lib/python3.7/unittest/main.py", line 159, in createTests
  784.     self.module)
  785.   File "/usr/lib/python3.7/unittest/loader.py", line 220, in loadTestsFromNames
  786.     suites = [self.loadTestsFromName(name, module) for name in names]
  787.   File "/usr/lib/python3.7/unittest/loader.py", line 220, in <listcomp>
  788.     suites = [self.loadTestsFromName(name, module) for name in names]
  789.   File "/usr/lib/python3.7/unittest/loader.py", line 205, in loadTestsFromName
  790.     test = obj()
  791.   File "/usr/lib/python3.7/site-packages/tornado/test/runtests.py", line 65, in all
  792.     return unittest.defaultTestLoader.loadTestsFromNames(TEST_MODULES)
  793.   File "/usr/lib/python3.7/unittest/loader.py", line 220, in loadTestsFromNames
  794.     suites = [self.loadTestsFromName(name, module) for name in names]
  795.   File "/usr/lib/python3.7/unittest/loader.py", line 220, in <listcomp>
  796.     suites = [self.loadTestsFromName(name, module) for name in names]
  797.   File "/usr/lib/python3.7/unittest/loader.py", line 154, in loadTestsFromName
  798.     module = __import__(module_name)
  799.   File "/usr/lib/python3.7/site-packages/tornado/test/netutil_test.py", line 36, in <module>
  800.     from tornado.platform.twisted import TwistedResolver
  801.   File "/usr/lib/python3.7/site-packages/tornado/platform/twisted.py", line 34, in <module>
  802.     from twisted.internet.posixbase import PosixReactorBase  # type: ignore
  803.   File "/usr/lib/python3.7/site-packages/twisted/internet/posixbase.py", line 18, in <module>
  804.     from twisted.internet import error, udp, tcp
  805.   File "/usr/lib/python3.7/site-packages/twisted/internet/tcp.py", line 31, in <module>
  806.     from twisted.internet._newtls import (
  807.   File "/usr/lib/python3.7/site-packages/twisted/internet/_newtls.py", line 21, in <module>
  808.     from twisted.protocols.tls import TLSMemoryBIOFactory, TLSMemoryBIOProtocol
  809.   File "/usr/lib/python3.7/site-packages/twisted/protocols/tls.py", line 63, in <module>
  810.     from twisted.internet._sslverify import _setAcceptableProtocols
  811.   File "/usr/lib/python3.7/site-packages/twisted/internet/_sslverify.py", line 158, in <module>
  812.     verifyHostname, VerificationError = _selectVerifyImplementation()
  813.   File "/usr/lib/python3.7/site-packages/twisted/internet/_sslverify.py", line 153, in _selectVerifyImplementation
  814.     category=UserWarning, filename="", lineno=0)
  815. UserWarning: You do not have a working installation of the service_identity module: 'No module named 'service_identity''.  Please install it from <https://pypi.python.org/pypi/service_identity> and make sure all of its dependencies are satisfied.  Without the service_identity module, Twisted can perform only rudimentary TLS client hostname verification.  Many valid certificate/hostname mappings may be rejected.
  816. ==> WARNING: Tests failed
  817. running install
  818. running build
  819. running build_py
  820. running build_ext
  821. running install_lib
  822. creating /home/mgr/.cache/yay/python-tornado-4.4/src/tornado-4.4.3-py2/tmp_install
  823. creating /home/mgr/.cache/yay/python-tornado-4.4/src/tornado-4.4.3-py2/tmp_install/usr
  824. creating /home/mgr/.cache/yay/python-tornado-4.4/src/tornado-4.4.3-py2/tmp_install/usr/lib
  825. creating /home/mgr/.cache/yay/python-tornado-4.4/src/tornado-4.4.3-py2/tmp_install/usr/lib/python2.7
  826. creating /home/mgr/.cache/yay/python-tornado-4.4/src/tornado-4.4.3-py2/tmp_install/usr/lib/python2.7/site-packages
  827. creating /home/mgr/.cache/yay/python-tornado-4.4/src/tornado-4.4.3-py2/tmp_install/usr/lib/python2.7/site-packages/tornado
  828. copying build/lib.linux-x86_64-2.7/tornado/stack_context.py -> /home/mgr/.cache/yay/python-tornado-4.4/src/tornado-4.4.3-py2/tmp_install/usr/lib/python2.7/site-packages/tornado
  829. copying build/lib.linux-x86_64-2.7/tornado/httpclient.py -> /home/mgr/.cache/yay/python-tornado-4.4/src/tornado-4.4.3-py2/tmp_install/usr/lib/python2.7/site-packages/tornado
  830. copying build/lib.linux-x86_64-2.7/tornado/auth.py -> /home/mgr/.cache/yay/python-tornado-4.4/src/tornado-4.4.3-py2/tmp_install/usr/lib/python2.7/site-packages/tornado
  831. copying build/lib.linux-x86_64-2.7/tornado/simple_httpclient.py -> /home/mgr/.cache/yay/python-tornado-4.4/src/tornado-4.4.3-py2/tmp_install/usr/lib/python2.7/site-packages/tornado
  832. copying build/lib.linux-x86_64-2.7/tornado/httputil.py -> /home/mgr/.cache/yay/python-tornado-4.4/src/tornado-4.4.3-py2/tmp_install/usr/lib/python2.7/site-packages/tornado
  833. copying build/lib.linux-x86_64-2.7/tornado/ioloop.py -> /home/mgr/.cache/yay/python-tornado-4.4/src/tornado-4.4.3-py2/tmp_install/usr/lib/python2.7/site-packages/tornado
  834. copying build/lib.linux-x86_64-2.7/tornado/iostream.py -> /home/mgr/.cache/yay/python-tornado-4.4/src/tornado-4.4.3-py2/tmp_install/usr/lib/python2.7/site-packages/tornado
  835. copying build/lib.linux-x86_64-2.7/tornado/__init__.py -> /home/mgr/.cache/yay/python-tornado-4.4/src/tornado-4.4.3-py2/tmp_install/usr/lib/python2.7/site-packages/tornado
  836. copying build/lib.linux-x86_64-2.7/tornado/queues.py -> /home/mgr/.cache/yay/python-tornado-4.4/src/tornado-4.4.3-py2/tmp_install/usr/lib/python2.7/site-packages/tornado
  837. copying build/lib.linux-x86_64-2.7/tornado/util.py -> /home/mgr/.cache/yay/python-tornado-4.4/src/tornado-4.4.3-py2/tmp_install/usr/lib/python2.7/site-packages/tornado
  838. copying build/lib.linux-x86_64-2.7/tornado/escape.py -> /home/mgr/.cache/yay/python-tornado-4.4/src/tornado-4.4.3-py2/tmp_install/usr/lib/python2.7/site-packages/tornado
  839. copying build/lib.linux-x86_64-2.7/tornado/template.py -> /home/mgr/.cache/yay/python-tornado-4.4/src/tornado-4.4.3-py2/tmp_install/usr/lib/python2.7/site-packages/tornado
  840. copying build/lib.linux-x86_64-2.7/tornado/wsgi.py -> /home/mgr/.cache/yay/python-tornado-4.4/src/tornado-4.4.3-py2/tmp_install/usr/lib/python2.7/site-packages/tornado
  841. copying build/lib.linux-x86_64-2.7/tornado/testing.py -> /home/mgr/.cache/yay/python-tornado-4.4/src/tornado-4.4.3-py2/tmp_install/usr/lib/python2.7/site-packages/tornado
  842. copying build/lib.linux-x86_64-2.7/tornado/process.py -> /home/mgr/.cache/yay/python-tornado-4.4/src/tornado-4.4.3-py2/tmp_install/usr/lib/python2.7/site-packages/tornado
  843. creating /home/mgr/.cache/yay/python-tornado-4.4/src/tornado-4.4.3-py2/tmp_install/usr/lib/python2.7/site-packages/tornado/platform
  844. copying build/lib.linux-x86_64-2.7/tornado/platform/select.py -> /home/mgr/.cache/yay/python-tornado-4.4/src/tornado-4.4.3-py2/tmp_install/usr/lib/python2.7/site-packages/tornado/platform
  845. copying build/lib.linux-x86_64-2.7/tornado/platform/kqueue.py -> /home/mgr/.cache/yay/python-tornado-4.4/src/tornado-4.4.3-py2/tmp_install/usr/lib/python2.7/site-packages/tornado/platform
  846. copying build/lib.linux-x86_64-2.7/tornado/platform/auto.py -> /home/mgr/.cache/yay/python-tornado-4.4/src/tornado-4.4.3-py2/tmp_install/usr/lib/python2.7/site-packages/tornado/platform
  847. copying build/lib.linux-x86_64-2.7/tornado/platform/__init__.py -> /home/mgr/.cache/yay/python-tornado-4.4/src/tornado-4.4.3-py2/tmp_install/usr/lib/python2.7/site-packages/tornado/platform
  848. copying build/lib.linux-x86_64-2.7/tornado/platform/interface.py -> /home/mgr/.cache/yay/python-tornado-4.4/src/tornado-4.4.3-py2/tmp_install/usr/lib/python2.7/site-packages/tornado/platform
  849. copying build/lib.linux-x86_64-2.7/tornado/platform/twisted.py -> /home/mgr/.cache/yay/python-tornado-4.4/src/tornado-4.4.3-py2/tmp_install/usr/lib/python2.7/site-packages/tornado/platform
  850. copying build/lib.linux-x86_64-2.7/tornado/platform/epoll.py -> /home/mgr/.cache/yay/python-tornado-4.4/src/tornado-4.4.3-py2/tmp_install/usr/lib/python2.7/site-packages/tornado/platform
  851. copying build/lib.linux-x86_64-2.7/tornado/platform/common.py -> /home/mgr/.cache/yay/python-tornado-4.4/src/tornado-4.4.3-py2/tmp_install/usr/lib/python2.7/site-packages/tornado/platform
  852. copying build/lib.linux-x86_64-2.7/tornado/platform/asyncio.py -> /home/mgr/.cache/yay/python-tornado-4.4/src/tornado-4.4.3-py2/tmp_install/usr/lib/python2.7/site-packages/tornado/platform
  853. copying build/lib.linux-x86_64-2.7/tornado/platform/caresresolver.py -> /home/mgr/.cache/yay/python-tornado-4.4/src/tornado-4.4.3-py2/tmp_install/usr/lib/python2.7/site-packages/tornado/platform
  854. copying build/lib.linux-x86_64-2.7/tornado/platform/windows.py -> /home/mgr/.cache/yay/python-tornado-4.4/src/tornado-4.4.3-py2/tmp_install/usr/lib/python2.7/site-packages/tornado/platform
  855. copying build/lib.linux-x86_64-2.7/tornado/platform/posix.py -> /home/mgr/.cache/yay/python-tornado-4.4/src/tornado-4.4.3-py2/tmp_install/usr/lib/python2.7/site-packages/tornado/platform
  856. copying build/lib.linux-x86_64-2.7/tornado/web.py -> /home/mgr/.cache/yay/python-tornado-4.4/src/tornado-4.4.3-py2/tmp_install/usr/lib/python2.7/site-packages/tornado
  857. copying build/lib.linux-x86_64-2.7/tornado/tcpserver.py -> /home/mgr/.cache/yay/python-tornado-4.4/src/tornado-4.4.3-py2/tmp_install/usr/lib/python2.7/site-packages/tornado
  858. copying build/lib.linux-x86_64-2.7/tornado/netutil.py -> /home/mgr/.cache/yay/python-tornado-4.4/src/tornado-4.4.3-py2/tmp_install/usr/lib/python2.7/site-packages/tornado
  859. copying build/lib.linux-x86_64-2.7/tornado/tcpclient.py -> /home/mgr/.cache/yay/python-tornado-4.4/src/tornado-4.4.3-py2/tmp_install/usr/lib/python2.7/site-packages/tornado
  860. creating /home/mgr/.cache/yay/python-tornado-4.4/src/tornado-4.4.3-py2/tmp_install/usr/lib/python2.7/site-packages/tornado/test
  861. copying build/lib.linux-x86_64-2.7/tornado/test/escape_test.py -> /home/mgr/.cache/yay/python-tornado-4.4/src/tornado-4.4.3-py2/tmp_install/usr/lib/python2.7/site-packages/tornado/test
  862. copying build/lib.linux-x86_64-2.7/tornado/test/tcpserver_test.py -> /home/mgr/.cache/yay/python-tornado-4.4/src/tornado-4.4.3-py2/tmp_install/usr/lib/python2.7/site-packages/tornado/test
  863. copying build/lib.linux-x86_64-2.7/tornado/test/auth_test.py -> /home/mgr/.cache/yay/python-tornado-4.4/src/tornado-4.4.3-py2/tmp_install/usr/lib/python2.7/site-packages/tornado/test
  864. copying build/lib.linux-x86_64-2.7/tornado/test/twisted_test.py -> /home/mgr/.cache/yay/python-tornado-4.4/src/tornado-4.4.3-py2/tmp_install/usr/lib/python2.7/site-packages/tornado/test
  865. copying build/lib.linux-x86_64-2.7/tornado/test/test.key -> /home/mgr/.cache/yay/python-tornado-4.4/src/tornado-4.4.3-py2/tmp_install/usr/lib/python2.7/site-packages/tornado/test
  866. copying build/lib.linux-x86_64-2.7/tornado/test/tcpclient_test.py -> /home/mgr/.cache/yay/python-tornado-4.4/src/tornado-4.4.3-py2/tmp_install/usr/lib/python2.7/site-packages/tornado/test
  867. copying build/lib.linux-x86_64-2.7/tornado/test/import_test.py -> /home/mgr/.cache/yay/python-tornado-4.4/src/tornado-4.4.3-py2/tmp_install/usr/lib/python2.7/site-packages/tornado/test
  868. copying build/lib.linux-x86_64-2.7/tornado/test/queues_test.py -> /home/mgr/.cache/yay/python-tornado-4.4/src/tornado-4.4.3-py2/tmp_install/usr/lib/python2.7/site-packages/tornado/test
  869. copying build/lib.linux-x86_64-2.7/tornado/test/curl_httpclient_test.py -> /home/mgr/.cache/yay/python-tornado-4.4/src/tornado-4.4.3-py2/tmp_install/usr/lib/python2.7/site-packages/tornado/test
  870. copying build/lib.linux-x86_64-2.7/tornado/test/options_test.py -> /home/mgr/.cache/yay/python-tornado-4.4/src/tornado-4.4.3-py2/tmp_install/usr/lib/python2.7/site-packages/tornado/test
  871. copying build/lib.linux-x86_64-2.7/tornado/test/ioloop_test.py -> /home/mgr/.cache/yay/python-tornado-4.4/src/tornado-4.4.3-py2/tmp_install/usr/lib/python2.7/site-packages/tornado/test
  872. copying build/lib.linux-x86_64-2.7/tornado/test/concurrent_test.py -> /home/mgr/.cache/yay/python-tornado-4.4/src/tornado-4.4.3-py2/tmp_install/usr/lib/python2.7/site-packages/tornado/test
  873. copying build/lib.linux-x86_64-2.7/tornado/test/__init__.py -> /home/mgr/.cache/yay/python-tornado-4.4/src/tornado-4.4.3-py2/tmp_install/usr/lib/python2.7/site-packages/tornado/test
  874. creating /home/mgr/.cache/yay/python-tornado-4.4/src/tornado-4.4.3-py2/tmp_install/usr/lib/python2.7/site-packages/tornado/test/csv_translations
  875. copying build/lib.linux-x86_64-2.7/tornado/test/csv_translations/fr_FR.csv -> /home/mgr/.cache/yay/python-tornado-4.4/src/tornado-4.4.3-py2/tmp_install/usr/lib/python2.7/site-packages/tornado/test/csv_translations
  876. copying build/lib.linux-x86_64-2.7/tornado/test/util.py -> /home/mgr/.cache/yay/python-tornado-4.4/src/tornado-4.4.3-py2/tmp_install/usr/lib/python2.7/site-packages/tornado/test
  877. copying build/lib.linux-x86_64-2.7/tornado/test/testing_test.py -> /home/mgr/.cache/yay/python-tornado-4.4/src/tornado-4.4.3-py2/tmp_install/usr/lib/python2.7/site-packages/tornado/test
  878. copying build/lib.linux-x86_64-2.7/tornado/test/options_test.cfg -> /home/mgr/.cache/yay/python-tornado-4.4/src/tornado-4.4.3-py2/tmp_install/usr/lib/python2.7/site-packages/tornado/test
  879. copying build/lib.linux-x86_64-2.7/tornado/test/asyncio_test.py -> /home/mgr/.cache/yay/python-tornado-4.4/src/tornado-4.4.3-py2/tmp_install/usr/lib/python2.7/site-packages/tornado/test
  880. copying build/lib.linux-x86_64-2.7/tornado/test/netutil_test.py -> /home/mgr/.cache/yay/python-tornado-4.4/src/tornado-4.4.3-py2/tmp_install/usr/lib/python2.7/site-packages/tornado/test
  881. copying build/lib.linux-x86_64-2.7/tornado/test/httpserver_test.py -> /home/mgr/.cache/yay/python-tornado-4.4/src/tornado-4.4.3-py2/tmp_install/usr/lib/python2.7/site-packages/tornado/test
  882. creating /home/mgr/.cache/yay/python-tornado-4.4/src/tornado-4.4.3-py2/tmp_install/usr/lib/python2.7/site-packages/tornado/test/templates
  883. copying build/lib.linux-x86_64-2.7/tornado/test/templates/utf8.html -> /home/mgr/.cache/yay/python-tornado-4.4/src/tornado-4.4.3-py2/tmp_install/usr/lib/python2.7/site-packages/tornado/test/templates
  884. copying build/lib.linux-x86_64-2.7/tornado/test/websocket_test.py -> /home/mgr/.cache/yay/python-tornado-4.4/src/tornado-4.4.3-py2/tmp_install/usr/lib/python2.7/site-packages/tornado/test
  885. copying build/lib.linux-x86_64-2.7/tornado/test/simple_httpclient_test.py -> /home/mgr/.cache/yay/python-tornado-4.4/src/tornado-4.4.3-py2/tmp_install/usr/lib/python2.7/site-packages/tornado/test
  886. copying build/lib.linux-x86_64-2.7/tornado/test/__main__.py -> /home/mgr/.cache/yay/python-tornado-4.4/src/tornado-4.4.3-py2/tmp_install/usr/lib/python2.7/site-packages/tornado/test
  887. copying build/lib.linux-x86_64-2.7/tornado/test/locale_test.py -> /home/mgr/.cache/yay/python-tornado-4.4/src/tornado-4.4.3-py2/tmp_install/usr/lib/python2.7/site-packages/tornado/test
  888. copying build/lib.linux-x86_64-2.7/tornado/test/util_test.py -> /home/mgr/.cache/yay/python-tornado-4.4/src/tornado-4.4.3-py2/tmp_install/usr/lib/python2.7/site-packages/tornado/test
  889. copying build/lib.linux-x86_64-2.7/tornado/test/http1connection_test.py -> /home/mgr/.cache/yay/python-tornado-4.4/src/tornado-4.4.3-py2/tmp_install/usr/lib/python2.7/site-packages/tornado/test
  890. copying build/lib.linux-x86_64-2.7/tornado/test/static_foo.txt -> /home/mgr/.cache/yay/python-tornado-4.4/src/tornado-4.4.3-py2/tmp_install/usr/lib/python2.7/site-packages/tornado/test
  891. copying build/lib.linux-x86_64-2.7/tornado/test/gen_test.py -> /home/mgr/.cache/yay/python-tornado-4.4/src/tornado-4.4.3-py2/tmp_install/usr/lib/python2.7/site-packages/tornado/test
  892. copying build/lib.linux-x86_64-2.7/tornado/test/test.crt -> /home/mgr/.cache/yay/python-tornado-4.4/src/tornado-4.4.3-py2/tmp_install/usr/lib/python2.7/site-packages/tornado/test
  893. copying build/lib.linux-x86_64-2.7/tornado/test/wsgi_test.py -> /home/mgr/.cache/yay/python-tornado-4.4/src/tornado-4.4.3-py2/tmp_install/usr/lib/python2.7/site-packages/tornado/test
  894. creating /home/mgr/.cache/yay/python-tornado-4.4/src/tornado-4.4.3-py2/tmp_install/usr/lib/python2.7/site-packages/tornado/test/static
  895. copying build/lib.linux-x86_64-2.7/tornado/test/static/sample.xml.bz2 -> /home/mgr/.cache/yay/python-tornado-4.4/src/tornado-4.4.3-py2/tmp_install/usr/lib/python2.7/site-packages/tornado/test/static
  896. copying build/lib.linux-x86_64-2.7/tornado/test/static/robots.txt -> /home/mgr/.cache/yay/python-tornado-4.4/src/tornado-4.4.3-py2/tmp_install/usr/lib/python2.7/site-packages/tornado/test/static
  897. copying build/lib.linux-x86_64-2.7/tornado/test/static/sample.xml -> /home/mgr/.cache/yay/python-tornado-4.4/src/tornado-4.4.3-py2/tmp_install/usr/lib/python2.7/site-packages/tornado/test/static
  898. creating /home/mgr/.cache/yay/python-tornado-4.4/src/tornado-4.4.3-py2/tmp_install/usr/lib/python2.7/site-packages/tornado/test/static/dir
  899. copying build/lib.linux-x86_64-2.7/tornado/test/static/dir/index.html -> /home/mgr/.cache/yay/python-tornado-4.4/src/tornado-4.4.3-py2/tmp_install/usr/lib/python2.7/site-packages/tornado/test/static/dir
  900. copying build/lib.linux-x86_64-2.7/tornado/test/static/sample.xml.gz -> /home/mgr/.cache/yay/python-tornado-4.4/src/tornado-4.4.3-py2/tmp_install/usr/lib/python2.7/site-packages/tornado/test/static
  901. copying build/lib.linux-x86_64-2.7/tornado/test/template_test.py -> /home/mgr/.cache/yay/python-tornado-4.4/src/tornado-4.4.3-py2/tmp_install/usr/lib/python2.7/site-packages/tornado/test
  902. copying build/lib.linux-x86_64-2.7/tornado/test/process_test.py -> /home/mgr/.cache/yay/python-tornado-4.4/src/tornado-4.4.3-py2/tmp_install/usr/lib/python2.7/site-packages/tornado/test
  903. copying build/lib.linux-x86_64-2.7/tornado/test/iostream_test.py -> /home/mgr/.cache/yay/python-tornado-4.4/src/tornado-4.4.3-py2/tmp_install/usr/lib/python2.7/site-packages/tornado/test
  904. copying build/lib.linux-x86_64-2.7/tornado/test/windows_test.py -> /home/mgr/.cache/yay/python-tornado-4.4/src/tornado-4.4.3-py2/tmp_install/usr/lib/python2.7/site-packages/tornado/test
  905. copying build/lib.linux-x86_64-2.7/tornado/test/stack_context_test.py -> /home/mgr/.cache/yay/python-tornado-4.4/src/tornado-4.4.3-py2/tmp_install/usr/lib/python2.7/site-packages/tornado/test
  906. copying build/lib.linux-x86_64-2.7/tornado/test/httpclient_test.py -> /home/mgr/.cache/yay/python-tornado-4.4/src/tornado-4.4.3-py2/tmp_install/usr/lib/python2.7/site-packages/tornado/test
  907. copying build/lib.linux-x86_64-2.7/tornado/test/log_test.py -> /home/mgr/.cache/yay/python-tornado-4.4/src/tornado-4.4.3-py2/tmp_install/usr/lib/python2.7/site-packages/tornado/test
  908. copying build/lib.linux-x86_64-2.7/tornado/test/web_test.py -> /home/mgr/.cache/yay/python-tornado-4.4/src/tornado-4.4.3-py2/tmp_install/usr/lib/python2.7/site-packages/tornado/test
  909. creating /home/mgr/.cache/yay/python-tornado-4.4/src/tornado-4.4.3-py2/tmp_install/usr/lib/python2.7/site-packages/tornado/test/gettext_translations
  910. creating /home/mgr/.cache/yay/python-tornado-4.4/src/tornado-4.4.3-py2/tmp_install/usr/lib/python2.7/site-packages/tornado/test/gettext_translations/fr_FR
  911. creating /home/mgr/.cache/yay/python-tornado-4.4/src/tornado-4.4.3-py2/tmp_install/usr/lib/python2.7/site-packages/tornado/test/gettext_translations/fr_FR/LC_MESSAGES
  912. copying build/lib.linux-x86_64-2.7/tornado/test/gettext_translations/fr_FR/LC_MESSAGES/tornado_test.po -> /home/mgr/.cache/yay/python-tornado-4.4/src/tornado-4.4.3-py2/tmp_install/usr/lib/python2.7/site-packages/tornado/test/gettext_translations/fr_FR/LC_MESSAGES
  913. copying build/lib.linux-x86_64-2.7/tornado/test/gettext_translations/fr_FR/LC_MESSAGES/tornado_test.mo -> /home/mgr/.cache/yay/python-tornado-4.4/src/tornado-4.4.3-py2/tmp_install/usr/lib/python2.7/site-packages/tornado/test/gettext_translations/fr_FR/LC_MESSAGES
  914. copying build/lib.linux-x86_64-2.7/tornado/test/resolve_test_helper.py -> /home/mgr/.cache/yay/python-tornado-4.4/src/tornado-4.4.3-py2/tmp_install/usr/lib/python2.7/site-packages/tornado/test
  915. copying build/lib.linux-x86_64-2.7/tornado/test/runtests.py -> /home/mgr/.cache/yay/python-tornado-4.4/src/tornado-4.4.3-py2/tmp_install/usr/lib/python2.7/site-packages/tornado/test
  916. copying build/lib.linux-x86_64-2.7/tornado/test/httputil_test.py -> /home/mgr/.cache/yay/python-tornado-4.4/src/tornado-4.4.3-py2/tmp_install/usr/lib/python2.7/site-packages/tornado/test
  917. copying build/lib.linux-x86_64-2.7/tornado/test/locks_test.py -> /home/mgr/.cache/yay/python-tornado-4.4/src/tornado-4.4.3-py2/tmp_install/usr/lib/python2.7/site-packages/tornado/test
  918. copying build/lib.linux-x86_64-2.7/tornado/gen.py -> /home/mgr/.cache/yay/python-tornado-4.4/src/tornado-4.4.3-py2/tmp_install/usr/lib/python2.7/site-packages/tornado
  919. copying build/lib.linux-x86_64-2.7/tornado/autoreload.py -> /home/mgr/.cache/yay/python-tornado-4.4/src/tornado-4.4.3-py2/tmp_install/usr/lib/python2.7/site-packages/tornado
  920. copying build/lib.linux-x86_64-2.7/tornado/_locale_data.py -> /home/mgr/.cache/yay/python-tornado-4.4/src/tornado-4.4.3-py2/tmp_install/usr/lib/python2.7/site-packages/tornado
  921. copying build/lib.linux-x86_64-2.7/tornado/http1connection.py -> /home/mgr/.cache/yay/python-tornado-4.4/src/tornado-4.4.3-py2/tmp_install/usr/lib/python2.7/site-packages/tornado
  922. copying build/lib.linux-x86_64-2.7/tornado/options.py -> /home/mgr/.cache/yay/python-tornado-4.4/src/tornado-4.4.3-py2/tmp_install/usr/lib/python2.7/site-packages/tornado
  923. copying build/lib.linux-x86_64-2.7/tornado/log.py -> /home/mgr/.cache/yay/python-tornado-4.4/src/tornado-4.4.3-py2/tmp_install/usr/lib/python2.7/site-packages/tornado
  924. copying build/lib.linux-x86_64-2.7/tornado/locale.py -> /home/mgr/.cache/yay/python-tornado-4.4/src/tornado-4.4.3-py2/tmp_install/usr/lib/python2.7/site-packages/tornado
  925. copying build/lib.linux-x86_64-2.7/tornado/httpserver.py -> /home/mgr/.cache/yay/python-tornado-4.4/src/tornado-4.4.3-py2/tmp_install/usr/lib/python2.7/site-packages/tornado
  926. copying build/lib.linux-x86_64-2.7/tornado/concurrent.py -> /home/mgr/.cache/yay/python-tornado-4.4/src/tornado-4.4.3-py2/tmp_install/usr/lib/python2.7/site-packages/tornado
  927. copying build/lib.linux-x86_64-2.7/tornado/curl_httpclient.py -> /home/mgr/.cache/yay/python-tornado-4.4/src/tornado-4.4.3-py2/tmp_install/usr/lib/python2.7/site-packages/tornado
  928. copying build/lib.linux-x86_64-2.7/tornado/speedups.so -> /home/mgr/.cache/yay/python-tornado-4.4/src/tornado-4.4.3-py2/tmp_install/usr/lib/python2.7/site-packages/tornado
  929. copying build/lib.linux-x86_64-2.7/tornado/locks.py -> /home/mgr/.cache/yay/python-tornado-4.4/src/tornado-4.4.3-py2/tmp_install/usr/lib/python2.7/site-packages/tornado
  930. copying build/lib.linux-x86_64-2.7/tornado/websocket.py -> /home/mgr/.cache/yay/python-tornado-4.4/src/tornado-4.4.3-py2/tmp_install/usr/lib/python2.7/site-packages/tornado
  931. byte-compiling /home/mgr/.cache/yay/python-tornado-4.4/src/tornado-4.4.3-py2/tmp_install/usr/lib/python2.7/site-packages/tornado/stack_context.py to stack_context.pyc
  932. byte-compiling /home/mgr/.cache/yay/python-tornado-4.4/src/tornado-4.4.3-py2/tmp_install/usr/lib/python2.7/site-packages/tornado/httpclient.py to httpclient.pyc
  933. byte-compiling /home/mgr/.cache/yay/python-tornado-4.4/src/tornado-4.4.3-py2/tmp_install/usr/lib/python2.7/site-packages/tornado/auth.py to auth.pyc
  934. byte-compiling /home/mgr/.cache/yay/python-tornado-4.4/src/tornado-4.4.3-py2/tmp_install/usr/lib/python2.7/site-packages/tornado/simple_httpclient.py to simple_httpclient.pyc
  935. byte-compiling /home/mgr/.cache/yay/python-tornado-4.4/src/tornado-4.4.3-py2/tmp_install/usr/lib/python2.7/site-packages/tornado/httputil.py to httputil.pyc
  936. byte-compiling /home/mgr/.cache/yay/python-tornado-4.4/src/tornado-4.4.3-py2/tmp_install/usr/lib/python2.7/site-packages/tornado/ioloop.py to ioloop.pyc
  937. byte-compiling /home/mgr/.cache/yay/python-tornado-4.4/src/tornado-4.4.3-py2/tmp_install/usr/lib/python2.7/site-packages/tornado/iostream.py to iostream.pyc
  938. byte-compiling /home/mgr/.cache/yay/python-tornado-4.4/src/tornado-4.4.3-py2/tmp_install/usr/lib/python2.7/site-packages/tornado/__init__.py to __init__.pyc
  939. byte-compiling /home/mgr/.cache/yay/python-tornado-4.4/src/tornado-4.4.3-py2/tmp_install/usr/lib/python2.7/site-packages/tornado/queues.py to queues.pyc
  940. byte-compiling /home/mgr/.cache/yay/python-tornado-4.4/src/tornado-4.4.3-py2/tmp_install/usr/lib/python2.7/site-packages/tornado/util.py to util.pyc
  941. byte-compiling /home/mgr/.cache/yay/python-tornado-4.4/src/tornado-4.4.3-py2/tmp_install/usr/lib/python2.7/site-packages/tornado/escape.py to escape.pyc
  942. byte-compiling /home/mgr/.cache/yay/python-tornado-4.4/src/tornado-4.4.3-py2/tmp_install/usr/lib/python2.7/site-packages/tornado/template.py to template.pyc
  943. byte-compiling /home/mgr/.cache/yay/python-tornado-4.4/src/tornado-4.4.3-py2/tmp_install/usr/lib/python2.7/site-packages/tornado/wsgi.py to wsgi.pyc
  944. byte-compiling /home/mgr/.cache/yay/python-tornado-4.4/src/tornado-4.4.3-py2/tmp_install/usr/lib/python2.7/site-packages/tornado/testing.py to testing.pyc
  945. byte-compiling /home/mgr/.cache/yay/python-tornado-4.4/src/tornado-4.4.3-py2/tmp_install/usr/lib/python2.7/site-packages/tornado/process.py to process.pyc
  946. byte-compiling /home/mgr/.cache/yay/python-tornado-4.4/src/tornado-4.4.3-py2/tmp_install/usr/lib/python2.7/site-packages/tornado/platform/select.py to select.pyc
  947. byte-compiling /home/mgr/.cache/yay/python-tornado-4.4/src/tornado-4.4.3-py2/tmp_install/usr/lib/python2.7/site-packages/tornado/platform/kqueue.py to kqueue.pyc
  948. byte-compiling /home/mgr/.cache/yay/python-tornado-4.4/src/tornado-4.4.3-py2/tmp_install/usr/lib/python2.7/site-packages/tornado/platform/auto.py to auto.pyc
  949. byte-compiling /home/mgr/.cache/yay/python-tornado-4.4/src/tornado-4.4.3-py2/tmp_install/usr/lib/python2.7/site-packages/tornado/platform/__init__.py to __init__.pyc
  950. byte-compiling /home/mgr/.cache/yay/python-tornado-4.4/src/tornado-4.4.3-py2/tmp_install/usr/lib/python2.7/site-packages/tornado/platform/interface.py to interface.pyc
  951. byte-compiling /home/mgr/.cache/yay/python-tornado-4.4/src/tornado-4.4.3-py2/tmp_install/usr/lib/python2.7/site-packages/tornado/platform/twisted.py to twisted.pyc
  952. byte-compiling /home/mgr/.cache/yay/python-tornado-4.4/src/tornado-4.4.3-py2/tmp_install/usr/lib/python2.7/site-packages/tornado/platform/epoll.py to epoll.pyc
  953. byte-compiling /home/mgr/.cache/yay/python-tornado-4.4/src/tornado-4.4.3-py2/tmp_install/usr/lib/python2.7/site-packages/tornado/platform/common.py to common.pyc
  954. byte-compiling /home/mgr/.cache/yay/python-tornado-4.4/src/tornado-4.4.3-py2/tmp_install/usr/lib/python2.7/site-packages/tornado/platform/asyncio.py to asyncio.pyc
  955. byte-compiling /home/mgr/.cache/yay/python-tornado-4.4/src/tornado-4.4.3-py2/tmp_install/usr/lib/python2.7/site-packages/tornado/platform/caresresolver.py to caresresolver.pyc
  956. byte-compiling /home/mgr/.cache/yay/python-tornado-4.4/src/tornado-4.4.3-py2/tmp_install/usr/lib/python2.7/site-packages/tornado/platform/windows.py to windows.pyc
  957. byte-compiling /home/mgr/.cache/yay/python-tornado-4.4/src/tornado-4.4.3-py2/tmp_install/usr/lib/python2.7/site-packages/tornado/platform/posix.py to posix.pyc
  958. byte-compiling /home/mgr/.cache/yay/python-tornado-4.4/src/tornado-4.4.3-py2/tmp_install/usr/lib/python2.7/site-packages/tornado/web.py to web.pyc
  959. byte-compiling /home/mgr/.cache/yay/python-tornado-4.4/src/tornado-4.4.3-py2/tmp_install/usr/lib/python2.7/site-packages/tornado/tcpserver.py to tcpserver.pyc
  960. byte-compiling /home/mgr/.cache/yay/python-tornado-4.4/src/tornado-4.4.3-py2/tmp_install/usr/lib/python2.7/site-packages/tornado/netutil.py to netutil.pyc
  961. byte-compiling /home/mgr/.cache/yay/python-tornado-4.4/src/tornado-4.4.3-py2/tmp_install/usr/lib/python2.7/site-packages/tornado/tcpclient.py to tcpclient.pyc
  962. byte-compiling /home/mgr/.cache/yay/python-tornado-4.4/src/tornado-4.4.3-py2/tmp_install/usr/lib/python2.7/site-packages/tornado/test/escape_test.py to escape_test.pyc
  963. byte-compiling /home/mgr/.cache/yay/python-tornado-4.4/src/tornado-4.4.3-py2/tmp_install/usr/lib/python2.7/site-packages/tornado/test/tcpserver_test.py to tcpserver_test.pyc
  964. byte-compiling /home/mgr/.cache/yay/python-tornado-4.4/src/tornado-4.4.3-py2/tmp_install/usr/lib/python2.7/site-packages/tornado/test/auth_test.py to auth_test.pyc
  965. byte-compiling /home/mgr/.cache/yay/python-tornado-4.4/src/tornado-4.4.3-py2/tmp_install/usr/lib/python2.7/site-packages/tornado/test/twisted_test.py to twisted_test.pyc
  966. byte-compiling /home/mgr/.cache/yay/python-tornado-4.4/src/tornado-4.4.3-py2/tmp_install/usr/lib/python2.7/site-packages/tornado/test/tcpclient_test.py to tcpclient_test.pyc
  967. byte-compiling /home/mgr/.cache/yay/python-tornado-4.4/src/tornado-4.4.3-py2/tmp_install/usr/lib/python2.7/site-packages/tornado/test/import_test.py to import_test.pyc
  968. byte-compiling /home/mgr/.cache/yay/python-tornado-4.4/src/tornado-4.4.3-py2/tmp_install/usr/lib/python2.7/site-packages/tornado/test/queues_test.py to queues_test.pyc
  969. byte-compiling /home/mgr/.cache/yay/python-tornado-4.4/src/tornado-4.4.3-py2/tmp_install/usr/lib/python2.7/site-packages/tornado/test/curl_httpclient_test.py to curl_httpclient_test.pyc
  970. byte-compiling /home/mgr/.cache/yay/python-tornado-4.4/src/tornado-4.4.3-py2/tmp_install/usr/lib/python2.7/site-packages/tornado/test/options_test.py to options_test.pyc
  971. byte-compiling /home/mgr/.cache/yay/python-tornado-4.4/src/tornado-4.4.3-py2/tmp_install/usr/lib/python2.7/site-packages/tornado/test/ioloop_test.py to ioloop_test.pyc
  972. byte-compiling /home/mgr/.cache/yay/python-tornado-4.4/src/tornado-4.4.3-py2/tmp_install/usr/lib/python2.7/site-packages/tornado/test/concurrent_test.py to concurrent_test.pyc
  973. byte-compiling /home/mgr/.cache/yay/python-tornado-4.4/src/tornado-4.4.3-py2/tmp_install/usr/lib/python2.7/site-packages/tornado/test/__init__.py to __init__.pyc
  974. byte-compiling /home/mgr/.cache/yay/python-tornado-4.4/src/tornado-4.4.3-py2/tmp_install/usr/lib/python2.7/site-packages/tornado/test/util.py to util.pyc
  975. byte-compiling /home/mgr/.cache/yay/python-tornado-4.4/src/tornado-4.4.3-py2/tmp_install/usr/lib/python2.7/site-packages/tornado/test/testing_test.py to testing_test.pyc
  976. byte-compiling /home/mgr/.cache/yay/python-tornado-4.4/src/tornado-4.4.3-py2/tmp_install/usr/lib/python2.7/site-packages/tornado/test/asyncio_test.py to asyncio_test.pyc
  977. byte-compiling /home/mgr/.cache/yay/python-tornado-4.4/src/tornado-4.4.3-py2/tmp_install/usr/lib/python2.7/site-packages/tornado/test/netutil_test.py to netutil_test.pyc
  978. byte-compiling /home/mgr/.cache/yay/python-tornado-4.4/src/tornado-4.4.3-py2/tmp_install/usr/lib/python2.7/site-packages/tornado/test/httpserver_test.py to httpserver_test.pyc
  979. byte-compiling /home/mgr/.cache/yay/python-tornado-4.4/src/tornado-4.4.3-py2/tmp_install/usr/lib/python2.7/site-packages/tornado/test/websocket_test.py to websocket_test.pyc
  980. byte-compiling /home/mgr/.cache/yay/python-tornado-4.4/src/tornado-4.4.3-py2/tmp_install/usr/lib/python2.7/site-packages/tornado/test/simple_httpclient_test.py to simple_httpclient_test.pyc
  981. byte-compiling /home/mgr/.cache/yay/python-tornado-4.4/src/tornado-4.4.3-py2/tmp_install/usr/lib/python2.7/site-packages/tornado/test/__main__.py to __main__.pyc
  982. byte-compiling /home/mgr/.cache/yay/python-tornado-4.4/src/tornado-4.4.3-py2/tmp_install/usr/lib/python2.7/site-packages/tornado/test/locale_test.py to locale_test.pyc
  983. byte-compiling /home/mgr/.cache/yay/python-tornado-4.4/src/tornado-4.4.3-py2/tmp_install/usr/lib/python2.7/site-packages/tornado/test/util_test.py to util_test.pyc
  984. byte-compiling /home/mgr/.cache/yay/python-tornado-4.4/src/tornado-4.4.3-py2/tmp_install/usr/lib/python2.7/site-packages/tornado/test/http1connection_test.py to http1connection_test.pyc
  985. byte-compiling /home/mgr/.cache/yay/python-tornado-4.4/src/tornado-4.4.3-py2/tmp_install/usr/lib/python2.7/site-packages/tornado/test/gen_test.py to gen_test.pyc
  986. byte-compiling /home/mgr/.cache/yay/python-tornado-4.4/src/tornado-4.4.3-py2/tmp_install/usr/lib/python2.7/site-packages/tornado/test/wsgi_test.py to wsgi_test.pyc
  987. byte-compiling /home/mgr/.cache/yay/python-tornado-4.4/src/tornado-4.4.3-py2/tmp_install/usr/lib/python2.7/site-packages/tornado/test/template_test.py to template_test.pyc
  988. byte-compiling /home/mgr/.cache/yay/python-tornado-4.4/src/tornado-4.4.3-py2/tmp_install/usr/lib/python2.7/site-packages/tornado/test/process_test.py to process_test.pyc
  989. byte-compiling /home/mgr/.cache/yay/python-tornado-4.4/src/tornado-4.4.3-py2/tmp_install/usr/lib/python2.7/site-packages/tornado/test/iostream_test.py to iostream_test.pyc
  990. byte-compiling /home/mgr/.cache/yay/python-tornado-4.4/src/tornado-4.4.3-py2/tmp_install/usr/lib/python2.7/site-packages/tornado/test/windows_test.py to windows_test.pyc
  991. byte-compiling /home/mgr/.cache/yay/python-tornado-4.4/src/tornado-4.4.3-py2/tmp_install/usr/lib/python2.7/site-packages/tornado/test/stack_context_test.py to stack_context_test.pyc
  992. byte-compiling /home/mgr/.cache/yay/python-tornado-4.4/src/tornado-4.4.3-py2/tmp_install/usr/lib/python2.7/site-packages/tornado/test/httpclient_test.py to httpclient_test.pyc
  993. byte-compiling /home/mgr/.cache/yay/python-tornado-4.4/src/tornado-4.4.3-py2/tmp_install/usr/lib/python2.7/site-packages/tornado/test/log_test.py to log_test.pyc
  994. byte-compiling /home/mgr/.cache/yay/python-tornado-4.4/src/tornado-4.4.3-py2/tmp_install/usr/lib/python2.7/site-packages/tornado/test/web_test.py to web_test.pyc
  995. byte-compiling /home/mgr/.cache/yay/python-tornado-4.4/src/tornado-4.4.3-py2/tmp_install/usr/lib/python2.7/site-packages/tornado/test/resolve_test_helper.py to resolve_test_helper.pyc
  996. byte-compiling /home/mgr/.cache/yay/python-tornado-4.4/src/tornado-4.4.3-py2/tmp_install/usr/lib/python2.7/site-packages/tornado/test/runtests.py to runtests.pyc
  997. byte-compiling /home/mgr/.cache/yay/python-tornado-4.4/src/tornado-4.4.3-py2/tmp_install/usr/lib/python2.7/site-packages/tornado/test/httputil_test.py to httputil_test.pyc
  998. byte-compiling /home/mgr/.cache/yay/python-tornado-4.4/src/tornado-4.4.3-py2/tmp_install/usr/lib/python2.7/site-packages/tornado/test/locks_test.py to locks_test.pyc
  999. byte-compiling /home/mgr/.cache/yay/python-tornado-4.4/src/tornado-4.4.3-py2/tmp_install/usr/lib/python2.7/site-packages/tornado/gen.py to gen.pyc
  1000. byte-compiling /home/mgr/.cache/yay/python-tornado-4.4/src/tornado-4.4.3-py2/tmp_install/usr/lib/python2.7/site-packages/tornado/autoreload.py to autoreload.pyc
  1001. byte-compiling /home/mgr/.cache/yay/python-tornado-4.4/src/tornado-4.4.3-py2/tmp_install/usr/lib/python2.7/site-packages/tornado/_locale_data.py to _locale_data.pyc
  1002. byte-compiling /home/mgr/.cache/yay/python-tornado-4.4/src/tornado-4.4.3-py2/tmp_install/usr/lib/python2.7/site-packages/tornado/http1connection.py to http1connection.pyc
  1003. byte-compiling /home/mgr/.cache/yay/python-tornado-4.4/src/tornado-4.4.3-py2/tmp_install/usr/lib/python2.7/site-packages/tornado/options.py to options.pyc
  1004. byte-compiling /home/mgr/.cache/yay/python-tornado-4.4/src/tornado-4.4.3-py2/tmp_install/usr/lib/python2.7/site-packages/tornado/log.py to log.pyc
  1005. byte-compiling /home/mgr/.cache/yay/python-tornado-4.4/src/tornado-4.4.3-py2/tmp_install/usr/lib/python2.7/site-packages/tornado/locale.py to locale.pyc
  1006. byte-compiling /home/mgr/.cache/yay/python-tornado-4.4/src/tornado-4.4.3-py2/tmp_install/usr/lib/python2.7/site-packages/tornado/httpserver.py to httpserver.pyc
  1007. byte-compiling /home/mgr/.cache/yay/python-tornado-4.4/src/tornado-4.4.3-py2/tmp_install/usr/lib/python2.7/site-packages/tornado/concurrent.py to concurrent.pyc
  1008. byte-compiling /home/mgr/.cache/yay/python-tornado-4.4/src/tornado-4.4.3-py2/tmp_install/usr/lib/python2.7/site-packages/tornado/curl_httpclient.py to curl_httpclient.pyc
  1009. byte-compiling /home/mgr/.cache/yay/python-tornado-4.4/src/tornado-4.4.3-py2/tmp_install/usr/lib/python2.7/site-packages/tornado/locks.py to locks.pyc
  1010. byte-compiling /home/mgr/.cache/yay/python-tornado-4.4/src/tornado-4.4.3-py2/tmp_install/usr/lib/python2.7/site-packages/tornado/websocket.py to websocket.pyc
  1011. writing byte-compilation script '/tmp/tmp2Wy_tp.py'
  1012. /usr/bin/python2 -O /tmp/tmp2Wy_tp.py
  1013. removing /tmp/tmp2Wy_tp.py
  1014. running install_egg_info
  1015. running egg_info
  1016. creating tornado.egg-info
  1017. writing requirements to tornado.egg-info/requires.txt
  1018. writing tornado.egg-info/PKG-INFO
  1019. writing top-level names to tornado.egg-info/top_level.txt
  1020. writing dependency_links to tornado.egg-info/dependency_links.txt
  1021. writing manifest file 'tornado.egg-info/SOURCES.txt'
  1022. reading manifest file 'tornado.egg-info/SOURCES.txt'
  1023. reading manifest template 'MANIFEST.in'
  1024. no previously-included directories found matching 'docs/build'
  1025. warning: no files found matching 'tornado/test/README'
  1026. writing manifest file 'tornado.egg-info/SOURCES.txt'
  1027. Copying tornado.egg-info to /home/mgr/.cache/yay/python-tornado-4.4/src/tornado-4.4.3-py2/tmp_install/usr/lib/python2.7/site-packages/tornado-4.4.3-py2.7.egg-info
  1028. running install_scripts
  1029. Traceback (most recent call last):
  1030.   File "/usr/lib/python2.7/runpy.py", line 174, in _run_module_as_main
  1031.     "__main__", fname, loader, pkg_name)
  1032.   File "/usr/lib/python2.7/runpy.py", line 72, in _run_code
  1033.     exec code in run_globals
  1034.   File "/home/mgr/.cache/yay/python-tornado-4.4/src/tornado-4.4.3-py2/tmp_install/usr/lib/python2.7/site-packages/tornado/test/runtests.py", line 185, in <module>
  1035.     main()
  1036.   File "/home/mgr/.cache/yay/python-tornado-4.4/src/tornado-4.4.3-py2/tmp_install/usr/lib/python2.7/site-packages/tornado/test/runtests.py", line 174, in main
  1037.     tornado.testing.main(**kwargs)
  1038.   File "/home/mgr/.cache/yay/python-tornado-4.4/src/tornado-4.4.3-py2/tmp_install/usr/lib/python2.7/site-packages/tornado/testing.py", line 730, in main
  1039.     unittest.main(defaultTest="all", argv=argv, **kwargs)
  1040.   File "/usr/lib/python2.7/unittest/main.py", line 94, in __init__
  1041.     self.parseArgs(argv)
  1042.   File "/usr/lib/python2.7/unittest/main.py", line 149, in parseArgs
  1043.     self.createTests()
  1044.   File "/usr/lib/python2.7/unittest/main.py", line 158, in createTests
  1045.     self.module)
  1046.   File "/usr/lib/python2.7/unittest/loader.py", line 130, in loadTestsFromNames
  1047.     suites = [self.loadTestsFromName(name, module) for name in names]
  1048.   File "/usr/lib/python2.7/unittest/loader.py", line 115, in loadTestsFromName
  1049.     test = obj()
  1050.   File "/home/mgr/.cache/yay/python-tornado-4.4/src/tornado-4.4.3-py2/tmp_install/usr/lib/python2.7/site-packages/tornado/test/runtests.py", line 62, in all
  1051.     return unittest.defaultTestLoader.loadTestsFromNames(TEST_MODULES)
  1052.   File "/usr/lib/python2.7/unittest/loader.py", line 130, in loadTestsFromNames
  1053.     suites = [self.loadTestsFromName(name, module) for name in names]
  1054.   File "/usr/lib/python2.7/unittest/loader.py", line 91, in loadTestsFromName
  1055.     module = __import__('.'.join(parts_copy))
  1056.   File "/home/mgr/.cache/yay/python-tornado-4.4/src/tornado-4.4.3-py2/tmp_install/usr/lib/python2.7/site-packages/tornado/test/netutil_test.py", line 34, in <module>
  1057.     from tornado.platform.twisted import TwistedResolver
  1058.   File "/home/mgr/.cache/yay/python-tornado-4.4/src/tornado-4.4.3-py2/tmp_install/usr/lib/python2.7/site-packages/tornado/platform/twisted.py", line 34, in <module>
  1059.     from twisted.internet.posixbase import PosixReactorBase  # type: ignore
  1060.   File "/usr/lib/python2.7/site-packages/twisted/internet/posixbase.py", line 18, in <module>
  1061.     from twisted.internet import error, udp, tcp
  1062.   File "/usr/lib/python2.7/site-packages/twisted/internet/tcp.py", line 31, in <module>
  1063.     from twisted.internet._newtls import (
  1064.   File "/usr/lib/python2.7/site-packages/twisted/internet/_newtls.py", line 21, in <module>
  1065.     from twisted.protocols.tls import TLSMemoryBIOFactory, TLSMemoryBIOProtocol
  1066.   File "/usr/lib/python2.7/site-packages/twisted/protocols/tls.py", line 63, in <module>
  1067.     from twisted.internet._sslverify import _setAcceptableProtocols
  1068.   File "/usr/lib/python2.7/site-packages/twisted/internet/_sslverify.py", line 158, in <module>
  1069.     verifyHostname, VerificationError = _selectVerifyImplementation()
  1070.   File "/usr/lib/python2.7/site-packages/twisted/internet/_sslverify.py", line 153, in _selectVerifyImplementation
  1071.     category=UserWarning, filename="", lineno=0)
  1072. UserWarning: You do not have a working installation of the service_identity module: 'No module named service_identity'.  Please install it from <https://pypi.python.org/pypi/service_identity> and make sure all of its dependencies are satisfied.  Without the service_identity module, Twisted can perform only rudimentary TLS client hostname verification.  Many valid certificate/hostname mappings may be rejected.
  1073. ==> ERROR: A failure occurred in check().
  1074.     Aborting...
  1075. Error making: python-tornado-4.4
RAW Paste Data
We use cookies for various purposes including analytics. By continuing to use Pastebin, you agree to our use of cookies as described in the Cookies Policy. OK, I Understand
 
Top