SHARE
TWEET

cmakeerror log

a guest Apr 4th, 2015 275 Never
Not a member of Pastebin yet? Sign Up, it unlocks many cool features!
  1. Compiling the C compiler identification source file "CMakeCCompilerId.c" failed.
  2. Compiler:  
  3. Build flags:
  4. Id flags:
  5.  
  6. The output was:
  7. 1
  8. Microsoft (R) Build Engine version 4.0.30319.17929
  9. [Microsoft .NET Framework, version 4.0.30319.17929]
  10. Copyright (C) Microsoft Corporation. All rights reserved.
  11.  
  12. Build started 04/04/2015 22:04:33.
  13. Project "C:\hellow\CMakeFiles\3.2.1\CompilerIdC\CompilerIdC.vcxproj" on node 1 (default targets).
  14. C:\hellow\CMakeFiles\3.2.1\CompilerIdC\CompilerIdC.vcxproj(17,3): error MSB4019: The imported project "C:\Microsoft.Cpp.Default.props" was not found. Confirm that the path in the <Import> declaration is correct, and that the file exists on disk.
  15. Done Building Project "C:\hellow\CMakeFiles\3.2.1\CompilerIdC\CompilerIdC.vcxproj" (default targets) -- FAILED.
  16.  
  17. Build FAILED.
  18.  
  19. "C:\hellow\CMakeFiles\3.2.1\CompilerIdC\CompilerIdC.vcxproj" (default target) (1) ->
  20.   C:\hellow\CMakeFiles\3.2.1\CompilerIdC\CompilerIdC.vcxproj(17,3): error MSB4019: The imported project "C:\Microsoft.Cpp.Default.props" was not found. Confirm that the path in the <Import> declaration is correct, and that the file exists on disk.
  21.  
  22.     0 Warning(s)
  23.     1 Error(s)
  24.  
  25. Time Elapsed 00:00:00.01
  26.  
  27.  
  28. Compiling the CXX compiler identification source file "CMakeCXXCompilerId.cpp" failed.
  29. Compiler:  
  30. Build flags:
  31. Id flags:
  32.  
  33. The output was:
  34. 1
  35. Microsoft (R) Build Engine version 4.0.30319.17929
  36. [Microsoft .NET Framework, version 4.0.30319.17929]
  37. Copyright (C) Microsoft Corporation. All rights reserved.
  38.  
  39. Build started 04/04/2015 22:04:34.
  40. Project "C:\hellow\CMakeFiles\3.2.1\CompilerIdCXX\CompilerIdCXX.vcxproj" on node 1 (default targets).
  41. C:\hellow\CMakeFiles\3.2.1\CompilerIdCXX\CompilerIdCXX.vcxproj(17,3): error MSB4019: The imported project "C:\Microsoft.Cpp.Default.props" was not found. Confirm that the path in the <Import> declaration is correct, and that the file exists on disk.
  42. Done Building Project "C:\hellow\CMakeFiles\3.2.1\CompilerIdCXX\CompilerIdCXX.vcxproj" (default targets) -- FAILED.
  43.  
  44. Build FAILED.
  45.  
  46. "C:\hellow\CMakeFiles\3.2.1\CompilerIdCXX\CompilerIdCXX.vcxproj" (default target) (1) ->
  47.   C:\hellow\CMakeFiles\3.2.1\CompilerIdCXX\CompilerIdCXX.vcxproj(17,3): error MSB4019: The imported project "C:\Microsoft.Cpp.Default.props" was not found. Confirm that the path in the <Import> declaration is correct, and that the file exists on disk.
  48.  
  49.     0 Warning(s)
  50.     1 Error(s)
  51.  
  52. Time Elapsed 00:00:00.01
  53.  
  54.  
  55. Compiling the C compiler identification source file "CMakeCCompilerId.c" failed.
  56. Compiler:  
  57. Build flags:
  58. Id flags:
  59.  
  60. The output was:
  61. 1
  62. Microsoft (R) Build Engine version 4.0.30319.17929
  63. [Microsoft .NET Framework, version 4.0.30319.17929]
  64. Copyright (C) Microsoft Corporation. All rights reserved.
  65.  
  66. Build started 04/04/2015 22:04:36.
  67. Project "C:\hellow\CMakeFiles\3.2.1\CompilerIdC\CompilerIdC.vcxproj" on node 1 (default targets).
  68. C:\hellow\CMakeFiles\3.2.1\CompilerIdC\CompilerIdC.vcxproj(17,3): error MSB4019: The imported project "C:\Microsoft.Cpp.Default.props" was not found. Confirm that the path in the <Import> declaration is correct, and that the file exists on disk.
  69. Done Building Project "C:\hellow\CMakeFiles\3.2.1\CompilerIdC\CompilerIdC.vcxproj" (default targets) -- FAILED.
  70.  
  71. Build FAILED.
  72.  
  73. "C:\hellow\CMakeFiles\3.2.1\CompilerIdC\CompilerIdC.vcxproj" (default target) (1) ->
  74.   C:\hellow\CMakeFiles\3.2.1\CompilerIdC\CompilerIdC.vcxproj(17,3): error MSB4019: The imported project "C:\Microsoft.Cpp.Default.props" was not found. Confirm that the path in the <Import> declaration is correct, and that the file exists on disk.
  75.  
  76.     0 Warning(s)
  77.     1 Error(s)
  78.  
  79. Time Elapsed 00:00:00.01
  80.  
  81.  
  82. Compiling the CXX compiler identification source file "CMakeCXXCompilerId.cpp" failed.
  83. Compiler:  
  84. Build flags:
  85. Id flags:
  86.  
  87. The output was:
  88. 1
  89. Microsoft (R) Build Engine version 4.0.30319.17929
  90. [Microsoft .NET Framework, version 4.0.30319.17929]
  91. Copyright (C) Microsoft Corporation. All rights reserved.
  92.  
  93. Build started 04/04/2015 22:04:36.
  94. Project "C:\hellow\CMakeFiles\3.2.1\CompilerIdCXX\CompilerIdCXX.vcxproj" on node 1 (default targets).
  95. C:\hellow\CMakeFiles\3.2.1\CompilerIdCXX\CompilerIdCXX.vcxproj(17,3): error MSB4019: The imported project "C:\Microsoft.Cpp.Default.props" was not found. Confirm that the path in the <Import> declaration is correct, and that the file exists on disk.
  96. Done Building Project "C:\hellow\CMakeFiles\3.2.1\CompilerIdCXX\CompilerIdCXX.vcxproj" (default targets) -- FAILED.
  97.  
  98. Build FAILED.
  99.  
  100. "C:\hellow\CMakeFiles\3.2.1\CompilerIdCXX\CompilerIdCXX.vcxproj" (default target) (1) ->
  101.   C:\hellow\CMakeFiles\3.2.1\CompilerIdCXX\CompilerIdCXX.vcxproj(17,3): error MSB4019: The imported project "C:\Microsoft.Cpp.Default.props" was not found. Confirm that the path in the <Import> declaration is correct, and that the file exists on disk.
  102.  
  103.     0 Warning(s)
  104.     1 Error(s)
  105.  
  106. Time Elapsed 00:00:00.01
RAW Paste Data
We use cookies for various purposes including analytics. By continuing to use Pastebin, you agree to our use of cookies as described in the Cookies Policy. OK, I Understand
 
Top