lamiastella

openxr_error

Dec 14th, 2016
312
0
Never
Not a member of Pastebin yet? Sign Up, it unlocks many cool features!
text 6.13 KB | None | 0 0
  1. 1>------ Build started: Project: IlmImf, Configuration: Debug x64 ------
  2. 1> Building Custom Rule D:/playing-for-data/renderdoc/renderdoc/3rdparty/openexr/OpenEXR/IlmImf/CMakeLists.txt
  3. 1> CMake does not need to re-run because D:\playing-for-data\renderdoc\renderdoc\3rdparty\openexr\OpenEXR\build\IlmImf\CMakeFiles\generate.stamp is up-to-date.
  4. 1> Generating b44ExpLogTable.h
  5. 1>C:\Program Files (x86)\MSBuild\Microsoft.Cpp\v4.0\V140\Microsoft.CppCommon.targets(171,5): error MSB6006: "cmd.exe" exited with code -1073741515.
  6. 2>------ Build started: Project: IlmImfUtil, Configuration: Debug x64 ------
  7. 3>------ Build started: Project: IlmImfExamples, Configuration: Debug x64 ------
  8. 4>------ Build started: Project: IlmImfFuzzTest, Configuration: Debug x64 ------
  9. 5>------ Build started: Project: IlmImfTest, Configuration: Debug x64 ------
  10. 6>------ Build started: Project: exrenvmap, Configuration: Debug x64 ------
  11. 7>------ Build started: Project: exrheader, Configuration: Debug x64 ------
  12. 8>------ Build started: Project: exrmakepreview, Configuration: Debug x64 ------
  13. 9>------ Build started: Project: exrmaketiled, Configuration: Debug x64 ------
  14. 4>LINK : fatal error LNK1104: cannot open file '..\IlmImf\Debug\IlmImf.lib'
  15. 7>LINK : fatal error LNK1104: cannot open file '..\IlmImf\Debug\IlmImf.lib'
  16. 3>LINK : fatal error LNK1104: cannot open file '..\IlmImf\Debug\IlmImf.lib'
  17. 10>------ Build started: Project: exrmultipart, Configuration: Debug x64 ------
  18. 11>------ Build started: Project: exrmultiview, Configuration: Debug x64 ------
  19. 8>LINK : fatal error LNK1104: cannot open file '..\IlmImf\Debug\IlmImf.lib'
  20. 12>------ Build started: Project: exrstdattr, Configuration: Debug x64 ------
  21. 6>LINK : fatal error LNK1104: cannot open file '..\IlmImf\Debug\IlmImf.lib'
  22. 9>LINK : fatal error LNK1104: cannot open file '..\IlmImf\Debug\IlmImf.lib'
  23. 5>LINK : fatal error LNK1104: cannot open file '..\IlmImf\Debug\IlmImf.lib'
  24. 2>LINK : fatal error LNK1104: cannot open file '..\IlmImf\Debug\IlmImf.lib'
  25. 13>------ Build started: Project: IlmImfUtilTest, Configuration: Debug x64 ------
  26. 11>LINK : fatal error LNK1104: cannot open file '..\IlmImf\Debug\IlmImf.lib'
  27. 10>LINK : fatal error LNK1104: cannot open file '..\IlmImf\Debug\IlmImf.lib'
  28. 12>LINK : fatal error LNK1104: cannot open file '..\IlmImf\Debug\IlmImf.lib'
  29. 13>LINK : fatal error LNK1104: cannot open file '..\IlmImfUtil\Debug\IlmImfUtil.lib'
  30. 14>------ Build started: Project: INSTALL, Configuration: Debug x64 ------
  31. 14> -- Install configuration: "Debug"
  32. 14> -- Up-to-date: D:/openexr/include/OpenEXR/OpenEXRConfig.h
  33. 14> -- Up-to-date: D:/openexr/share/doc/OpenEXR-2.2.0/TechnicalIntroduction.pdf
  34. 14> -- Up-to-date: D:/openexr/share/doc/OpenEXR-2.2.0/ReadingAndWritingImageFiles.pdf
  35. 14> -- Up-to-date: D:/openexr/share/doc/OpenEXR-2.2.0/OpenEXRFileLayout.pdf
  36. 14> -- Up-to-date: D:/openexr/share/doc/OpenEXR-2.2.0/MultiViewOpenEXR.pdf
  37. 14> -- Up-to-date: D:/openexr/share/doc/OpenEXR-2.2.0/InterpretingDeepPixels.pdf
  38. 14> -- Up-to-date: D:/openexr/share/doc/OpenEXR-2.2.0/TheoryDeepPixels.pdf
  39. 14> -- Up-to-date: D:/openexr/share/doc/OpenEXR-2.2.0/examples/main.cpp
  40. 14> -- Up-to-date: D:/openexr/share/doc/OpenEXR-2.2.0/examples/drawImage.cpp
  41. 14> -- Up-to-date: D:/openexr/share/doc/OpenEXR-2.2.0/examples/rgbaInterfaceExamples.cpp
  42. 14> -- Up-to-date: D:/openexr/share/doc/OpenEXR-2.2.0/examples/rgbaInterfaceTiledExamples.cpp
  43. 14> -- Up-to-date: D:/openexr/share/doc/OpenEXR-2.2.0/examples/generalInterfaceExamples.cpp
  44. 14> -- Up-to-date: D:/openexr/share/doc/OpenEXR-2.2.0/examples/lowLevelIoExamples.cpp
  45. 14> -- Up-to-date: D:/openexr/share/doc/OpenEXR-2.2.0/examples/previewImageExamples.cpp
  46. 14> -- Up-to-date: D:/openexr/share/doc/OpenEXR-2.2.0/examples/generalInterfaceTiledExamples.cpp
  47. 14> -- Up-to-date: D:/openexr/share/doc/OpenEXR-2.2.0/examples/generalInterfaceTiledExamples.h
  48. 14> -- Up-to-date: D:/openexr/share/doc/OpenEXR-2.2.0/examples/drawImage.h
  49. 14> -- Up-to-date: D:/openexr/share/doc/OpenEXR-2.2.0/examples/rgbaInterfaceExamples.h
  50. 14> -- Up-to-date: D:/openexr/share/doc/OpenEXR-2.2.0/examples/generalInterfaceExamples.h
  51. 14> -- Up-to-date: D:/openexr/share/doc/OpenEXR-2.2.0/examples/rgbaInterfaceTiledExamples.h
  52. 14> -- Up-to-date: D:/openexr/share/doc/OpenEXR-2.2.0/examples/lowLevelIoExamples.h
  53. 14> -- Up-to-date: D:/openexr/share/doc/OpenEXR-2.2.0/examples/previewImageExamples.h
  54. 14> -- Up-to-date: D:/openexr/share/doc/OpenEXR-2.2.0/examples/namespaceAlias.h
  55. 14> CMake Error at IlmImf/cmake_install.cmake:84 (file):
  56. 14> file INSTALL cannot find
  57. 14> "D:/playing-for-data/renderdoc/renderdoc/3rdparty/openexr/OpenEXR/build/IlmImf/Debug/IlmImf.dll".
  58. 14> Call Stack (most recent call first):
  59. 14> cmake_install.cmake:92 (include)
  60. 14>
  61. 14>
  62. 14>C:\Program Files (x86)\MSBuild\Microsoft.Cpp\v4.0\V140\Microsoft.CppCommon.targets(133,5): error MSB3073: The command "setlocal
  63. 14>C:\Program Files (x86)\MSBuild\Microsoft.Cpp\v4.0\V140\Microsoft.CppCommon.targets(133,5): error MSB3073: "C:\Program Files\CMake\bin\cmake.exe" -DBUILD_TYPE=Debug -P cmake_install.cmake
  64. 14>C:\Program Files (x86)\MSBuild\Microsoft.Cpp\v4.0\V140\Microsoft.CppCommon.targets(133,5): error MSB3073: if %errorlevel% neq 0 goto :cmEnd
  65. 14>C:\Program Files (x86)\MSBuild\Microsoft.Cpp\v4.0\V140\Microsoft.CppCommon.targets(133,5): error MSB3073: :cmEnd
  66. 14>C:\Program Files (x86)\MSBuild\Microsoft.Cpp\v4.0\V140\Microsoft.CppCommon.targets(133,5): error MSB3073: endlocal & call :cmErrorLevel %errorlevel% & goto :cmDone
  67. 14>C:\Program Files (x86)\MSBuild\Microsoft.Cpp\v4.0\V140\Microsoft.CppCommon.targets(133,5): error MSB3073: :cmErrorLevel
  68. 14>C:\Program Files (x86)\MSBuild\Microsoft.Cpp\v4.0\V140\Microsoft.CppCommon.targets(133,5): error MSB3073: exit /b %1
  69. 14>C:\Program Files (x86)\MSBuild\Microsoft.Cpp\v4.0\V140\Microsoft.CppCommon.targets(133,5): error MSB3073: :cmDone
  70. 14>C:\Program Files (x86)\MSBuild\Microsoft.Cpp\v4.0\V140\Microsoft.CppCommon.targets(133,5): error MSB3073: if %errorlevel% neq 0 goto :VCEnd
  71. 14>C:\Program Files (x86)\MSBuild\Microsoft.Cpp\v4.0\V140\Microsoft.CppCommon.targets(133,5): error MSB3073: :VCEnd" exited with code 1.
  72. ========== Build: 0 succeeded, 14 failed, 4 up-to-date, 0 skipped ==========
Advertisement
Add Comment
Please, Sign In to add comment