daily pastebin goal
11%
SHARE
TWEET

Untitled

a guest May 1st, 2017 59 Never
Not a member of Pastebin yet? Sign Up, it unlocks many cool features!
  1. ld: cannot find -llapack
  2. make[3]: *** [Makefile:544:
  3. suitesparse-mkl/src/SuiteSparse/lib/libcholmod.so.3.0.11]
  4. Error 1
  5. make[3]: Leaving directory
  6. 'suitesparse-mkl/src/SuiteSparse/CHOLMOD/Lib'
  7. make[2]: *** [Makefile:31: library] Error 2
  8. make[2]: Leaving directory
  9. 'suitesparse-mkl/src/SuiteSparse/CHOLMOD/Lib'
  10. make[1]: *** [Makefile:14: all] Error 2
  11. make[1]: Leaving directory
  12. 'suitesparse-mkl/src/SuiteSparse/CHOLMOD'
  13. make: *** [Makefile:20: go] Error 2
  14. ==> ERROR: A failure occurred in build().
  15.     Aborting...
RAW Paste Data
We use cookies for various purposes including analytics. By continuing to use Pastebin, you agree to our use of cookies as described in the Cookies Policy. OK, I Understand
 
Top