Advertisement
Guest User

Untitled

a guest
Jun 6th, 2019
97
0
Never
Not a member of Pastebin yet? Sign Up, it unlocks many cool features!
text 16.72 KB | None | 0 0
  1. irynah@irynah-Vostro-3560:~/Openmrs-Projects/trunk-5499/openmrs-core$ mvn clean install
  2. [INFO] Scanning for projects...
  3. [INFO] ------------------------------------------------------------------------
  4. [INFO] Reactor Build Order:
  5. [INFO]
  6. [INFO] OpenMRS [pom]
  7. [INFO] openmrs-tools [jar]
  8. [INFO] openmrs-test [pom]
  9. [INFO] openmrs-api [jar]
  10. [INFO] openmrs-web [jar]
  11. [INFO] openmrs-webapp [war]
  12. [INFO]
  13. [INFO] ------------------------< org.openmrs:openmrs >-------------------------
  14. [INFO] Building OpenMRS 2.3.0-SNAPSHOT [1/6]
  15. [INFO] --------------------------------[ pom ]---------------------------------
  16. [INFO]
  17. [INFO] --- maven-clean-plugin:2.5:clean (default-clean) @ openmrs ---
  18. [INFO] Deleting /home/irynah/Openmrs-Projects/trunk-5499/openmrs-core/target
  19. [INFO]
  20. [INFO] --- buildnumber-maven-plugin:1.1:create (default) @ openmrs ---
  21. [INFO] Checking for local modifications: skipped.
  22. [INFO] Updating project files from SCM: skipped.
  23. [INFO] ShortRevision tag detected. The value is '6'.
  24. [INFO] Executing: /bin/sh -c cd /home/irynah/Openmrs-Projects/trunk-5499/openmrs-core && git rev-parse --verify --short=6 HEAD
  25. [INFO] Working directory: /home/irynah/Openmrs-Projects/trunk-5499/openmrs-core
  26. [INFO] Storing buildNumber: bf3fe7 at timestamp: 1559807005823
  27. [INFO] ShortRevision tag detected. The value is '6'.
  28. [INFO] Executing: /bin/sh -c cd /home/irynah/Openmrs-Projects/trunk-5499/openmrs-core && git rev-parse --verify --short=6 HEAD
  29. [INFO] Working directory: /home/irynah/Openmrs-Projects/trunk-5499/openmrs-core
  30. [INFO] Storing buildScmBranch: trunk
  31. [INFO]
  32. [INFO] --- build-helper-maven-plugin:1.5:parse-version (parse-version) @ openmrs ---
  33. [INFO]
  34. [INFO] --- maven-jar-plugin:2.3.2:test-jar (default) @ openmrs ---
  35. [WARNING] JAR will be empty - no content was marked for inclusion!
  36. [INFO] Building jar: /home/irynah/Openmrs-Projects/trunk-5499/openmrs-core/target/openmrs-2.3.0-SNAPSHOT-tests.jar
  37. [INFO]
  38. [INFO] --- license-maven-plugin:3.0:check (default) @ openmrs ---
  39. [INFO] Checking licenses...
  40. [INFO]
  41. [INFO] --- maven-install-plugin:2.4:install (default-install) @ openmrs ---
  42. [INFO] Installing /home/irynah/Openmrs-Projects/trunk-5499/openmrs-core/pom.xml to /home/irynah/.m2/repository/org/openmrs/openmrs/2.3.0-SNAPSHOT/openmrs-2.3.0-SNAPSHOT.pom
  43. [INFO] Installing /home/irynah/Openmrs-Projects/trunk-5499/openmrs-core/target/openmrs-2.3.0-SNAPSHOT-tests.jar to /home/irynah/.m2/repository/org/openmrs/openmrs/2.3.0-SNAPSHOT/openmrs-2.3.0-SNAPSHOT-tests.jar
  44. [INFO]
  45. [INFO] ------------------< org.openmrs.tools:openmrs-tools >-------------------
  46. [INFO] Building openmrs-tools 2.3.0-SNAPSHOT [2/6]
  47. [INFO] --------------------------------[ jar ]---------------------------------
  48. [INFO]
  49. [INFO] --- maven-clean-plugin:2.5:clean (default-clean) @ openmrs-tools ---
  50. [INFO] Deleting /home/irynah/Openmrs-Projects/trunk-5499/openmrs-core/tools/target
  51. [INFO]
  52. [INFO] --- buildnumber-maven-plugin:1.1:create (default) @ openmrs-tools ---
  53. [INFO]
  54. [INFO] --- build-helper-maven-plugin:1.5:parse-version (parse-version) @ openmrs-tools ---
  55. [INFO]
  56. [INFO] --- maven-resources-plugin:2.4:resources (default-resources) @ openmrs-tools ---
  57. [INFO] Using 'UTF-8' encoding to copy filtered resources.
  58. [INFO] Copying 4 resources
  59. [INFO]
  60. [INFO] --- maven-compiler-plugin:2.1:compile (default-compile) @ openmrs-tools ---
  61. [INFO] Compiling 1 source file to /home/irynah/Openmrs-Projects/trunk-5499/openmrs-core/tools/target/classes
  62. [INFO]
  63. [INFO] --- maven-resources-plugin:2.4:testResources (default-testResources) @ openmrs-tools ---
  64. [INFO] Using 'UTF-8' encoding to copy filtered resources.
  65. [INFO] skip non existing resourceDirectory /home/irynah/Openmrs-Projects/trunk-5499/openmrs-core/tools/src/test/resources
  66. [INFO]
  67. [INFO] --- maven-compiler-plugin:2.1:testCompile (default-testCompile) @ openmrs-tools ---
  68. [INFO] No sources to compile
  69. [INFO]
  70. [INFO] --- maven-surefire-plugin:2.18.1:test (default-test) @ openmrs-tools ---
  71. [INFO] No tests to run.
  72. [INFO]
  73. [INFO] --- maven-jar-plugin:2.3.2:jar (default-jar) @ openmrs-tools ---
  74. [INFO] Building jar: /home/irynah/Openmrs-Projects/trunk-5499/openmrs-core/tools/target/openmrs-tools-2.3.0-SNAPSHOT.jar
  75. [INFO]
  76. [INFO] --- maven-jar-plugin:2.3.2:test-jar (default) @ openmrs-tools ---
  77. [WARNING] JAR will be empty - no content was marked for inclusion!
  78. [INFO] Building jar: /home/irynah/Openmrs-Projects/trunk-5499/openmrs-core/tools/target/openmrs-tools-2.3.0-SNAPSHOT-tests.jar
  79. [INFO]
  80. [INFO] --- license-maven-plugin:3.0:check (default) @ openmrs-tools ---
  81. [INFO] Checking licenses...
  82. [INFO]
  83. [INFO] --- maven-install-plugin:2.4:install (default-install) @ openmrs-tools ---
  84. [INFO] Installing /home/irynah/Openmrs-Projects/trunk-5499/openmrs-core/tools/target/openmrs-tools-2.3.0-SNAPSHOT.jar to /home/irynah/.m2/repository/org/openmrs/tools/openmrs-tools/2.3.0-SNAPSHOT/openmrs-tools-2.3.0-SNAPSHOT.jar
  85. [INFO] Installing /home/irynah/Openmrs-Projects/trunk-5499/openmrs-core/tools/pom.xml to /home/irynah/.m2/repository/org/openmrs/tools/openmrs-tools/2.3.0-SNAPSHOT/openmrs-tools-2.3.0-SNAPSHOT.pom
  86. [INFO] Installing /home/irynah/Openmrs-Projects/trunk-5499/openmrs-core/tools/target/openmrs-tools-2.3.0-SNAPSHOT-tests.jar to /home/irynah/.m2/repository/org/openmrs/tools/openmrs-tools/2.3.0-SNAPSHOT/openmrs-tools-2.3.0-SNAPSHOT-tests.jar
  87. [INFO]
  88. [INFO] -------------------< org.openmrs.test:openmrs-test >--------------------
  89. [INFO] Building openmrs-test 2.3.0-SNAPSHOT [3/6]
  90. [INFO] --------------------------------[ pom ]---------------------------------
  91. [INFO]
  92. [INFO] --- maven-clean-plugin:2.5:clean (default-clean) @ openmrs-test ---
  93. [INFO] Deleting /home/irynah/Openmrs-Projects/trunk-5499/openmrs-core/test/target
  94. [INFO]
  95. [INFO] --- buildnumber-maven-plugin:1.1:create (default) @ openmrs-test ---
  96. [INFO]
  97. [INFO] --- build-helper-maven-plugin:1.5:parse-version (parse-version) @ openmrs-test ---
  98. [INFO]
  99. [INFO] --- maven-jar-plugin:2.3.2:test-jar (default) @ openmrs-test ---
  100. [WARNING] JAR will be empty - no content was marked for inclusion!
  101. [INFO] Building jar: /home/irynah/Openmrs-Projects/trunk-5499/openmrs-core/test/target/openmrs-test-2.3.0-SNAPSHOT-tests.jar
  102. [INFO]
  103. [INFO] --- license-maven-plugin:3.0:check (default) @ openmrs-test ---
  104. [INFO] Checking licenses...
  105. [INFO]
  106. [INFO] --- maven-install-plugin:2.4:install (default-install) @ openmrs-test ---
  107. [INFO] Installing /home/irynah/Openmrs-Projects/trunk-5499/openmrs-core/test/pom.xml to /home/irynah/.m2/repository/org/openmrs/test/openmrs-test/2.3.0-SNAPSHOT/openmrs-test-2.3.0-SNAPSHOT.pom
  108. [INFO] Installing /home/irynah/Openmrs-Projects/trunk-5499/openmrs-core/test/target/openmrs-test-2.3.0-SNAPSHOT-tests.jar to /home/irynah/.m2/repository/org/openmrs/test/openmrs-test/2.3.0-SNAPSHOT/openmrs-test-2.3.0-SNAPSHOT-tests.jar
  109. [INFO]
  110. [INFO] --------------------< org.openmrs.api:openmrs-api >---------------------
  111. [INFO] Building openmrs-api 2.3.0-SNAPSHOT [4/6]
  112. [INFO] --------------------------------[ jar ]---------------------------------
  113. Downloading from openmrs-repo: http://mavenrepo.openmrs.org/nexus/content/repositories/public/org/hibernate/hibernate-c3p0/4.3.10.Final/hibernate-c3p0-4.3.10.Final.jar
  114. Downloading from openmrs-repo: http://mavenrepo.openmrs.org/nexus/content/repositories/public/org/hibernate/hibernate-ehcache/4.3.10.Final/hibernate-ehcache-4.3.10.Final.jar
  115. Downloading from openmrs-repo: http://mavenrepo.openmrs.org/nexus/content/repositories/public/org/hibernate/hibernate-core/4.3.10.Final/hibernate-core-4.3.10.Final.jar
  116. Downloaded from openmrs-repo: http://mavenrepo.openmrs.org/nexus/content/repositories/public/org/hibernate/hibernate-ehcache/4.3.10.Final/hibernate-ehcache-4.3.10.Final.jar (136 kB at 9.5 kB/s)
  117. Downloaded from openmrs-repo: http://mavenrepo.openmrs.org/nexus/content/repositories/public/org/hibernate/hibernate-c3p0/4.3.10.Final/hibernate-c3p0-4.3.10.Final.jar (40 kB at 1.8 kB/s)
  118. Downloaded from openmrs-repo: http://mavenrepo.openmrs.org/nexus/content/repositories/public/org/hibernate/hibernate-core/4.3.10.Final/hibernate-core-4.3.10.Final.jar (5.3 MB at 24 kB/s)
  119. [INFO]
  120. [INFO] --- maven-clean-plugin:2.5:clean (default-clean) @ openmrs-api ---
  121. [INFO] Deleting /home/irynah/Openmrs-Projects/trunk-5499/openmrs-core/api/target
  122. [INFO]
  123. [INFO] --- buildnumber-maven-plugin:1.1:create (default) @ openmrs-api ---
  124. [INFO]
  125. [INFO] --- build-helper-maven-plugin:1.5:parse-version (parse-version) @ openmrs-api ---
  126. [INFO]
  127. [INFO] --- jacoco-maven-plugin:0.8.0:prepare-agent (prepare-agent) @ openmrs-api ---
  128. [INFO] argLine set to -javaagent:/home/irynah/.m2/repository/org/jacoco/org.jacoco.agent/0.8.0/org.jacoco.agent-0.8.0-runtime.jar=destfile=/home/irynah/Openmrs-Projects/trunk-5499/openmrs-core/api/target/jacoco.exec,includes=org/openmrs/** -Duser.language=en -Duser.region=US -Xmx2g
  129. [INFO]
  130. [INFO] --- maven-java-formatter-plugin:0.3:format (default) @ openmrs-api ---
  131. [INFO] Using 'UTF-8' encoding to format source files.
  132. [INFO] Number of files to be formatted: 1030
  133. [INFO] Successfully formatted: 0 file(s)
  134. [INFO] Fail to format : 0 file(s)
  135. [INFO] Skipped : 1030 file(s)
  136. [INFO] Approximate time taken: 4s
  137. [INFO]
  138. [INFO] --- maven-resources-plugin:2.4:resources (default-resources) @ openmrs-api ---
  139. [INFO] Using 'UTF-8' encoding to copy filtered resources.
  140. [INFO] Copying 1 resource
  141. [INFO] Copying 133 resources
  142. [INFO]
  143. [INFO] --- maven-compiler-plugin:2.1:compile (default-compile) @ openmrs-api ---
  144. [INFO] Compiling 696 source files to /home/irynah/Openmrs-Projects/trunk-5499/openmrs-core/api/target/classes
  145. [INFO] -------------------------------------------------------------
  146. [ERROR] COMPILATION ERROR :
  147. [INFO] -------------------------------------------------------------
  148. [ERROR] /home/irynah/Openmrs-Projects/trunk-5499/openmrs-core/api/src/main/java/org/openmrs/api/db/hibernate/search/TermsFilterFactory.java:[26,39] error: cannot find symbol
  149.  
  150. [ERROR] package org.hibernate.search.filter.impl
  151. /home/irynah/Openmrs-Projects/trunk-5499/openmrs-core/api/src/main/java/org/openmrs/api/db/hibernate/search/TermsFilterFactory.java:[75,13] error: cannot find symbol
  152.  
  153. [ERROR] class TermsFilterFactory
  154. /home/irynah/Openmrs-Projects/trunk-5499/openmrs-core/api/src/main/java/org/openmrs/api/db/hibernate/search/LuceneQuery.java:[302,7] error: cannot access QueryImplementor
  155.  
  156. [ERROR] class file for org.hibernate.query.spi.QueryImplementor not found
  157. /home/irynah/Openmrs-Projects/trunk-5499/openmrs-core/api/src/main/java/org/openmrs/api/db/hibernate/search/LuceneQuery.java:[303,34] error: cannot find symbol
  158.  
  159. [ERROR] variable query of type FullTextQuery
  160. /home/irynah/Openmrs-Projects/trunk-5499/openmrs-core/api/src/main/java/org/openmrs/api/db/hibernate/search/LuceneQuery.java:[338,29] error: cannot find symbol
  161.  
  162. [ERROR] interface FullTextQuery
  163. /home/irynah/Openmrs-Projects/trunk-5499/openmrs-core/api/src/main/java/org/openmrs/api/db/hibernate/search/LuceneQuery.java:[350,29] error: cannot find symbol
  164.  
  165. [ERROR] interface FullTextQuery
  166. /home/irynah/Openmrs-Projects/trunk-5499/openmrs-core/api/src/main/java/org/openmrs/api/db/hibernate/search/LuceneQuery.java:[365,30] error: cannot find symbol
  167.  
  168. [ERROR] variable fullTextQuery of type FullTextQuery
  169. /home/irynah/Openmrs-Projects/trunk-5499/openmrs-core/api/src/main/java/org/openmrs/api/db/hibernate/search/LuceneQuery.java:[392,37] error: cannot find symbol
  170.  
  171. [ERROR] variable fullTextQuery of type FullTextQuery
  172. /home/irynah/Openmrs-Projects/trunk-5499/openmrs-core/api/src/main/java/org/openmrs/api/db/hibernate/search/LuceneQuery.java:[408,37] error: cannot find symbol
  173.  
  174. [ERROR] variable fullTextQuery of type FullTextQuery
  175. /home/irynah/Openmrs-Projects/trunk-5499/openmrs-core/api/src/main/java/org/openmrs/api/db/hibernate/HibernateContextDAO.java:[472,31] error: reference to getFlushMode is ambiguous
  176.  
  177. [ERROR] both method getFlushMode() in EntityManager and method getFlushMode() in Session match
  178. /home/irynah/Openmrs-Projects/trunk-5499/openmrs-core/api/src/main/java/org/openmrs/api/db/hibernate/HibernateContextDAO.java:[472,44] error: incompatible types: FlushModeType cannot be converted to FlushMode
  179.  
  180. [INFO] 11 errors
  181. [INFO] -------------------------------------------------------------
  182. [INFO] ------------------------------------------------------------------------
  183. [INFO] Reactor Summary for OpenMRS 2.3.0-SNAPSHOT:
  184. [INFO]
  185. [INFO] OpenMRS ............................................ SUCCESS [ 2.484 s]
  186. [INFO] openmrs-tools ...................................... SUCCESS [ 1.264 s]
  187. [INFO] openmrs-test ....................................... SUCCESS [ 0.177 s]
  188. [INFO] openmrs-api ........................................ FAILURE [03:55 min]
  189. [INFO] openmrs-web ........................................ SKIPPED
  190. [INFO] openmrs-webapp ..................................... SKIPPED
  191. [INFO] ------------------------------------------------------------------------
  192. [INFO] BUILD FAILURE
  193. [INFO] ------------------------------------------------------------------------
  194. [INFO] Total time: 03:59 min
  195. [INFO] Finished at: 2019-06-06T10:47:24+03:00
  196. [INFO] ------------------------------------------------------------------------
  197. [ERROR] Failed to execute goal org.apache.maven.plugins:maven-compiler-plugin:2.1:compile (default-compile) on project openmrs-api: Compilation failure: Compilation failure:
  198. [ERROR] /home/irynah/Openmrs-Projects/trunk-5499/openmrs-core/api/src/main/java/org/openmrs/api/db/hibernate/search/TermsFilterFactory.java:[26,39] error: cannot find symbol
  199. [ERROR]
  200. [ERROR] package org.hibernate.search.filter.impl
  201. [ERROR] /home/irynah/Openmrs-Projects/trunk-5499/openmrs-core/api/src/main/java/org/openmrs/api/db/hibernate/search/TermsFilterFactory.java:[75,13] error: cannot find symbol
  202. [ERROR]
  203. [ERROR] class TermsFilterFactory
  204. [ERROR] /home/irynah/Openmrs-Projects/trunk-5499/openmrs-core/api/src/main/java/org/openmrs/api/db/hibernate/search/LuceneQuery.java:[302,7] error: cannot access QueryImplementor
  205. [ERROR]
  206. [ERROR] class file for org.hibernate.query.spi.QueryImplementor not found
  207. [ERROR] /home/irynah/Openmrs-Projects/trunk-5499/openmrs-core/api/src/main/java/org/openmrs/api/db/hibernate/search/LuceneQuery.java:[303,34] error: cannot find symbol
  208. [ERROR]
  209. [ERROR] variable query of type FullTextQuery
  210. [ERROR] /home/irynah/Openmrs-Projects/trunk-5499/openmrs-core/api/src/main/java/org/openmrs/api/db/hibernate/search/LuceneQuery.java:[338,29] error: cannot find symbol
  211. [ERROR]
  212. [ERROR] interface FullTextQuery
  213. [ERROR] /home/irynah/Openmrs-Projects/trunk-5499/openmrs-core/api/src/main/java/org/openmrs/api/db/hibernate/search/LuceneQuery.java:[350,29] error: cannot find symbol
  214. [ERROR]
  215. [ERROR] interface FullTextQuery
  216. [ERROR] /home/irynah/Openmrs-Projects/trunk-5499/openmrs-core/api/src/main/java/org/openmrs/api/db/hibernate/search/LuceneQuery.java:[365,30] error: cannot find symbol
  217. [ERROR]
  218. [ERROR] variable fullTextQuery of type FullTextQuery
  219. [ERROR] /home/irynah/Openmrs-Projects/trunk-5499/openmrs-core/api/src/main/java/org/openmrs/api/db/hibernate/search/LuceneQuery.java:[392,37] error: cannot find symbol
  220. [ERROR]
  221. [ERROR] variable fullTextQuery of type FullTextQuery
  222. [ERROR] /home/irynah/Openmrs-Projects/trunk-5499/openmrs-core/api/src/main/java/org/openmrs/api/db/hibernate/search/LuceneQuery.java:[408,37] error: cannot find symbol
  223. [ERROR]
  224. [ERROR] variable fullTextQuery of type FullTextQuery
  225. [ERROR] /home/irynah/Openmrs-Projects/trunk-5499/openmrs-core/api/src/main/java/org/openmrs/api/db/hibernate/HibernateContextDAO.java:[472,31] error: reference to getFlushMode is ambiguous
  226. [ERROR]
  227. [ERROR] both method getFlushMode() in EntityManager and method getFlushMode() in Session match
  228. [ERROR] /home/irynah/Openmrs-Projects/trunk-5499/openmrs-core/api/src/main/java/org/openmrs/api/db/hibernate/HibernateContextDAO.java:[472,44] error: incompatible types: FlushModeType cannot be converted to FlushMode
  229. [ERROR] -> [Help 1]
  230. [ERROR]
  231. [ERROR] To see the full stack trace of the errors, re-run Maven with the -e switch.
  232. [ERROR] Re-run Maven using the -X switch to enable full debug logging.
  233. [ERROR]
  234. [ERROR] For more information about the errors and possible solutions, please read the following articles:
  235. [ERROR] [Help 1] http://cwiki.apache.org/confluence/display/MAVEN/MojoFailureException
  236. [ERROR]
  237. [ERROR] After correcting the problems, you can resume the build with the command
  238. [ERROR] mvn <goals> -rf :openmrs-api
  239. irynah@irynah-Vostro-3560:~/Openmrs-Projects/trunk-5499/openmrs-core$
Advertisement
Add Comment
Please, Sign In to add comment
Advertisement