SHARE
TWEET

Untitled

a guest Aug 25th, 2017 62 Never
Not a member of Pastebin yet? Sign Up, it unlocks many cool features!
  1. sam@pc-debian:~/minetest$ make -j 4
  2. Scanning dependencies of target jsoncpp
  3. Scanning dependencies of target GenerateVersion
  4. [  0%] [ 11%] Building CXX object lib/jsoncpp/CMakeFiles/jsoncpp.dir/jsoncpp.cpp.o
  5. Built target lua
  6. -- *** Detected Git version 0.5.0-dev-f6a33a1 ***
  7. [ 11%] Built target GenerateVersion
  8. Linking CXX static library libjsoncpp.a
  9. [ 11%] Built target jsoncpp
  10. Scanning dependencies of target minetest
  11. [ 12%] [ 12%] [ 12%] [ 13%] Building CXX object src/CMakeFiles/minetest.dir/client/inputhandler.cpp.o
  12. Building CXX object src/CMakeFiles/minetest.dir/client/renderingengine.cpp.o
  13. Building CXX object src/CMakeFiles/minetest.dir/client/joystick_controller.cpp.o
  14. Building CXX object src/CMakeFiles/minetest.dir/client/clientlauncher.cpp.o
  15. [ 13%] Building CXX object src/CMakeFiles/minetest.dir/client/tile.cpp.o
  16. [ 14%] Building CXX object src/CMakeFiles/minetest.dir/irrlicht_changes/CGUITTFont.cpp.o
  17. [ 14%] Building CXX object src/CMakeFiles/minetest.dir/irrlicht_changes/static_text.cpp.o
  18. [ 14%] Building CXX object src/CMakeFiles/minetest.dir/network/address.cpp.o
  19. [ 15%] Building CXX object src/CMakeFiles/minetest.dir/network/clientopcodes.cpp.o
  20. [ 15%] Building CXX object src/CMakeFiles/minetest.dir/network/clientpackethandler.cpp.o
  21. [ 15%] Building CXX object src/CMakeFiles/minetest.dir/network/connection.cpp.o
  22. [ 16%] Building CXX object src/CMakeFiles/minetest.dir/network/networkpacket.cpp.o
  23. [ 16%] Building CXX object src/CMakeFiles/minetest.dir/network/serveropcodes.cpp.o
  24. [ 17%] Building CXX object src/CMakeFiles/minetest.dir/network/serverpackethandler.cpp.o
  25. [ 17%] Building CXX object src/CMakeFiles/minetest.dir/network/socket.cpp.o
  26. [ 17%] Building CXX object src/CMakeFiles/minetest.dir/script/common/c_content.cpp.o
  27. [ 18%] Building CXX object src/CMakeFiles/minetest.dir/script/common/c_converter.cpp.o
  28. [ 18%] Building CXX object src/CMakeFiles/minetest.dir/script/common/c_internal.cpp.o
  29. [ 19%] Building CXX object src/CMakeFiles/minetest.dir/script/common/c_types.cpp.o
  30. [ 19%] Building CXX object src/CMakeFiles/minetest.dir/script/cpp_api/s_async.cpp.o
  31. [ 19%] Building CXX object src/CMakeFiles/minetest.dir/script/cpp_api/s_base.cpp.o
  32. [ 20%] Building CXX object src/CMakeFiles/minetest.dir/script/cpp_api/s_client.cpp.o
  33. [ 20%] Building CXX object src/CMakeFiles/minetest.dir/script/cpp_api/s_entity.cpp.o
  34. [ 21%] Building CXX object src/CMakeFiles/minetest.dir/script/cpp_api/s_env.cpp.o
  35. [ 21%] Building CXX object src/CMakeFiles/minetest.dir/script/cpp_api/s_inventory.cpp.o
  36. [ 21%] Building CXX object src/CMakeFiles/minetest.dir/script/cpp_api/s_item.cpp.o
  37. [ 22%] Building CXX object src/CMakeFiles/minetest.dir/script/cpp_api/s_mainmenu.cpp.o
  38. [ 22%] Building CXX object src/CMakeFiles/minetest.dir/script/cpp_api/s_node.cpp.o
  39. [ 22%] Building CXX object src/CMakeFiles/minetest.dir/script/cpp_api/s_nodemeta.cpp.o
  40. [ 23%] Building CXX object src/CMakeFiles/minetest.dir/script/cpp_api/s_player.cpp.o
  41. [ 23%] Building CXX object src/CMakeFiles/minetest.dir/script/cpp_api/s_security.cpp.o
  42. [ 24%] Building CXX object src/CMakeFiles/minetest.dir/script/cpp_api/s_server.cpp.o
  43. [ 24%] Building CXX object src/CMakeFiles/minetest.dir/script/lua_api/l_areastore.cpp.o
  44. [ 24%] Building CXX object src/CMakeFiles/minetest.dir/script/lua_api/l_base.cpp.o
  45. [ 25%] Building CXX object src/CMakeFiles/minetest.dir/script/lua_api/l_camera.cpp.o
  46. [ 25%] Building CXX object src/CMakeFiles/minetest.dir/script/lua_api/l_client.cpp.o
  47. [ 26%] Building CXX object src/CMakeFiles/minetest.dir/script/lua_api/l_craft.cpp.o
  48. [ 26%] Building CXX object src/CMakeFiles/minetest.dir/script/lua_api/l_env.cpp.o
  49. [ 26%] Building CXX object src/CMakeFiles/minetest.dir/script/lua_api/l_http.cpp.o
  50. [ 27%] Building CXX object src/CMakeFiles/minetest.dir/script/lua_api/l_inventory.cpp.o
  51. [ 27%] Building CXX object src/CMakeFiles/minetest.dir/script/lua_api/l_item.cpp.o
  52. [ 28%] Building CXX object src/CMakeFiles/minetest.dir/script/lua_api/l_itemstackmeta.cpp.o
  53. [ 28%] Building CXX object src/CMakeFiles/minetest.dir/script/lua_api/l_localplayer.cpp.o
  54. [ 28%] Building CXX object src/CMakeFiles/minetest.dir/script/lua_api/l_mainmenu.cpp.o
  55. [ 29%] Building CXX object src/CMakeFiles/minetest.dir/script/lua_api/l_mapgen.cpp.o
  56. [ 29%] Building CXX object src/CMakeFiles/minetest.dir/script/lua_api/l_metadata.cpp.o
  57. [ 29%] Building CXX object src/CMakeFiles/minetest.dir/script/lua_api/l_minimap.cpp.o
  58. [ 30%] Building CXX object src/CMakeFiles/minetest.dir/script/lua_api/l_nodemeta.cpp.o
  59. [ 30%] Building CXX object src/CMakeFiles/minetest.dir/script/lua_api/l_nodetimer.cpp.o
  60. [ 31%] Building CXX object src/CMakeFiles/minetest.dir/script/lua_api/l_noise.cpp.o
  61. [ 31%] Building CXX object src/CMakeFiles/minetest.dir/script/lua_api/l_object.cpp.o
  62. [ 31%] Building CXX object src/CMakeFiles/minetest.dir/script/lua_api/l_particles.cpp.o
  63. [ 32%] Building CXX object src/CMakeFiles/minetest.dir/script/lua_api/l_rollback.cpp.o
  64. [ 32%] Building CXX object src/CMakeFiles/minetest.dir/script/lua_api/l_server.cpp.o
  65. [ 33%] [ 33%] Building CXX object src/CMakeFiles/minetest.dir/script/lua_api/l_settings.cpp.o
  66. Building CXX object src/CMakeFiles/minetest.dir/script/lua_api/l_sound.cpp.o
  67. [ 33%] Building CXX object src/CMakeFiles/minetest.dir/script/lua_api/l_storage.cpp.o
  68. [ 34%] Building CXX object src/CMakeFiles/minetest.dir/script/lua_api/l_util.cpp.o
  69. [ 34%] Building CXX object src/CMakeFiles/minetest.dir/script/lua_api/l_vmanip.cpp.o
  70. [ 35%] Building CXX object src/CMakeFiles/minetest.dir/script/scripting_client.cpp.o
  71. [ 35%] Building CXX object src/CMakeFiles/minetest.dir/script/scripting_mainmenu.cpp.o
  72. [ 35%] Building CXX object src/CMakeFiles/minetest.dir/script/scripting_server.cpp.o
  73. [ 36%] Building CXX object src/CMakeFiles/minetest.dir/threading/event.cpp.o
  74. [ 36%] Building CXX object src/CMakeFiles/minetest.dir/threading/semaphore.cpp.o
  75. [ 36%] Building CXX object src/CMakeFiles/minetest.dir/threading/thread.cpp.o
  76. [ 37%] Building CXX object src/CMakeFiles/minetest.dir/unittest/test.cpp.o
  77. [ 37%] Building CXX object src/CMakeFiles/minetest.dir/unittest/test_areastore.cpp.o
  78. [ 38%] Building CXX object src/CMakeFiles/minetest.dir/unittest/test_collision.cpp.o
  79. [ 38%] Building CXX object src/CMakeFiles/minetest.dir/unittest/test_compression.cpp.o
  80. [ 38%] Building CXX object src/CMakeFiles/minetest.dir/unittest/test_connection.cpp.o
  81. [ 39%] Building CXX object src/CMakeFiles/minetest.dir/unittest/test_filepath.cpp.o
  82. [ 39%] Building CXX object src/CMakeFiles/minetest.dir/unittest/test_inventory.cpp.o
  83. [ 40%] Building CXX object src/CMakeFiles/minetest.dir/unittest/test_keycode.cpp.o
  84. [ 40%] Building CXX object src/CMakeFiles/minetest.dir/unittest/test_map_settings_manager.cpp.o
  85. [ 40%] Building CXX object src/CMakeFiles/minetest.dir/unittest/test_mapnode.cpp.o
  86. [ 41%] Building CXX object src/CMakeFiles/minetest.dir/unittest/test_nodedef.cpp.o
  87. [ 41%] Building CXX object src/CMakeFiles/minetest.dir/unittest/test_noderesolver.cpp.o
  88. [ 42%] Building CXX object src/CMakeFiles/minetest.dir/unittest/test_noise.cpp.o
  89. [ 42%] Building CXX object src/CMakeFiles/minetest.dir/unittest/test_objdef.cpp.o
  90. [ 42%] Building CXX object src/CMakeFiles/minetest.dir/unittest/test_player.cpp.o
  91. [ 43%] Building CXX object src/CMakeFiles/minetest.dir/unittest/test_profiler.cpp.o
  92. [ 43%] Building CXX object src/CMakeFiles/minetest.dir/unittest/test_random.cpp.o
  93. [ 43%] Building CXX object src/CMakeFiles/minetest.dir/unittest/test_schematic.cpp.o
  94. [ 44%] Building CXX object src/CMakeFiles/minetest.dir/unittest/test_serialization.cpp.o
  95. [ 44%] Building CXX object src/CMakeFiles/minetest.dir/unittest/test_settings.cpp.o
  96. [ 45%] Building CXX object src/CMakeFiles/minetest.dir/unittest/test_socket.cpp.o
  97. [ 45%] Building CXX object src/CMakeFiles/minetest.dir/unittest/test_threading.cpp.o
  98. [ 45%] Building CXX object src/CMakeFiles/minetest.dir/unittest/test_utilities.cpp.o
  99. [ 46%] Building CXX object src/CMakeFiles/minetest.dir/unittest/test_voxelalgorithms.cpp.o
  100. [ 46%] Building CXX object src/CMakeFiles/minetest.dir/unittest/test_voxelmanipulator.cpp.o
  101. [ 47%] Building CXX object src/CMakeFiles/minetest.dir/util/areastore.cpp.o
  102. [ 47%] Building CXX object src/CMakeFiles/minetest.dir/util/auth.cpp.o
  103. [ 47%] Building CXX object src/CMakeFiles/minetest.dir/util/base64.cpp.o
  104. [ 48%] Building CXX object src/CMakeFiles/minetest.dir/util/directiontables.cpp.o
  105. [ 48%] [ 49%] Building CXX object src/CMakeFiles/minetest.dir/util/enriched_string.cpp.o
  106. Building CXX object src/CMakeFiles/minetest.dir/util/numeric.cpp.o
  107. [ 49%] Building CXX object src/CMakeFiles/minetest.dir/util/pointedthing.cpp.o
  108. [ 49%] Building CXX object src/CMakeFiles/minetest.dir/util/serialize.cpp.o
  109. [ 50%] Building CXX object src/CMakeFiles/minetest.dir/util/sha1.cpp.o
  110. [ 50%] Building C object src/CMakeFiles/minetest.dir/util/sha256.c.o
  111. [ 50%] Building CXX object src/CMakeFiles/minetest.dir/util/srp.cpp.o
  112. [ 51%] Building CXX object src/CMakeFiles/minetest.dir/util/string.cpp.o
  113. [ 51%] Building CXX object src/CMakeFiles/minetest.dir/util/timetaker.cpp.o
  114. [ 52%] Building CXX object src/CMakeFiles/minetest.dir/ban.cpp.o
  115. [ 52%] Building CXX object src/CMakeFiles/minetest.dir/camera.cpp.o
  116. [ 52%] Building CXX object src/CMakeFiles/minetest.dir/cavegen.cpp.o
  117. [ 53%] Building CXX object src/CMakeFiles/minetest.dir/chat.cpp.o
  118. [ 53%] Building CXX object src/CMakeFiles/minetest.dir/client.cpp.o
  119. [ 54%] Building CXX object src/CMakeFiles/minetest.dir/clientenvironment.cpp.o
  120. [ 54%] Building CXX object src/CMakeFiles/minetest.dir/clientiface.cpp.o
  121. [ 54%] Building CXX object src/CMakeFiles/minetest.dir/clientmap.cpp.o
  122. [ 55%] Building CXX object src/CMakeFiles/minetest.dir/clientmedia.cpp.o
  123. [ 55%] Building CXX object src/CMakeFiles/minetest.dir/clientobject.cpp.o
  124. [ 56%] Building CXX object src/CMakeFiles/minetest.dir/clouds.cpp.o
  125. [ 56%] Building CXX object src/CMakeFiles/minetest.dir/collision.cpp.o
  126. [ 56%] Building CXX object src/CMakeFiles/minetest.dir/content_cao.cpp.o
  127. [ 57%] Building CXX object src/CMakeFiles/minetest.dir/content_cso.cpp.o
  128. [ 57%] Building CXX object src/CMakeFiles/minetest.dir/content_mapblock.cpp.o
  129. [ 57%] Building CXX object src/CMakeFiles/minetest.dir/content_mapnode.cpp.o
  130. [ 58%] Building CXX object src/CMakeFiles/minetest.dir/content_nodemeta.cpp.o
  131. [ 58%] Building CXX object src/CMakeFiles/minetest.dir/content_sao.cpp.o
  132. [ 59%] Building CXX object src/CMakeFiles/minetest.dir/convert_json.cpp.o
  133. [ 59%] Building CXX object src/CMakeFiles/minetest.dir/craftdef.cpp.o
  134. [ 59%] Building CXX object src/CMakeFiles/minetest.dir/database-dummy.cpp.o
  135. [ 60%] Building CXX object src/CMakeFiles/minetest.dir/database-files.cpp.o
  136. [ 60%] Building CXX object src/CMakeFiles/minetest.dir/database-leveldb.cpp.o
  137. [ 61%] Building CXX object src/CMakeFiles/minetest.dir/database-postgresql.cpp.o
  138. [ 61%] Building CXX object src/CMakeFiles/minetest.dir/database-redis.cpp.o
  139. [ 61%] Building CXX object src/CMakeFiles/minetest.dir/database-sqlite3.cpp.o
  140. [ 62%] Building CXX object src/CMakeFiles/minetest.dir/database.cpp.o
  141. [ 62%] Building CXX object src/CMakeFiles/minetest.dir/debug.cpp.o
  142. [ 63%] Building CXX object src/CMakeFiles/minetest.dir/defaultsettings.cpp.o
  143. [ 63%] Building CXX object src/CMakeFiles/minetest.dir/dungeongen.cpp.o
  144. [ 63%] Building CXX object src/CMakeFiles/minetest.dir/emerge.cpp.o
  145. [ 64%] Building CXX object src/CMakeFiles/minetest.dir/environment.cpp.o
  146. [ 64%] Building CXX object src/CMakeFiles/minetest.dir/face_position_cache.cpp.o
  147. [ 64%] Building CXX object src/CMakeFiles/minetest.dir/filecache.cpp.o
  148. [ 65%] Building CXX object src/CMakeFiles/minetest.dir/filesys.cpp.o
  149. [ 65%] Building CXX object src/CMakeFiles/minetest.dir/fontengine.cpp.o
  150. [ 66%] Building CXX object src/CMakeFiles/minetest.dir/game.cpp.o
  151. [ 66%] Building CXX object src/CMakeFiles/minetest.dir/genericobject.cpp.o
  152. [ 66%] Building CXX object src/CMakeFiles/minetest.dir/gettext.cpp.o
  153. [ 67%] Building CXX object src/CMakeFiles/minetest.dir/guiChatConsole.cpp.o
  154. [ 67%] Building CXX object src/CMakeFiles/minetest.dir/guiEngine.cpp.o
  155. [ 68%] Building CXX object src/CMakeFiles/minetest.dir/guiFormSpecMenu.cpp.o
  156. [ 68%] Building CXX object src/CMakeFiles/minetest.dir/guiKeyChangeMenu.cpp.o
  157. [ 68%] Building CXX object src/CMakeFiles/minetest.dir/guiPasswordChange.cpp.o
  158. [ 69%] Building CXX object src/CMakeFiles/minetest.dir/guiPathSelectMenu.cpp.o
  159. [ 69%] Building CXX object src/CMakeFiles/minetest.dir/guiTable.cpp.o
  160. [ 70%] Building CXX object src/CMakeFiles/minetest.dir/guiVolumeChange.cpp.o
  161. [ 70%] Building CXX object src/CMakeFiles/minetest.dir/guiscalingfilter.cpp.o
  162. [ 70%] Building CXX object src/CMakeFiles/minetest.dir/httpfetch.cpp.o
  163. [ 71%] Building CXX object src/CMakeFiles/minetest.dir/hud.cpp.o
  164. [ 71%] Building CXX object src/CMakeFiles/minetest.dir/imagefilters.cpp.o
  165. [ 71%] Building CXX object src/CMakeFiles/minetest.dir/intlGUIEditBox.cpp.o
  166. [ 72%] Building CXX object src/CMakeFiles/minetest.dir/inventory.cpp.o
  167. [ 72%] Building CXX object src/CMakeFiles/minetest.dir/inventorymanager.cpp.o
  168. [ 73%] Building CXX object src/CMakeFiles/minetest.dir/itemdef.cpp.o
  169. [ 73%] Building CXX object src/CMakeFiles/minetest.dir/itemstackmetadata.cpp.o
  170. [ 73%] Building CXX object src/CMakeFiles/minetest.dir/keycode.cpp.o
  171. [ 74%] Building CXX object src/CMakeFiles/minetest.dir/light.cpp.o
  172. [ 74%] Building CXX object src/CMakeFiles/minetest.dir/localplayer.cpp.o
  173. [ 75%] Building CXX object src/CMakeFiles/minetest.dir/log.cpp.o
  174. [ 75%] Building CXX object src/CMakeFiles/minetest.dir/main.cpp.o
  175. [ 75%] Building CXX object src/CMakeFiles/minetest.dir/map.cpp.o
  176. [ 76%] Building CXX object src/CMakeFiles/minetest.dir/map_settings_manager.cpp.o
  177. [ 76%] Building CXX object src/CMakeFiles/minetest.dir/mapblock.cpp.o
  178. [ 77%] Building CXX object src/CMakeFiles/minetest.dir/mapblock_mesh.cpp.o
  179. [ 77%] Building CXX object src/CMakeFiles/minetest.dir/mapgen.cpp.o
  180. [ 77%] Building CXX object src/CMakeFiles/minetest.dir/mapgen_carpathian.cpp.o
  181. [ 78%] Building CXX object src/CMakeFiles/minetest.dir/mapgen_flat.cpp.o
  182. [ 78%] Building CXX object src/CMakeFiles/minetest.dir/mapgen_fractal.cpp.o
  183. [ 78%] Building CXX object src/CMakeFiles/minetest.dir/mapgen_singlenode.cpp.o
  184. [ 79%] Building CXX object src/CMakeFiles/minetest.dir/mapgen_v5.cpp.o
  185. [ 79%] Building CXX object src/CMakeFiles/minetest.dir/mapgen_v6.cpp.o
  186. [ 80%] Building CXX object src/CMakeFiles/minetest.dir/mapgen_v7.cpp.o
  187. [ 80%] Building CXX object src/CMakeFiles/minetest.dir/mapgen_valleys.cpp.o
  188. [ 80%] Building CXX object src/CMakeFiles/minetest.dir/mapnode.cpp.o
  189. [ 81%] Building CXX object src/CMakeFiles/minetest.dir/mapsector.cpp.o
  190. [ 81%] Building CXX object src/CMakeFiles/minetest.dir/mesh.cpp.o
  191. [ 82%] Building CXX object src/CMakeFiles/minetest.dir/mesh_generator_thread.cpp.o
  192. [ 82%] Building CXX object src/CMakeFiles/minetest.dir/metadata.cpp.o
  193. [ 82%] Building CXX object src/CMakeFiles/minetest.dir/mg_biome.cpp.o
  194. [ 83%] Building CXX object src/CMakeFiles/minetest.dir/mg_decoration.cpp.o
  195. [ 83%] Building CXX object src/CMakeFiles/minetest.dir/mg_ore.cpp.o
  196. [ 84%] Building CXX object src/CMakeFiles/minetest.dir/mg_schematic.cpp.o
  197. [ 84%] Building CXX object src/CMakeFiles/minetest.dir/minimap.cpp.o
  198. [ 84%] Building CXX object src/CMakeFiles/minetest.dir/mods.cpp.o
  199. [ 85%] Building CXX object src/CMakeFiles/minetest.dir/nameidmapping.cpp.o
  200. [ 85%] Building CXX object src/CMakeFiles/minetest.dir/nodedef.cpp.o
  201. [ 85%] [ 86%] Building CXX object src/CMakeFiles/minetest.dir/nodemetadata.cpp.o
  202. Building CXX object src/CMakeFiles/minetest.dir/nodetimer.cpp.o
  203. [ 86%] Building CXX object src/CMakeFiles/minetest.dir/noise.cpp.o
  204. [ 87%] Building CXX object src/CMakeFiles/minetest.dir/objdef.cpp.o
  205. [ 87%] Building CXX object src/CMakeFiles/minetest.dir/object_properties.cpp.o
  206. [ 87%] Building CXX object src/CMakeFiles/minetest.dir/particles.cpp.o
  207. [ 88%] Building CXX object src/CMakeFiles/minetest.dir/pathfinder.cpp.o
  208. [ 88%] Building CXX object src/CMakeFiles/minetest.dir/player.cpp.o
  209. [ 89%] Building CXX object src/CMakeFiles/minetest.dir/porting.cpp.o
  210. [ 89%] Building CXX object src/CMakeFiles/minetest.dir/profiler.cpp.o
  211. [ 89%] Building CXX object src/CMakeFiles/minetest.dir/quicktune.cpp.o
  212. [ 90%] Building CXX object src/CMakeFiles/minetest.dir/raycast.cpp.o
  213. [ 90%] Building CXX object src/CMakeFiles/minetest.dir/reflowscan.cpp.o
  214. [ 91%] Building CXX object src/CMakeFiles/minetest.dir/remoteplayer.cpp.o
  215. [ 91%] Building CXX object src/CMakeFiles/minetest.dir/rollback.cpp.o
  216. [ 91%] Building CXX object src/CMakeFiles/minetest.dir/rollback_interface.cpp.o
  217. [ 92%] Building CXX object src/CMakeFiles/minetest.dir/serialization.cpp.o
  218. [ 92%] Building CXX object src/CMakeFiles/minetest.dir/server.cpp.o
  219. [ 92%] Building CXX object src/CMakeFiles/minetest.dir/serverenvironment.cpp.o
  220. [ 93%] Building CXX object src/CMakeFiles/minetest.dir/serverlist.cpp.o
  221. [ 93%] Building CXX object src/CMakeFiles/minetest.dir/serverobject.cpp.o
  222. [ 94%] Building CXX object src/CMakeFiles/minetest.dir/settings.cpp.o
  223. [ 94%] Building CXX object src/CMakeFiles/minetest.dir/shader.cpp.o
  224. [ 94%] Building CXX object src/CMakeFiles/minetest.dir/sky.cpp.o
  225. [ 95%] Building CXX object src/CMakeFiles/minetest.dir/sound.cpp.o
  226. [ 95%] Building CXX object src/CMakeFiles/minetest.dir/sound_openal.cpp.o
  227. [ 96%] Building CXX object src/CMakeFiles/minetest.dir/staticobject.cpp.o
  228. [ 96%] Building CXX object src/CMakeFiles/minetest.dir/subgame.cpp.o
  229. [ 96%] Building CXX object src/CMakeFiles/minetest.dir/terminal_chat_console.cpp.o
  230. [ 97%] Building CXX object src/CMakeFiles/minetest.dir/tileanimation.cpp.o
  231. [ 97%] Building CXX object src/CMakeFiles/minetest.dir/tool.cpp.o
  232. [ 98%] Building CXX object src/CMakeFiles/minetest.dir/translation.cpp.o
  233. [ 98%] Building CXX object src/CMakeFiles/minetest.dir/treegen.cpp.o
  234. [ 98%] Building CXX object src/CMakeFiles/minetest.dir/version.cpp.o
  235. [ 99%] Building CXX object src/CMakeFiles/minetest.dir/voxel.cpp.o
  236. [ 99%] Building CXX object src/CMakeFiles/minetest.dir/voxelalgorithms.cpp.o
  237. [100%] Building CXX object src/CMakeFiles/minetest.dir/wieldmesh.cpp.o
  238. Linking CXX executable ../bin/minetest
  239. CMakeFiles/minetest.dir/convert_json.cpp.o: dans la fonction « fetchJsonValue(std::string const&, std::vector<std::string, std::allocator<std::string> >*) »:
  240. convert_json.cpp:(.text+0x68e): référence indéfinie vers « Json::Value::Value(Json::Value&&) »
  241. CMakeFiles/minetest.dir/serverlist.cpp.o: dans la fonction « ServerList::deleteEntry(Json::Value const&) »:
  242. serverlist.cpp:(.text+0x2437): référence indéfinie vers « Json::Value::Value(Json::Value&&) »
  243. serverlist.cpp:(.text+0x247d): référence indéfinie vers « Json::Value::Value(Json::Value&&) »
  244. serverlist.cpp:(.text+0x24a9): référence indéfinie vers « Json::Value::Value(Json::Value&&) »
  245. serverlist.cpp:(.text+0x24d5): référence indéfinie vers « Json::Value::Value(Json::Value&&) »
  246. CMakeFiles/minetest.dir/serverlist.cpp.o:serverlist.cpp:(.text+0x250d): encore plus de références indéfinies suivent vers « Json::Value::Value(Json::Value&&) »
  247. collect2: error: ld returned 1 exit status
  248. src/CMakeFiles/minetest.dir/build.make:5771: recipe for target 'bin/minetest' failed
  249. make[2]: *** [bin/minetest] Error 1
  250. CMakeFiles/Makefile2:244: recipe for target 'src/CMakeFiles/minetest.dir/all' failed
  251. make[1]: *** [src/CMakeFiles/minetest.dir/all] Error 2
  252. Makefile:137: recipe for target 'all' failed
  253. make: *** [all] Error 2
RAW Paste Data
We use cookies for various purposes including analytics. By continuing to use Pastebin, you agree to our use of cookies as described in the Cookies Policy. OK, I Understand
 
Top