Not a member of Pastebin yet?
Sign Up,
it unlocks many cool features!
- This file contains any messages produced by compilers while
- running configure, to aid debugging if configure makes a mistake.
- It was created by Bitcoin Core configure 0.14.99, which was
- generated by GNU Autoconf 2.69. Invocation command line was
- $ ./configure
- ## --------- ##
- ## Platform. ##
- ## --------- ##
- hostname = Daniels-MBP
- uname -m = x86_64
- uname -r = 16.6.0
- uname -s = Darwin
- uname -v = Darwin Kernel Version 16.6.0: Fri Apr 14 16:13:31 PDT 2017; root:xnu-3789.60.24~4/RELEASE_X86_64
- /usr/bin/uname -p = i386
- /bin/uname -X = unknown
- /bin/arch = unknown
- /usr/bin/arch -k = unknown
- /usr/convex/getsysinfo = unknown
- /usr/bin/hostinfo = Mach kernel version:
- Darwin Kernel Version 16.6.0: Fri Apr 14 16:13:31 PDT 2017; root:xnu-3789.60.24~4/RELEASE_X86_64
- Kernel configured for up to 8 processors.
- 4 processors are physically available.
- 8 processors are logically available.
- Processor type: x86_64h (Intel x86-64h Haswell)
- Processors active: 0 1 2 3 4 5 6 7
- Primary memory available: 16.00 gigabytes
- Default processor set: 394 tasks, 1844 threads, 8 processors
- Load average: 1.60, Mach factor: 6.39
- /bin/machine = unknown
- /usr/bin/oslevel = unknown
- /bin/universe = unknown
- PATH: /usr/local/bin
- PATH: /usr/bin
- PATH: /bin
- PATH: /usr/sbin
- PATH: /sbin
- ## ----------- ##
- ## Core tests. ##
- ## ----------- ##
- configure:2988: checking build system type
- configure:3002: result: x86_64-apple-darwin16.6.0
- configure:3022: checking host system type
- configure:3035: result: x86_64-apple-darwin16.6.0
- configure:3078: checking for a BSD-compatible install
- configure:3146: result: /usr/bin/install -c
- configure:3157: checking whether build environment is sane
- configure:3212: result: yes
- configure:3363: checking for a thread-safe mkdir -p
- configure:3402: result: build-aux/install-sh -c -d
- configure:3409: checking for gawk
- configure:3439: result: no
- configure:3409: checking for mawk
- configure:3439: result: no
- configure:3409: checking for nawk
- configure:3439: result: no
- configure:3409: checking for awk
- configure:3425: found /usr/bin/awk
- configure:3436: result: awk
- configure:3447: checking whether make sets $(MAKE)
- configure:3469: result: yes
- configure:3498: checking whether make supports nested variables
- configure:3515: result: yes
- configure:3634: checking whether to enable maintainer-specific portions of Makefiles
- configure:3643: result: yes
- configure:3668: checking whether make supports nested variables
- configure:3685: result: yes
- configure:3760: checking for g++
- configure:3776: found /usr/bin/g++
- configure:3787: result: g++
- configure:3814: checking for C++ compiler version
- configure:3823: g++ --version >&5
- Apple LLVM version 8.1.0 (clang-802.0.42)
- Target: x86_64-apple-darwin16.6.0
- Thread model: posix
- InstalledDir: /Library/Developer/CommandLineTools/usr/bin
- Configured with: --prefix=/Library/Developer/CommandLineTools/usr --with-gxx-include-dir=/usr/include/c++/4.2.1
- configure:3834: $? = 0
- configure:3823: g++ -v >&5
- Configured with: --prefix=/Library/Developer/CommandLineTools/usr --with-gxx-include-dir=/usr/include/c++/4.2.1
- Apple LLVM version 8.1.0 (clang-802.0.42)
- Target: x86_64-apple-darwin16.6.0
- Thread model: posix
- InstalledDir: /Library/Developer/CommandLineTools/usr/bin
- configure:3834: $? = 0
- configure:3823: g++ -V >&5
- clang: error: argument to '-V' is missing (expected 1 value)
- clang: error: no input files
- configure:3834: $? = 1
- configure:3823: g++ -qversion >&5
- clang: error: unknown argument: '-qversion'
- clang: error: no input files
- configure:3834: $? = 1
- configure:3854: checking whether the C++ compiler works
- configure:3876: g++ conftest.cpp >&5
- configure:3880: $? = 0
- configure:3928: result: yes
- configure:3931: checking for C++ compiler default output file name
- configure:3933: result: a.out
- configure:3939: checking for suffix of executables
- configure:3946: g++ -o conftest conftest.cpp >&5
- configure:3950: $? = 0
- configure:3972: result:
- configure:3994: checking whether we are cross compiling
- configure:4002: g++ -o conftest conftest.cpp >&5
- configure:4006: $? = 0
- configure:4013: ./conftest
- configure:4017: $? = 0
- configure:4032: result: no
- configure:4037: checking for suffix of object files
- configure:4059: g++ -c conftest.cpp >&5
- configure:4063: $? = 0
- configure:4084: result: o
- configure:4088: checking whether we are using the GNU C++ compiler
- configure:4107: g++ -c conftest.cpp >&5
- configure:4107: $? = 0
- configure:4116: result: yes
- configure:4125: checking whether g++ accepts -g
- configure:4145: g++ -c -g conftest.cpp >&5
- configure:4145: $? = 0
- configure:4186: result: yes
- configure:4220: checking for style of include used by make
- configure:4248: result: GNU
- configure:4274: checking dependency style of g++
- configure:4385: result: gcc3
- configure:4423: checking whether g++ supports C++11 features with -std=c++11
- configure:4719: g++ -std=c++11 -c -g -O2 conftest.cpp >&5
- configure:4719: $? = 0
- configure:4728: result: yes
- configure:4772: checking whether std::atomic can be used without link library
- configure:4790: g++ -std=c++11 -o conftest -g -O2 conftest.cpp >&5
- configure:4790: $? = 0
- configure:4792: result: yes
- configure:4957: checking for Objective C++ compiler version
- configure:4966: g++ -std=c++11 --version >&5
- Apple LLVM version 8.1.0 (clang-802.0.42)
- Target: x86_64-apple-darwin16.6.0
- Thread model: posix
- InstalledDir: /Library/Developer/CommandLineTools/usr/bin
- configure:4977: $? = 0
- configure:4966: g++ -std=c++11 -v >&5
- Apple LLVM version 8.1.0 (clang-802.0.42)
- Target: x86_64-apple-darwin16.6.0
- Thread model: posix
- InstalledDir: /Library/Developer/CommandLineTools/usr/bin
- clang: warning: argument unused during compilation: '-std=c++11' [-Wunused-command-line-argument]
- configure:4977: $? = 0
- configure:4966: g++ -std=c++11 -V >&5
- clang: error: argument to '-V' is missing (expected 1 value)
- clang: error: no input files
- configure:4977: $? = 1
- configure:4966: g++ -std=c++11 -qversion >&5
- clang: error: unknown argument: '-qversion'
- clang: error: no input files
- configure:4977: $? = 1
- configure:4981: checking whether we are using the GNU Objective C++ compiler
- configure:5000: g++ -std=c++11 -c conftest.mm >&5
- configure:5000: $? = 0
- configure:5009: result: yes
- configure:5018: checking whether g++ -std=c++11 accepts -g
- configure:5038: g++ -std=c++11 -c -g conftest.mm >&5
- configure:5038: $? = 0
- configure:5079: result: yes
- configure:5104: checking dependency style of g++ -std=c++11
- configure:5213: result: gcc3
- configure:5276: checking how to print strings
- configure:5303: result: printf
- configure:5372: checking for gcc
- configure:5388: found /usr/bin/gcc
- configure:5399: result: gcc
- configure:5628: checking for C compiler version
- configure:5637: gcc --version >&5
- Apple LLVM version 8.1.0 (clang-802.0.42)
- Target: x86_64-apple-darwin16.6.0
- Thread model: posix
- InstalledDir: /Library/Developer/CommandLineTools/usr/bin
- Configured with: --prefix=/Library/Developer/CommandLineTools/usr --with-gxx-include-dir=/usr/include/c++/4.2.1
- configure:5648: $? = 0
- configure:5637: gcc -v >&5
- Configured with: --prefix=/Library/Developer/CommandLineTools/usr --with-gxx-include-dir=/usr/include/c++/4.2.1
- Apple LLVM version 8.1.0 (clang-802.0.42)
- Target: x86_64-apple-darwin16.6.0
- Thread model: posix
- InstalledDir: /Library/Developer/CommandLineTools/usr/bin
- configure:5648: $? = 0
- configure:5637: gcc -V >&5
- clang: error: argument to '-V' is missing (expected 1 value)
- clang: error: no input files
- configure:5648: $? = 1
- configure:5637: gcc -qversion >&5
- clang: error: unknown argument: '-qversion'
- clang: error: no input files
- configure:5648: $? = 1
- configure:5652: checking whether we are using the GNU C compiler
- configure:5671: gcc -c conftest.c >&5
- configure:5671: $? = 0
- configure:5680: result: yes
- configure:5689: checking whether gcc accepts -g
- configure:5709: gcc -c -g conftest.c >&5
- configure:5709: $? = 0
- configure:5750: result: yes
- configure:5767: checking for gcc option to accept ISO C89
- configure:5830: gcc -c -g -O2 conftest.c >&5
- configure:5830: $? = 0
- configure:5843: result: none needed
- configure:5868: checking whether gcc understands -c and -o together
- configure:5890: gcc -c conftest.c -o conftest2.o
- configure:5893: $? = 0
- configure:5890: gcc -c conftest.c -o conftest2.o
- configure:5893: $? = 0
- configure:5905: result: yes
- configure:5924: checking dependency style of gcc
- configure:6035: result: gcc3
- configure:6050: checking for a sed that does not truncate output
- configure:6114: result: /usr/bin/sed
- configure:6132: checking for grep that handles long lines and -e
- configure:6190: result: /usr/bin/grep
- configure:6195: checking for egrep
- configure:6257: result: /usr/bin/grep -E
- configure:6262: checking for fgrep
- configure:6324: result: /usr/bin/grep -F
- configure:6359: checking for ld used by gcc
- configure:6426: result: /Library/Developer/CommandLineTools/usr/bin/ld
- configure:6433: checking if the linker (/Library/Developer/CommandLineTools/usr/bin/ld) is GNU ld
- configure:6448: result: no
- configure:6460: checking for BSD- or MS-compatible name lister (nm)
- configure:6514: result: /usr/bin/nm -B
- configure:6644: checking the name lister (/usr/bin/nm -B) interface
- configure:6651: gcc -c -g -O2 conftest.c >&5
- configure:6654: /usr/bin/nm -B "conftest.o"
- configure:6657: output
- 00000000000001f0 S _some_variable
- configure:6664: result: BSD nm
- configure:6667: checking whether ln -s works
- configure:6671: result: yes
- configure:6679: checking the maximum length of command line arguments
- configure:6810: result: 196608
- configure:6858: checking how to convert x86_64-apple-darwin16.6.0 file names to x86_64-apple-darwin16.6.0 format
- configure:6898: result: func_convert_file_noop
- configure:6905: checking how to convert x86_64-apple-darwin16.6.0 file names to toolchain format
- configure:6925: result: func_convert_file_noop
- configure:6932: checking for /Library/Developer/CommandLineTools/usr/bin/ld option to reload object files
- configure:6939: result: -r
- configure:7013: checking for objdump
- configure:7029: found /usr/bin/objdump
- configure:7040: result: objdump
- configure:7072: checking how to recognize dependent libraries
- configure:7272: result: pass_all
- configure:7357: checking for dlltool
- configure:7387: result: no
- configure:7417: checking how to associate runtime and link libraries
- configure:7444: result: printf %s\n
- configure:7505: checking for ar
- configure:7521: found /usr/bin/ar
- configure:7532: result: ar
- configure:7569: checking for archiver @FILE support
- configure:7586: gcc -c -g -O2 conftest.c >&5
- configure:7586: $? = 0
- configure:7589: ar cru libconftest.a @conftest.lst >&5
- ar: @conftest.lst: No such file or directory
- configure:7592: $? = 1
- configure:7612: result: no
- configure:7670: checking for strip
- configure:7686: found /usr/bin/strip
- configure:7697: result: strip
- configure:7769: checking for ranlib
- configure:7785: found /usr/bin/ranlib
- configure:7796: result: ranlib
- configure:7898: checking command to parse /usr/bin/nm -B output from gcc object
- configure:8051: gcc -c -g -O2 conftest.c >&5
- configure:8054: $? = 0
- configure:8058: /usr/bin/nm -B conftest.o \| sed -n -e 's/^.*[ ]\([BCDEGRST][BCDEGRST]*\)[ ][ ]*\([_A-Za-z][_A-Za-z0-9]*\)$/\1 \2 \2/p' | sed '/ __gnu_lto/d' \> conftest.nm
- configure:8061: $? = 0
- cannot find nm_test_var in conftest.nm
- configure:8051: gcc -c -g -O2 conftest.c >&5
- configure:8054: $? = 0
- configure:8058: /usr/bin/nm -B conftest.o \| sed -n -e 's/^.*[ ]\([BCDEGRST][BCDEGRST]*\)[ ][ ]*_\([_A-Za-z][_A-Za-z0-9]*\)$/\1 _\2 \2/p' | sed '/ __gnu_lto/d' \> conftest.nm
- configure:8061: $? = 0
- configure:8127: gcc -o conftest -g -O2 conftest.c conftstm.o >&5
- warning: (x86_64) could not find object file symbol for symbol _main
- configure:8130: $? = 0
- configure:8168: result: ok
- configure:8215: checking for sysroot
- configure:8245: result: no
- configure:8252: checking for a working dd
- configure:8290: result: /bin/dd
- configure:8294: checking how to truncate binary pipes
- configure:8309: result: /bin/dd bs=4096 count=1
- configure:8638: checking for mt
- configure:8668: result: no
- configure:8688: checking if : is a manifest tool
- configure:8694: : '-?'
- configure:8702: result: no
- configure:8758: checking for dsymutil
- configure:8774: found /usr/bin/dsymutil
- configure:8785: result: dsymutil
- configure:8850: checking for nmedit
- configure:8866: found /usr/bin/nmedit
- configure:8877: result: nmedit
- configure:8942: checking for lipo
- configure:8958: found /usr/bin/lipo
- configure:8969: result: lipo
- configure:9034: checking for otool
- configure:9050: found /usr/bin/otool
- configure:9061: result: otool
- configure:9126: checking for otool64
- configure:9156: result: no
- configure:9201: checking for -single_module linker flag
- gcc -g -O2 -o libconftest.dylib -dynamiclib -Wl,-single_module conftest.c
- configure:9234: result: yes
- configure:9237: checking for -exported_symbols_list linker flag
- configure:9257: gcc -o conftest -g -O2 -Wl,-exported_symbols_list,conftest.sym conftest.c >&5
- configure:9257: $? = 0
- configure:9267: result: yes
- configure:9270: checking for -force_load linker flag
- gcc -g -O2 -c -o conftest.o conftest.c
- ar cru libconftest.a conftest.o
- ranlib libconftest.a
- gcc -g -O2 -o conftest conftest.c -Wl,-force_load,./libconftest.a
- configure:9302: result: yes
- configure:9379: checking how to run the C preprocessor
- configure:9410: gcc -E conftest.c
- configure:9410: $? = 0
- configure:9424: gcc -E conftest.c
- conftest.c:10:10: fatal error: 'ac_nonexistent.h' file not found
- #include <ac_nonexistent.h>
- ^
- 1 error generated.
- configure:9424: $? = 1
- configure: failed program was:
- | /* confdefs.h */
- | #define PACKAGE_NAME "Bitcoin Core"
- | #define PACKAGE_TARNAME "bitcoin"
- | #define PACKAGE_VERSION "0.14.99"
- | #define PACKAGE_STRING "Bitcoin Core 0.14.99"
- | #define PACKAGE_BUGREPORT "https://github.com/bitcoin/bitcoin/issues"
- | #define PACKAGE_URL "https://bitcoincore.org/"
- | #define HAVE_CXX11 1
- | /* end confdefs.h. */
- | #include <ac_nonexistent.h>
- configure:9449: result: gcc -E
- configure:9469: gcc -E conftest.c
- configure:9469: $? = 0
- configure:9483: gcc -E conftest.c
- conftest.c:10:10: fatal error: 'ac_nonexistent.h' file not found
- #include <ac_nonexistent.h>
- ^
- 1 error generated.
- configure:9483: $? = 1
- configure: failed program was:
- | /* confdefs.h */
- | #define PACKAGE_NAME "Bitcoin Core"
- | #define PACKAGE_TARNAME "bitcoin"
- | #define PACKAGE_VERSION "0.14.99"
- | #define PACKAGE_STRING "Bitcoin Core 0.14.99"
- | #define PACKAGE_BUGREPORT "https://github.com/bitcoin/bitcoin/issues"
- | #define PACKAGE_URL "https://bitcoincore.org/"
- | #define HAVE_CXX11 1
- | /* end confdefs.h. */
- | #include <ac_nonexistent.h>
- configure:9512: checking for ANSI C header files
- configure:9532: gcc -c -g -O2 conftest.c >&5
- configure:9532: $? = 0
- configure:9605: gcc -o conftest -g -O2 conftest.c >&5
- configure:9605: $? = 0
- configure:9605: ./conftest
- configure:9605: $? = 0
- configure:9616: result: yes
- configure:9629: checking for sys/types.h
- configure:9629: gcc -c -g -O2 conftest.c >&5
- configure:9629: $? = 0
- configure:9629: result: yes
- configure:9629: checking for sys/stat.h
- configure:9629: gcc -c -g -O2 conftest.c >&5
- configure:9629: $? = 0
- configure:9629: result: yes
- configure:9629: checking for stdlib.h
- configure:9629: gcc -c -g -O2 conftest.c >&5
- configure:9629: $? = 0
- configure:9629: result: yes
- configure:9629: checking for string.h
- configure:9629: gcc -c -g -O2 conftest.c >&5
- configure:9629: $? = 0
- configure:9629: result: yes
- configure:9629: checking for memory.h
- configure:9629: gcc -c -g -O2 conftest.c >&5
- configure:9629: $? = 0
- configure:9629: result: yes
- configure:9629: checking for strings.h
- configure:9629: gcc -c -g -O2 conftest.c >&5
- configure:9629: $? = 0
- configure:9629: result: yes
- configure:9629: checking for inttypes.h
- configure:9629: gcc -c -g -O2 conftest.c >&5
- configure:9629: $? = 0
- configure:9629: result: yes
- configure:9629: checking for stdint.h
- configure:9629: gcc -c -g -O2 conftest.c >&5
- configure:9629: $? = 0
- configure:9629: result: yes
- configure:9629: checking for unistd.h
- configure:9629: gcc -c -g -O2 conftest.c >&5
- configure:9629: $? = 0
- configure:9629: result: yes
- configure:9643: checking for dlfcn.h
- configure:9643: gcc -c -g -O2 conftest.c >&5
- configure:9643: $? = 0
- configure:9643: result: yes
- configure:9908: checking for objdir
- configure:9923: result: .libs
- configure:10187: checking if gcc supports -fno-rtti -fno-exceptions
- configure:10205: gcc -c -g -O2 -fno-rtti -fno-exceptions conftest.c >&5
- configure:10209: $? = 0
- configure:10222: result: yes
- configure:10580: checking for gcc option to produce PIC
- configure:10587: result: -fno-common -DPIC
- configure:10595: checking if gcc PIC flag -fno-common -DPIC works
- configure:10613: gcc -c -g -O2 -fno-common -DPIC -DPIC conftest.c >&5
- configure:10617: $? = 0
- configure:10630: result: yes
- configure:10659: checking if gcc static flag -static works
- configure:10687: result: no
- configure:10702: checking if gcc supports -c -o file.o
- configure:10723: gcc -c -g -O2 -o out/conftest2.o conftest.c >&5
- configure:10727: $? = 0
- configure:10749: result: yes
- configure:10757: checking if gcc supports -c -o file.o
- configure:10804: result: yes
- configure:10837: checking whether the gcc linker (/Library/Developer/CommandLineTools/usr/bin/ld) supports shared libraries
- configure:12096: result: yes
- configure:12336: checking dynamic linker characteristics
- configure:13154: result: darwin16.6.0 dyld
- configure:13276: checking how to hardcode library paths into programs
- configure:13301: result: immediate
- configure:13849: checking whether stripping libraries is possible
- configure:13863: result: yes
- configure:13889: checking if libtool supports shared libraries
- configure:13891: result: yes
- configure:13894: checking whether to build shared libraries
- configure:13919: result: yes
- configure:13922: checking whether to build static libraries
- configure:13926: result: yes
- configure:13949: checking how to run the C++ preprocessor
- configure:13976: g++ -std=c++11 -E conftest.cpp
- configure:13976: $? = 0
- configure:13990: g++ -std=c++11 -E conftest.cpp
- conftest.cpp:22:10: fatal error: 'ac_nonexistent.h' file not found
- #include <ac_nonexistent.h>
- ^
- 1 error generated.
- configure:13990: $? = 1
- configure: failed program was:
- | /* confdefs.h */
- | #define PACKAGE_NAME "Bitcoin Core"
- | #define PACKAGE_TARNAME "bitcoin"
- | #define PACKAGE_VERSION "0.14.99"
- | #define PACKAGE_STRING "Bitcoin Core 0.14.99"
- | #define PACKAGE_BUGREPORT "https://github.com/bitcoin/bitcoin/issues"
- | #define PACKAGE_URL "https://bitcoincore.org/"
- | #define HAVE_CXX11 1
- | #define STDC_HEADERS 1
- | #define HAVE_SYS_TYPES_H 1
- | #define HAVE_SYS_STAT_H 1
- | #define HAVE_STDLIB_H 1
- | #define HAVE_STRING_H 1
- | #define HAVE_MEMORY_H 1
- | #define HAVE_STRINGS_H 1
- | #define HAVE_INTTYPES_H 1
- | #define HAVE_STDINT_H 1
- | #define HAVE_UNISTD_H 1
- | #define HAVE_DLFCN_H 1
- | #define LT_OBJDIR ".libs/"
- | /* end confdefs.h. */
- | #include <ac_nonexistent.h>
- configure:14015: result: g++ -std=c++11 -E
- configure:14035: g++ -std=c++11 -E conftest.cpp
- configure:14035: $? = 0
- configure:14049: g++ -std=c++11 -E conftest.cpp
- conftest.cpp:22:10: fatal error: 'ac_nonexistent.h' file not found
- #include <ac_nonexistent.h>
- ^
- 1 error generated.
- configure:14049: $? = 1
- configure: failed program was:
- | /* confdefs.h */
- | #define PACKAGE_NAME "Bitcoin Core"
- | #define PACKAGE_TARNAME "bitcoin"
- | #define PACKAGE_VERSION "0.14.99"
- | #define PACKAGE_STRING "Bitcoin Core 0.14.99"
- | #define PACKAGE_BUGREPORT "https://github.com/bitcoin/bitcoin/issues"
- | #define PACKAGE_URL "https://bitcoincore.org/"
- | #define HAVE_CXX11 1
- | #define STDC_HEADERS 1
- | #define HAVE_SYS_TYPES_H 1
- | #define HAVE_SYS_STAT_H 1
- | #define HAVE_STDLIB_H 1
- | #define HAVE_STRING_H 1
- | #define HAVE_MEMORY_H 1
- | #define HAVE_STRINGS_H 1
- | #define HAVE_INTTYPES_H 1
- | #define HAVE_STDINT_H 1
- | #define HAVE_UNISTD_H 1
- | #define HAVE_DLFCN_H 1
- | #define LT_OBJDIR ".libs/"
- | /* end confdefs.h. */
- | #include <ac_nonexistent.h>
- configure:14211: checking for ld used by g++ -std=c++11
- configure:14278: result: /Library/Developer/CommandLineTools/usr/bin/ld
- configure:14285: checking if the linker (/Library/Developer/CommandLineTools/usr/bin/ld) is GNU ld
- configure:14300: result: no
- configure:14355: checking whether the g++ -std=c++11 linker (/Library/Developer/CommandLineTools/usr/bin/ld) supports shared libraries
- configure:15428: result: yes
- configure:15464: g++ -std=c++11 -c -g -O2 conftest.cpp >&5
- configure:15467: $? = 0
- configure:15948: checking for g++ -std=c++11 option to produce PIC
- configure:15955: result: -fno-common -DPIC
- configure:15963: checking if g++ -std=c++11 PIC flag -fno-common -DPIC works
- configure:15981: g++ -std=c++11 -c -g -O2 -fno-common -DPIC -DPIC conftest.cpp >&5
- configure:15985: $? = 0
- configure:15998: result: yes
- configure:16021: checking if g++ -std=c++11 static flag -static works
- configure:16049: result: no
- configure:16061: checking if g++ -std=c++11 supports -c -o file.o
- configure:16082: g++ -std=c++11 -c -g -O2 -o out/conftest2.o conftest.cpp >&5
- configure:16086: $? = 0
- configure:16108: result: yes
- configure:16113: checking if g++ -std=c++11 supports -c -o file.o
- configure:16160: result: yes
- configure:16190: checking whether the g++ -std=c++11 linker (/Library/Developer/CommandLineTools/usr/bin/ld) supports shared libraries
- configure:16230: result: yes
- configure:16371: checking dynamic linker characteristics
- configure:17116: result: darwin16.6.0 dyld
- configure:17181: checking how to hardcode library paths into programs
- configure:17206: result: immediate
- configure:17314: checking for ar
- configure:17332: found /usr/bin/ar
- configure:17344: result: /usr/bin/ar
- configure:17412: checking for ranlib
- configure:17430: found /usr/bin/ranlib
- configure:17442: result: /usr/bin/ranlib
- configure:17510: checking for strip
- configure:17528: found /usr/bin/strip
- configure:17540: result: /usr/bin/strip
- configure:17608: checking for gcov
- configure:17626: found /usr/bin/gcov
- configure:17638: result: /usr/bin/gcov
- configure:17662: checking for lcov
- configure:17695: result: no
- configure:17704: checking for python3.6
- configure:17737: result: no
- configure:17704: checking for python3.5
- configure:17737: result: no
- configure:17704: checking for python3.4
- configure:17737: result: no
- configure:17704: checking for python3
- configure:17737: result: no
- configure:17704: checking for python2.7
- configure:17722: found /usr/local/bin/python2.7
- configure:17734: result: /usr/local/bin/python2.7
- configure:17747: checking for genhtml
- configure:17780: result: no
- configure:17787: checking for git
- configure:17805: found /usr/bin/git
- configure:17817: result: /usr/bin/git
- configure:17827: checking for ccache
- configure:17860: result: no
- configure:17867: checking for xgettext
- configure:17900: result: no
- configure:17907: checking for hexdump
- configure:17925: found /usr/bin/hexdump
- configure:17937: result: /usr/bin/hexdump
- configure:17991: checking for readelf
- configure:18024: result: no
- configure:18089: checking for c++filt
- configure:18107: found /usr/bin/c++filt
- configure:18119: result: /usr/bin/c++filt
- configure:18187: checking for objcopy
- configure:18220: result: no
- configure:18413: checking whether C++ compiler accepts -Werror
- configure:18432: g++ -std=c++11 -c -g -O2 -Werror conftest.cpp >&5
- configure:18432: $? = 0
- configure:18440: result: yes
- configure:18506: checking whether C++ compiler accepts -Wall
- configure:18525: g++ -std=c++11 -c -g -O2 -Werror -Wall conftest.cpp >&5
- configure:18525: $? = 0
- configure:18534: result: yes
- configure:18543: checking whether C++ compiler accepts -Wextra
- configure:18562: g++ -std=c++11 -c -g -O2 -Wall -Werror -Wextra conftest.cpp >&5
- configure:18562: $? = 0
- configure:18571: result: yes
- configure:18580: checking whether C++ compiler accepts -Wformat
- configure:18599: g++ -std=c++11 -c -g -O2 -Wall -Wextra -Werror -Wformat conftest.cpp >&5
- configure:18599: $? = 0
- configure:18608: result: yes
- configure:18617: checking whether C++ compiler accepts -Wvla
- configure:18636: g++ -std=c++11 -c -g -O2 -Wall -Wextra -Wformat -Werror -Wvla conftest.cpp >&5
- configure:18636: $? = 0
- configure:18645: result: yes
- configure:18654: checking whether C++ compiler accepts -Wformat-security
- configure:18673: g++ -std=c++11 -c -g -O2 -Wall -Wextra -Wformat -Wvla -Werror -Wformat-security conftest.cpp >&5
- configure:18673: $? = 0
- configure:18682: result: yes
- configure:18695: checking whether C++ compiler accepts -Wunused-parameter
- configure:18714: g++ -std=c++11 -c -g -O2 -Wall -Wextra -Wformat -Wvla -Wformat-security -Werror -Wunused-parameter conftest.cpp >&5
- configure:18714: $? = 0
- configure:18723: result: yes
- configure:18732: checking whether C++ compiler accepts -Wself-assign
- configure:18751: g++ -std=c++11 -c -g -O2 -Wall -Wextra -Wformat -Wvla -Wformat-security -Wno-unused-parameter -Werror -Wself-assign conftest.cpp >&5
- configure:18751: $? = 0
- configure:18760: result: yes
- configure:18769: checking whether C++ compiler accepts -Wunused-local-typedef
- configure:18788: g++ -std=c++11 -c -g -O2 -Wall -Wextra -Wformat -Wvla -Wformat-security -Wno-unused-parameter -Wno-self-assign -Werror -Wunused-local-typedef conftest.cpp >&5
- configure:18788: $? = 0
- configure:18797: result: yes
- configure:18806: checking whether C++ compiler accepts -Wdeprecated-register
- configure:18825: g++ -std=c++11 -c -g -O2 -Wall -Wextra -Wformat -Wvla -Wformat-security -Wno-unused-parameter -Wno-self-assign -Wno-unused-local-typedef -Werror -Wdeprecated-register conftest.cpp >&5
- configure:18825: $? = 0
- configure:18834: result: yes
- configure:18843: checking whether C++ compiler accepts -Wimplicit-fallthrough
- configure:18862: g++ -std=c++11 -c -g -O2 -Wall -Wextra -Wformat -Wvla -Wformat-security -Wno-unused-parameter -Wno-self-assign -Wno-unused-local-typedef -Wno-deprecated-register -Werror -Wimplicit-fallthrough conftest.cpp >&5
- configure:18862: $? = 0
- configure:18871: result: yes
- configure:18884: checking whether C++ compiler accepts -msse4.2
- configure:18903: g++ -std=c++11 -c -g -O2 -Wall -Wextra -Wformat -Wvla -Wformat-security -Wno-unused-parameter -Wno-self-assign -Wno-unused-local-typedef -Wno-deprecated-register -Wno-implicit-fallthrough -Werror -msse4.2 conftest.cpp >&5
- configure:18903: $? = 0
- configure:18912: result: yes
- configure:19949: checking for port
- configure:19979: result: no
- configure:19997: checking for rsvg-convert
- configure:20015: found /usr/local/bin/rsvg-convert
- configure:20027: result: /usr/local/bin/rsvg-convert
- configure:20041: checking for brew
- configure:20057: found /usr/local/bin/brew
- configure:20068: result: brew
- configure:20486: checking whether the linker accepts -Wl,-headerpad_max_install_names
- configure:20505: g++ -std=c++11 -o conftest -g -O2 -Wall -Wextra -Wformat -Wvla -Wformat-security -Wno-unused-parameter -Wno-self-assign -Wno-unused-local-typedef -Wno-deprecated-register -Wno-implicit-fallthrough -DHAVE_BUILD_INFO -D__STDC_FORMAT_MACROS -I/usr/local/opt/berkeley-db@4/include -Wl,-headerpad_max_install_names conftest.cpp -L/usr/local/opt/berkeley-db@4/lib >&5
- configure:20505: $? = 0
- configure:20514: result: yes
- configure:20600: checking for pkg-config
- configure:20618: found /usr/local/bin/pkg-config
- configure:20630: result: /usr/local/bin/pkg-config
- configure:20655: checking pkg-config is at least version 0.9.0
- configure:20658: result: yes
- configure:20764: checking whether byte ordering is bigendian
- configure:20779: g++ -std=c++11 -c -g -O2 -Wall -Wextra -Wformat -Wvla -Wformat-security -Wno-unused-parameter -Wno-self-assign -Wno-unused-local-typedef -Wno-deprecated-register -Wno-implicit-fallthrough -DHAVE_BUILD_INFO -D__STDC_FORMAT_MACROS -I/usr/local/opt/berkeley-db@4/include -DMAC_OSX conftest.cpp >&5
- configure:20779: $? = 0
- configure:20824: g++ -std=c++11 -c -g -O2 -Wall -Wextra -Wformat -Wvla -Wformat-security -Wno-unused-parameter -Wno-self-assign -Wno-unused-local-typedef -Wno-deprecated-register -Wno-implicit-fallthrough -DHAVE_BUILD_INFO -D__STDC_FORMAT_MACROS -I/usr/local/opt/berkeley-db@4/include -DMAC_OSX conftest.cpp >&5
- configure:20824: $? = 0
- configure:20842: g++ -std=c++11 -c -g -O2 -Wall -Wextra -Wformat -Wvla -Wformat-security -Wno-unused-parameter -Wno-self-assign -Wno-unused-local-typedef -Wno-deprecated-register -Wno-implicit-fallthrough -DHAVE_BUILD_INFO -D__STDC_FORMAT_MACROS -I/usr/local/opt/berkeley-db@4/include -DMAC_OSX conftest.cpp >&5
- conftest.cpp:29:11: error: expected ';' after expression
- not big endian
- ^
- ;
- conftest.cpp:29:8: error: use of undeclared identifier 'big'
- not big endian
- ^
- conftest.cpp:29:12: error: use of undeclared identifier 'endian'
- not big endian
- ^
- 3 errors generated.
- configure:20842: $? = 1
- configure: failed program was:
- | /* confdefs.h */
- | #define PACKAGE_NAME "Bitcoin Core"
- | #define PACKAGE_TARNAME "bitcoin"
- | #define PACKAGE_VERSION "0.14.99"
- | #define PACKAGE_STRING "Bitcoin Core 0.14.99"
- | #define PACKAGE_BUGREPORT "https://github.com/bitcoin/bitcoin/issues"
- | #define PACKAGE_URL "https://bitcoincore.org/"
- | #define HAVE_CXX11 1
- | #define STDC_HEADERS 1
- | #define HAVE_SYS_TYPES_H 1
- | #define HAVE_SYS_STAT_H 1
- | #define HAVE_STDLIB_H 1
- | #define HAVE_STRING_H 1
- | #define HAVE_MEMORY_H 1
- | #define HAVE_STRINGS_H 1
- | #define HAVE_INTTYPES_H 1
- | #define HAVE_STDINT_H 1
- | #define HAVE_UNISTD_H 1
- | #define HAVE_DLFCN_H 1
- | #define LT_OBJDIR ".libs/"
- | /* end confdefs.h. */
- | #include <sys/types.h>
- | #include <sys/param.h>
- |
- | int
- | main ()
- | {
- | #if BYTE_ORDER != BIG_ENDIAN
- | not big endian
- | #endif
- |
- | ;
- | return 0;
- | }
- configure:20970: result: no
- configure:21172: checking whether gcc is Clang
- configure:21197: result: yes
- configure:21244: checking whether Clang needs flag to prevent "argument unused" warning when linking with -pthread
- configure:21269: gcc -o conftest -Werror -Wunknown-warning-option -pthread -g -O2 -DHAVE_BUILD_INFO -D__STDC_FORMAT_MACROS -I/usr/local/opt/berkeley-db@4/include -DMAC_OSX -Wl,-headerpad_max_install_names conftest.c -L/usr/local/opt/berkeley-db@4/lib >&5
- configure:21269: $? = 0
- configure:21275: (gcc -c -Werror -Wunknown-warning-option -pthread -g -O2 -DHAVE_BUILD_INFO -D__STDC_FORMAT_MACROS -I/usr/local/opt/berkeley-db@4/include -DMAC_OSX conftest.c >&5) && (echo ==== >&5) && (gcc -o conftest -Werror -Wunknown-warning-option -pthread -g -O2 -DHAVE_BUILD_INFO -D__STDC_FORMAT_MACROS -I/usr/local/opt/berkeley-db@4/include -DMAC_OSX -Wl,-headerpad_max_install_names conftest.o -L/usr/local/opt/berkeley-db@4/lib >&5)
- ====
- clang: error: argument unused during compilation: '-pthread' [-Werror,-Wunused-command-line-argument]
- configure:21275: $? = 1
- configure: failed program was:
- | /* confdefs.h */
- | #define PACKAGE_NAME "Bitcoin Core"
- | #define PACKAGE_TARNAME "bitcoin"
- | #define PACKAGE_VERSION "0.14.99"
- | #define PACKAGE_STRING "Bitcoin Core 0.14.99"
- | #define PACKAGE_BUGREPORT "https://github.com/bitcoin/bitcoin/issues"
- | #define PACKAGE_URL "https://bitcoincore.org/"
- | #define HAVE_CXX11 1
- | #define STDC_HEADERS 1
- | #define HAVE_SYS_TYPES_H 1
- | #define HAVE_SYS_STAT_H 1
- | #define HAVE_STDLIB_H 1
- | #define HAVE_STRING_H 1
- | #define HAVE_MEMORY_H 1
- | #define HAVE_STRINGS_H 1
- | #define HAVE_INTTYPES_H 1
- | #define HAVE_STDINT_H 1
- | #define HAVE_UNISTD_H 1
- | #define HAVE_DLFCN_H 1
- | #define LT_OBJDIR ".libs/"
- | /* end confdefs.h. */
- | int main(void){return 0;}
- configure:21269: gcc -o conftest -Werror -Wunknown-warning-option -Qunused-arguments -pthread -g -O2 -DHAVE_BUILD_INFO -D__STDC_FORMAT_MACROS -I/usr/local/opt/berkeley-db@4/include -DMAC_OSX -Wl,-headerpad_max_install_names conftest.c -L/usr/local/opt/berkeley-db@4/lib >&5
- configure:21269: $? = 0
- configure:21275: (gcc -c -Werror -Wunknown-warning-option -Qunused-arguments -pthread -g -O2 -DHAVE_BUILD_INFO -D__STDC_FORMAT_MACROS -I/usr/local/opt/berkeley-db@4/include -DMAC_OSX conftest.c >&5) && (echo ==== >&5) && (gcc -o conftest -Werror -Wunknown-warning-option -Qunused-arguments -pthread -g -O2 -DHAVE_BUILD_INFO -D__STDC_FORMAT_MACROS -I/usr/local/opt/berkeley-db@4/include -DMAC_OSX -Wl,-headerpad_max_install_names conftest.o -L/usr/local/opt/berkeley-db@4/lib >&5)
- ====
- configure:21275: $? = 0
- configure:21293: result: -Qunused-arguments
- configure:21442: checking for joinable pthread attribute
- configure:21460: gcc -o conftest -g -O2 -Qunused-arguments -pthread -DHAVE_BUILD_INFO -D__STDC_FORMAT_MACROS -I/usr/local/opt/berkeley-db@4/include -DMAC_OSX -Wl,-headerpad_max_install_names conftest.c -L/usr/local/opt/berkeley-db@4/lib >&5
- configure:21460: $? = 0
- configure:21468: result: PTHREAD_CREATE_JOINABLE
- configure:21482: checking whether more special flags are required for pthreads
- configure:21495: result: no
- configure:21503: checking for PTHREAD_PRIO_INHERIT
- configure:21519: gcc -o conftest -g -O2 -Qunused-arguments -pthread -DHAVE_BUILD_INFO -D__STDC_FORMAT_MACROS -I/usr/local/opt/berkeley-db@4/include -DMAC_OSX -Wl,-headerpad_max_install_names conftest.c -L/usr/local/opt/berkeley-db@4/lib >&5
- configure:21519: $? = 0
- configure:21528: result: yes
- configure:21641: checking for special C compiler options needed for large files
- configure:21686: result: no
- configure:21692: checking for _FILE_OFFSET_BITS value needed for large files
- configure:21717: g++ -std=c++11 -c -g -O2 -Wall -Wextra -Wformat -Wvla -Wformat-security -Wno-unused-parameter -Wno-self-assign -Wno-unused-local-typedef -Wno-deprecated-register -Wno-implicit-fallthrough -DHAVE_BUILD_INFO -D__STDC_FORMAT_MACROS -I/usr/local/opt/berkeley-db@4/include -DMAC_OSX conftest.cpp >&5
- configure:21717: $? = 0
- configure:21749: result: no
- configure:21835: checking whether strerror_r is declared
- configure:21835: g++ -std=c++11 -c -g -O2 -Wall -Wextra -Wformat -Wvla -Wformat-security -Wno-unused-parameter -Wno-self-assign -Wno-unused-local-typedef -Wno-deprecated-register -Wno-implicit-fallthrough -DHAVE_BUILD_INFO -D__STDC_FORMAT_MACROS -I/usr/local/opt/berkeley-db@4/include -DMAC_OSX conftest.cpp >&5
- configure:21835: $? = 0
- configure:21835: result: yes
- configure:21848: checking for strerror_r
- configure:21848: g++ -std=c++11 -o conftest -g -O2 -Wall -Wextra -Wformat -Wvla -Wformat-security -Wno-unused-parameter -Wno-self-assign -Wno-unused-local-typedef -Wno-deprecated-register -Wno-implicit-fallthrough -DHAVE_BUILD_INFO -D__STDC_FORMAT_MACROS -I/usr/local/opt/berkeley-db@4/include -DMAC_OSX -Wl,-headerpad_max_install_names conftest.cpp -L/usr/local/opt/berkeley-db@4/lib >&5
- configure:21848: $? = 0
- configure:21848: result: yes
- configure:21857: checking whether strerror_r returns char *
- configure:21881: g++ -std=c++11 -c -g -O2 -Wall -Wextra -Wformat -Wvla -Wformat-security -Wno-unused-parameter -Wno-self-assign -Wno-unused-local-typedef -Wno-deprecated-register -Wno-implicit-fallthrough -DHAVE_BUILD_INFO -D__STDC_FORMAT_MACROS -I/usr/local/opt/berkeley-db@4/include -DMAC_OSX conftest.cpp >&5
- conftest.cpp:64:13: error: indirection requires pointer operand ('int' invalid)
- char x = *strerror_r (0, buf, sizeof buf);
- ^~~~~~~~~~~~~~~~~~~~~~~~~~~~~~~~
- conftest.cpp:65:10: error: cannot initialize a variable of type 'char *' with an rvalue of type 'int'
- char *p = strerror_r (0, buf, sizeof buf);
- ^ ~~~~~~~~~~~~~~~~~~~~~~~~~~~~~~~
- 2 errors generated.
- configure:21881: $? = 1
- configure: failed program was:
- | /* confdefs.h */
- | #define PACKAGE_NAME "Bitcoin Core"
- | #define PACKAGE_TARNAME "bitcoin"
- | #define PACKAGE_VERSION "0.14.99"
- | #define PACKAGE_STRING "Bitcoin Core 0.14.99"
- | #define PACKAGE_BUGREPORT "https://github.com/bitcoin/bitcoin/issues"
- | #define PACKAGE_URL "https://bitcoincore.org/"
- | #define HAVE_CXX11 1
- | #define STDC_HEADERS 1
- | #define HAVE_SYS_TYPES_H 1
- | #define HAVE_SYS_STAT_H 1
- | #define HAVE_STDLIB_H 1
- | #define HAVE_STRING_H 1
- | #define HAVE_MEMORY_H 1
- | #define HAVE_STRINGS_H 1
- | #define HAVE_INTTYPES_H 1
- | #define HAVE_STDINT_H 1
- | #define HAVE_UNISTD_H 1
- | #define HAVE_DLFCN_H 1
- | #define LT_OBJDIR ".libs/"
- | #define HAVE_PTHREAD_PRIO_INHERIT 1
- | #define HAVE_PTHREAD 1
- | #define HAVE_DECL_STRERROR_R 1
- | #define HAVE_STRERROR_R 1
- | /* end confdefs.h. */
- | #include <stdio.h>
- | #ifdef HAVE_SYS_TYPES_H
- | # include <sys/types.h>
- | #endif
- | #ifdef HAVE_SYS_STAT_H
- | # include <sys/stat.h>
- | #endif
- | #ifdef STDC_HEADERS
- | # include <stdlib.h>
- | # include <stddef.h>
- | #else
- | # ifdef HAVE_STDLIB_H
- | # include <stdlib.h>
- | # endif
- | #endif
- | #ifdef HAVE_STRING_H
- | # if !defined STDC_HEADERS && defined HAVE_MEMORY_H
- | # include <memory.h>
- | # endif
- | # include <string.h>
- | #endif
- | #ifdef HAVE_STRINGS_H
- | # include <strings.h>
- | #endif
- | #ifdef HAVE_INTTYPES_H
- | # include <inttypes.h>
- | #endif
- | #ifdef HAVE_STDINT_H
- | # include <stdint.h>
- | #endif
- | #ifdef HAVE_UNISTD_H
- | # include <unistd.h>
- | #endif
- | int
- | main ()
- | {
- |
- | char buf[100];
- | char x = *strerror_r (0, buf, sizeof buf);
- | char *p = strerror_r (0, buf, sizeof buf);
- | return !p || x;
- |
- | ;
- | return 0;
- | }
- configure:21919: result: no
- configure:21940: checking whether the linker accepts -Wl,--large-address-aware
- configure:21959: g++ -std=c++11 -o conftest -g -O2 -Wall -Wextra -Wformat -Wvla -Wformat-security -Wno-unused-parameter -Wno-self-assign -Wno-unused-local-typedef -Wno-deprecated-register -Wno-implicit-fallthrough -DHAVE_BUILD_INFO -D__STDC_FORMAT_MACROS -I/usr/local/opt/berkeley-db@4/include -DMAC_OSX -Wl,-headerpad_max_install_names -Wl,--large-address-aware conftest.cpp -L/usr/local/opt/berkeley-db@4/lib >&5
- ld: unknown option: --large-address-aware
- clang: error: linker command failed with exit code 1 (use -v to see invocation)
- configure:21959: $? = 1
- configure: failed program was:
- | /* confdefs.h */
- | #define PACKAGE_NAME "Bitcoin Core"
- | #define PACKAGE_TARNAME "bitcoin"
- | #define PACKAGE_VERSION "0.14.99"
- | #define PACKAGE_STRING "Bitcoin Core 0.14.99"
- | #define PACKAGE_BUGREPORT "https://github.com/bitcoin/bitcoin/issues"
- | #define PACKAGE_URL "https://bitcoincore.org/"
- | #define HAVE_CXX11 1
- | #define STDC_HEADERS 1
- | #define HAVE_SYS_TYPES_H 1
- | #define HAVE_SYS_STAT_H 1
- | #define HAVE_STDLIB_H 1
- | #define HAVE_STRING_H 1
- | #define HAVE_MEMORY_H 1
- | #define HAVE_STRINGS_H 1
- | #define HAVE_INTTYPES_H 1
- | #define HAVE_STDINT_H 1
- | #define HAVE_UNISTD_H 1
- | #define HAVE_DLFCN_H 1
- | #define LT_OBJDIR ".libs/"
- | #define HAVE_PTHREAD_PRIO_INHERIT 1
- | #define HAVE_PTHREAD 1
- | #define HAVE_DECL_STRERROR_R 1
- | #define HAVE_STRERROR_R 1
- | /* end confdefs.h. */
- |
- | int
- | main ()
- | {
- |
- | ;
- | return 0;
- | }
- configure:21968: result: no
- configure:21980: checking for __attribute__((visibility))
- configure:22004: g++ -std=c++11 -o conftest -g -O2 -Wall -Wextra -Wformat -Wvla -Wformat-security -Wno-unused-parameter -Wno-self-assign -Wno-unused-local-typedef -Wno-deprecated-register -Wno-implicit-fallthrough -DHAVE_BUILD_INFO -D__STDC_FORMAT_MACROS -I/usr/local/opt/berkeley-db@4/include -DMAC_OSX -Wl,-headerpad_max_install_names conftest.cpp -L/usr/local/opt/berkeley-db@4/lib >&5
- conftest.cpp:31:56: warning: target does not support 'protected' visibility; using 'default' [-Wunsupported-visibility]
- int foo_pro( void ) __attribute__((visibility("protected")));
- ^
- 1 warning generated.
- configure:22004: $? = 0
- configure:22017: result: no
- configure:22033: checking for __attribute__((dllexport))
- configure:22054: g++ -std=c++11 -o conftest -g -O2 -Wall -Wextra -Wformat -Wvla -Wformat-security -Wno-unused-parameter -Wno-self-assign -Wno-unused-local-typedef -Wno-deprecated-register -Wno-implicit-fallthrough -DHAVE_BUILD_INFO -D__STDC_FORMAT_MACROS -I/usr/local/opt/berkeley-db@4/include -DMAC_OSX -Wl,-headerpad_max_install_names conftest.cpp -L/usr/local/opt/berkeley-db@4/lib >&5
- conftest.cpp:28:36: warning: unknown attribute 'dllexport' ignored [-Wunknown-attributes]
- __attribute__((dllexport)) int foo( void ) { return 0; }
- ^
- 1 warning generated.
- configure:22054: $? = 0
- configure:22067: result: no
- configure:22083: checking for __attribute__((dllimport))
- configure:22104: g++ -std=c++11 -o conftest -g -O2 -Wall -Wextra -Wformat -Wvla -Wformat-security -Wno-unused-parameter -Wno-self-assign -Wno-unused-local-typedef -Wno-deprecated-register -Wno-implicit-fallthrough -DHAVE_BUILD_INFO -D__STDC_FORMAT_MACROS -I/usr/local/opt/berkeley-db@4/include -DMAC_OSX -Wl,-headerpad_max_install_names conftest.cpp -L/usr/local/opt/berkeley-db@4/lib >&5
- conftest.cpp:28:52: warning: unknown attribute 'dllimport' ignored [-Wunknown-attributes]
- int foo( void ) __attribute__((dllimport));
- ^
- 1 warning generated.
- configure:22104: $? = 0
- configure:22117: result: no
- configure:22217: checking for library containing clock_gettime
- configure:22248: g++ -std=c++11 -o conftest -g -O2 -Wall -Wextra -Wformat -Wvla -Wformat-security -Wno-unused-parameter -Wno-self-assign -Wno-unused-local-typedef -Wno-deprecated-register -Wno-implicit-fallthrough -DHAVE_BUILD_INFO -D__STDC_FORMAT_MACROS -I/usr/local/opt/berkeley-db@4/include -DMAC_OSX -Wl,-headerpad_max_install_names conftest.cpp -L/usr/local/opt/berkeley-db@4/lib >&5
- configure:22248: $? = 0
- configure:22265: result: none required
- configure:22277: checking whether C++ compiler accepts -fPIC
- configure:22296: g++ -std=c++11 -c -g -O2 -Wall -Wextra -Wformat -Wvla -Wformat-security -Wno-unused-parameter -Wno-self-assign -Wno-unused-local-typedef -Wno-deprecated-register -Wno-implicit-fallthrough -fPIC -DHAVE_BUILD_INFO -D__STDC_FORMAT_MACROS -I/usr/local/opt/berkeley-db@4/include -DMAC_OSX conftest.cpp >&5
- configure:22296: $? = 0
- configure:22304: result: yes
- configure:22315: checking whether C++ compiler accepts -Wstack-protector
- configure:22334: g++ -std=c++11 -c -g -O2 -Wall -Wextra -Wformat -Wvla -Wformat-security -Wno-unused-parameter -Wno-self-assign -Wno-unused-local-typedef -Wno-deprecated-register -Wno-implicit-fallthrough -Wstack-protector -DHAVE_BUILD_INFO -D__STDC_FORMAT_MACROS -I/usr/local/opt/berkeley-db@4/include -DMAC_OSX conftest.cpp >&5
- configure:22334: $? = 0
- configure:22342: result: yes
- configure:22350: checking whether C++ compiler accepts -fstack-protector-all
- configure:22369: g++ -std=c++11 -c -g -O2 -Wall -Wextra -Wformat -Wvla -Wformat-security -Wno-unused-parameter -Wno-self-assign -Wno-unused-local-typedef -Wno-deprecated-register -Wno-implicit-fallthrough -fstack-protector-all -DHAVE_BUILD_INFO -D__STDC_FORMAT_MACROS -I/usr/local/opt/berkeley-db@4/include -DMAC_OSX conftest.cpp >&5
- configure:22369: $? = 0
- configure:22377: result: yes
- configure:22387: checking whether C++ preprocessor accepts -D_FORTIFY_SOURCE=2
- configure:22406: g++ -std=c++11 -E -DHAVE_BUILD_INFO -D__STDC_FORMAT_MACROS -I/usr/local/opt/berkeley-db@4/include -DMAC_OSX -D_FORTIFY_SOURCE=2 conftest.cpp
- configure:22406: $? = 0
- configure:22414: result: yes
- configure:22418: checking whether C++ preprocessor accepts -U_FORTIFY_SOURCE
- configure:22437: g++ -std=c++11 -E -DHAVE_BUILD_INFO -D__STDC_FORMAT_MACROS -I/usr/local/opt/berkeley-db@4/include -DMAC_OSX -U_FORTIFY_SOURCE conftest.cpp
- configure:22437: $? = 0
- configure:22445: result: yes
- configure:22462: checking whether the linker accepts -Wl,--dynamicbase
- configure:22481: g++ -std=c++11 -o conftest -g -O2 -Wall -Wextra -Wformat -Wvla -Wformat-security -Wno-unused-parameter -Wno-self-assign -Wno-unused-local-typedef -Wno-deprecated-register -Wno-implicit-fallthrough -DHAVE_BUILD_INFO -D__STDC_FORMAT_MACROS -I/usr/local/opt/berkeley-db@4/include -DMAC_OSX -Wl,-headerpad_max_install_names -Wl,--dynamicbase conftest.cpp -L/usr/local/opt/berkeley-db@4/lib >&5
- ld: unknown option: --dynamicbase
- clang: error: linker command failed with exit code 1 (use -v to see invocation)
- configure:22481: $? = 1
- configure: failed program was:
- | /* confdefs.h */
- | #define PACKAGE_NAME "Bitcoin Core"
- | #define PACKAGE_TARNAME "bitcoin"
- | #define PACKAGE_VERSION "0.14.99"
- | #define PACKAGE_STRING "Bitcoin Core 0.14.99"
- | #define PACKAGE_BUGREPORT "https://github.com/bitcoin/bitcoin/issues"
- | #define PACKAGE_URL "https://bitcoincore.org/"
- | #define HAVE_CXX11 1
- | #define STDC_HEADERS 1
- | #define HAVE_SYS_TYPES_H 1
- | #define HAVE_SYS_STAT_H 1
- | #define HAVE_STDLIB_H 1
- | #define HAVE_STRING_H 1
- | #define HAVE_MEMORY_H 1
- | #define HAVE_STRINGS_H 1
- | #define HAVE_INTTYPES_H 1
- | #define HAVE_STDINT_H 1
- | #define HAVE_UNISTD_H 1
- | #define HAVE_DLFCN_H 1
- | #define LT_OBJDIR ".libs/"
- | #define HAVE_PTHREAD_PRIO_INHERIT 1
- | #define HAVE_PTHREAD 1
- | #define HAVE_DECL_STRERROR_R 1
- | #define HAVE_STRERROR_R 1
- | /* end confdefs.h. */
- |
- | int
- | main ()
- | {
- |
- | ;
- | return 0;
- | }
- configure:22490: result: no
- configure:22498: checking whether the linker accepts -Wl,--nxcompat
- configure:22517: g++ -std=c++11 -o conftest -g -O2 -Wall -Wextra -Wformat -Wvla -Wformat-security -Wno-unused-parameter -Wno-self-assign -Wno-unused-local-typedef -Wno-deprecated-register -Wno-implicit-fallthrough -DHAVE_BUILD_INFO -D__STDC_FORMAT_MACROS -I/usr/local/opt/berkeley-db@4/include -DMAC_OSX -Wl,-headerpad_max_install_names -Wl,--nxcompat conftest.cpp -L/usr/local/opt/berkeley-db@4/lib >&5
- ld: unknown option: --nxcompat
- clang: error: linker command failed with exit code 1 (use -v to see invocation)
- configure:22517: $? = 1
- configure: failed program was:
- | /* confdefs.h */
- | #define PACKAGE_NAME "Bitcoin Core"
- | #define PACKAGE_TARNAME "bitcoin"
- | #define PACKAGE_VERSION "0.14.99"
- | #define PACKAGE_STRING "Bitcoin Core 0.14.99"
- | #define PACKAGE_BUGREPORT "https://github.com/bitcoin/bitcoin/issues"
- | #define PACKAGE_URL "https://bitcoincore.org/"
- | #define HAVE_CXX11 1
- | #define STDC_HEADERS 1
- | #define HAVE_SYS_TYPES_H 1
- | #define HAVE_SYS_STAT_H 1
- | #define HAVE_STDLIB_H 1
- | #define HAVE_STRING_H 1
- | #define HAVE_MEMORY_H 1
- | #define HAVE_STRINGS_H 1
- | #define HAVE_INTTYPES_H 1
- | #define HAVE_STDINT_H 1
- | #define HAVE_UNISTD_H 1
- | #define HAVE_DLFCN_H 1
- | #define LT_OBJDIR ".libs/"
- | #define HAVE_PTHREAD_PRIO_INHERIT 1
- | #define HAVE_PTHREAD 1
- | #define HAVE_DECL_STRERROR_R 1
- | #define HAVE_STRERROR_R 1
- | /* end confdefs.h. */
- |
- | int
- | main ()
- | {
- |
- | ;
- | return 0;
- | }
- configure:22526: result: no
- configure:22534: checking whether the linker accepts -Wl,--high-entropy-va
- configure:22553: g++ -std=c++11 -o conftest -g -O2 -Wall -Wextra -Wformat -Wvla -Wformat-security -Wno-unused-parameter -Wno-self-assign -Wno-unused-local-typedef -Wno-deprecated-register -Wno-implicit-fallthrough -DHAVE_BUILD_INFO -D__STDC_FORMAT_MACROS -I/usr/local/opt/berkeley-db@4/include -DMAC_OSX -Wl,-headerpad_max_install_names -Wl,--high-entropy-va conftest.cpp -L/usr/local/opt/berkeley-db@4/lib >&5
- ld: unknown option: --high-entropy-va
- clang: error: linker command failed with exit code 1 (use -v to see invocation)
- configure:22553: $? = 1
- configure: failed program was:
- | /* confdefs.h */
- | #define PACKAGE_NAME "Bitcoin Core"
- | #define PACKAGE_TARNAME "bitcoin"
- | #define PACKAGE_VERSION "0.14.99"
- | #define PACKAGE_STRING "Bitcoin Core 0.14.99"
- | #define PACKAGE_BUGREPORT "https://github.com/bitcoin/bitcoin/issues"
- | #define PACKAGE_URL "https://bitcoincore.org/"
- | #define HAVE_CXX11 1
- | #define STDC_HEADERS 1
- | #define HAVE_SYS_TYPES_H 1
- | #define HAVE_SYS_STAT_H 1
- | #define HAVE_STDLIB_H 1
- | #define HAVE_STRING_H 1
- | #define HAVE_MEMORY_H 1
- | #define HAVE_STRINGS_H 1
- | #define HAVE_INTTYPES_H 1
- | #define HAVE_STDINT_H 1
- | #define HAVE_UNISTD_H 1
- | #define HAVE_DLFCN_H 1
- | #define LT_OBJDIR ".libs/"
- | #define HAVE_PTHREAD_PRIO_INHERIT 1
- | #define HAVE_PTHREAD 1
- | #define HAVE_DECL_STRERROR_R 1
- | #define HAVE_STRERROR_R 1
- | /* end confdefs.h. */
- |
- | int
- | main ()
- | {
- |
- | ;
- | return 0;
- | }
- configure:22562: result: no
- configure:22570: checking whether the linker accepts -Wl,-z,relro
- configure:22589: g++ -std=c++11 -o conftest -g -O2 -Wall -Wextra -Wformat -Wvla -Wformat-security -Wno-unused-parameter -Wno-self-assign -Wno-unused-local-typedef -Wno-deprecated-register -Wno-implicit-fallthrough -DHAVE_BUILD_INFO -D__STDC_FORMAT_MACROS -I/usr/local/opt/berkeley-db@4/include -DMAC_OSX -Wl,-headerpad_max_install_names -Wl,-z,relro conftest.cpp -L/usr/local/opt/berkeley-db@4/lib >&5
- ld: unknown option: -z
- clang: error: linker command failed with exit code 1 (use -v to see invocation)
- configure:22589: $? = 1
- configure: failed program was:
- | /* confdefs.h */
- | #define PACKAGE_NAME "Bitcoin Core"
- | #define PACKAGE_TARNAME "bitcoin"
- | #define PACKAGE_VERSION "0.14.99"
- | #define PACKAGE_STRING "Bitcoin Core 0.14.99"
- | #define PACKAGE_BUGREPORT "https://github.com/bitcoin/bitcoin/issues"
- | #define PACKAGE_URL "https://bitcoincore.org/"
- | #define HAVE_CXX11 1
- | #define STDC_HEADERS 1
- | #define HAVE_SYS_TYPES_H 1
- | #define HAVE_SYS_STAT_H 1
- | #define HAVE_STDLIB_H 1
- | #define HAVE_STRING_H 1
- | #define HAVE_MEMORY_H 1
- | #define HAVE_STRINGS_H 1
- | #define HAVE_INTTYPES_H 1
- | #define HAVE_STDINT_H 1
- | #define HAVE_UNISTD_H 1
- | #define HAVE_DLFCN_H 1
- | #define LT_OBJDIR ".libs/"
- | #define HAVE_PTHREAD_PRIO_INHERIT 1
- | #define HAVE_PTHREAD 1
- | #define HAVE_DECL_STRERROR_R 1
- | #define HAVE_STRERROR_R 1
- | /* end confdefs.h. */
- |
- | int
- | main ()
- | {
- |
- | ;
- | return 0;
- | }
- configure:22598: result: no
- configure:22606: checking whether the linker accepts -Wl,-z,now
- configure:22625: g++ -std=c++11 -o conftest -g -O2 -Wall -Wextra -Wformat -Wvla -Wformat-security -Wno-unused-parameter -Wno-self-assign -Wno-unused-local-typedef -Wno-deprecated-register -Wno-implicit-fallthrough -DHAVE_BUILD_INFO -D__STDC_FORMAT_MACROS -I/usr/local/opt/berkeley-db@4/include -DMAC_OSX -Wl,-headerpad_max_install_names -Wl,-z,now conftest.cpp -L/usr/local/opt/berkeley-db@4/lib >&5
- ld: unknown option: -z
- clang: error: linker command failed with exit code 1 (use -v to see invocation)
- configure:22625: $? = 1
- configure: failed program was:
- | /* confdefs.h */
- | #define PACKAGE_NAME "Bitcoin Core"
- | #define PACKAGE_TARNAME "bitcoin"
- | #define PACKAGE_VERSION "0.14.99"
- | #define PACKAGE_STRING "Bitcoin Core 0.14.99"
- | #define PACKAGE_BUGREPORT "https://github.com/bitcoin/bitcoin/issues"
- | #define PACKAGE_URL "https://bitcoincore.org/"
- | #define HAVE_CXX11 1
- | #define STDC_HEADERS 1
- | #define HAVE_SYS_TYPES_H 1
- | #define HAVE_SYS_STAT_H 1
- | #define HAVE_STDLIB_H 1
- | #define HAVE_STRING_H 1
- | #define HAVE_MEMORY_H 1
- | #define HAVE_STRINGS_H 1
- | #define HAVE_INTTYPES_H 1
- | #define HAVE_STDINT_H 1
- | #define HAVE_UNISTD_H 1
- | #define HAVE_DLFCN_H 1
- | #define LT_OBJDIR ".libs/"
- | #define HAVE_PTHREAD_PRIO_INHERIT 1
- | #define HAVE_PTHREAD 1
- | #define HAVE_DECL_STRERROR_R 1
- | #define HAVE_STRERROR_R 1
- | /* end confdefs.h. */
- |
- | int
- | main ()
- | {
- |
- | ;
- | return 0;
- | }
- configure:22634: result: no
- configure:22644: checking whether C++ compiler accepts -fPIE
- configure:22663: g++ -std=c++11 -c -g -O2 -Wall -Wextra -Wformat -Wvla -Wformat-security -Wno-unused-parameter -Wno-self-assign -Wno-unused-local-typedef -Wno-deprecated-register -Wno-implicit-fallthrough -fPIE -DHAVE_BUILD_INFO -D__STDC_FORMAT_MACROS -I/usr/local/opt/berkeley-db@4/include -DMAC_OSX conftest.cpp >&5
- configure:22663: $? = 0
- configure:22671: result: yes
- configure:22679: checking whether the linker accepts -pie
- configure:22698: g++ -std=c++11 -o conftest -g -O2 -Wall -Wextra -Wformat -Wvla -Wformat-security -Wno-unused-parameter -Wno-self-assign -Wno-unused-local-typedef -Wno-deprecated-register -Wno-implicit-fallthrough -DHAVE_BUILD_INFO -D__STDC_FORMAT_MACROS -I/usr/local/opt/berkeley-db@4/include -DMAC_OSX -Wl,-headerpad_max_install_names -pie conftest.cpp -L/usr/local/opt/berkeley-db@4/lib >&5
- clang: warning: argument unused during compilation: '-pie' [-Wunused-command-line-argument]
- configure:22698: $? = 0
- configure:22707: result: yes
- configure:22765: checking whether the linker accepts -Wl,-dead_strip
- configure:22784: g++ -std=c++11 -o conftest -g -O2 -Wall -Wextra -Wformat -Wvla -Wformat-security -Wno-unused-parameter -Wno-self-assign -Wno-unused-local-typedef -Wno-deprecated-register -Wno-implicit-fallthrough -DHAVE_BUILD_INFO -D__STDC_FORMAT_MACROS -I/usr/local/opt/berkeley-db@4/include -DMAC_OSX -Wl,-headerpad_max_install_names -Wl,-dead_strip conftest.cpp -L/usr/local/opt/berkeley-db@4/lib >&5
- configure:22784: $? = 0
- configure:22793: result: yes
- configure:22806: checking endian.h usability
- configure:22806: g++ -std=c++11 -c -g -O2 -Wall -Wextra -Wformat -Wvla -Wformat-security -Wno-unused-parameter -Wno-self-assign -Wno-unused-local-typedef -Wno-deprecated-register -Wno-implicit-fallthrough -DHAVE_BUILD_INFO -D__STDC_FORMAT_MACROS -I/usr/local/opt/berkeley-db@4/include -DMAC_OSX conftest.cpp >&5
- conftest.cpp:59:10: fatal error: 'endian.h' file not found
- #include <endian.h>
- ^
- 1 error generated.
- configure:22806: $? = 1
- configure: failed program was:
- | /* confdefs.h */
- | #define PACKAGE_NAME "Bitcoin Core"
- | #define PACKAGE_TARNAME "bitcoin"
- | #define PACKAGE_VERSION "0.14.99"
- | #define PACKAGE_STRING "Bitcoin Core 0.14.99"
- | #define PACKAGE_BUGREPORT "https://github.com/bitcoin/bitcoin/issues"
- | #define PACKAGE_URL "https://bitcoincore.org/"
- | #define HAVE_CXX11 1
- | #define STDC_HEADERS 1
- | #define HAVE_SYS_TYPES_H 1
- | #define HAVE_SYS_STAT_H 1
- | #define HAVE_STDLIB_H 1
- | #define HAVE_STRING_H 1
- | #define HAVE_MEMORY_H 1
- | #define HAVE_STRINGS_H 1
- | #define HAVE_INTTYPES_H 1
- | #define HAVE_STDINT_H 1
- | #define HAVE_UNISTD_H 1
- | #define HAVE_DLFCN_H 1
- | #define LT_OBJDIR ".libs/"
- | #define HAVE_PTHREAD_PRIO_INHERIT 1
- | #define HAVE_PTHREAD 1
- | #define HAVE_DECL_STRERROR_R 1
- | #define HAVE_STRERROR_R 1
- | /* end confdefs.h. */
- | #include <stdio.h>
- | #ifdef HAVE_SYS_TYPES_H
- | # include <sys/types.h>
- | #endif
- | #ifdef HAVE_SYS_STAT_H
- | # include <sys/stat.h>
- | #endif
- | #ifdef STDC_HEADERS
- | # include <stdlib.h>
- | # include <stddef.h>
- | #else
- | # ifdef HAVE_STDLIB_H
- | # include <stdlib.h>
- | # endif
- | #endif
- | #ifdef HAVE_STRING_H
- | # if !defined STDC_HEADERS && defined HAVE_MEMORY_H
- | # include <memory.h>
- | # endif
- | # include <string.h>
- | #endif
- | #ifdef HAVE_STRINGS_H
- | # include <strings.h>
- | #endif
- | #ifdef HAVE_INTTYPES_H
- | # include <inttypes.h>
- | #endif
- | #ifdef HAVE_STDINT_H
- | # include <stdint.h>
- | #endif
- | #ifdef HAVE_UNISTD_H
- | # include <unistd.h>
- | #endif
- | #include <endian.h>
- configure:22806: result: no
- configure:22806: checking endian.h presence
- configure:22806: g++ -std=c++11 -E -DHAVE_BUILD_INFO -D__STDC_FORMAT_MACROS -I/usr/local/opt/berkeley-db@4/include -DMAC_OSX conftest.cpp
- conftest.cpp:26:10: fatal error: 'endian.h' file not found
- #include <endian.h>
- ^
- 1 error generated.
- configure:22806: $? = 1
- configure: failed program was:
- | /* confdefs.h */
- | #define PACKAGE_NAME "Bitcoin Core"
- | #define PACKAGE_TARNAME "bitcoin"
- | #define PACKAGE_VERSION "0.14.99"
- | #define PACKAGE_STRING "Bitcoin Core 0.14.99"
- | #define PACKAGE_BUGREPORT "https://github.com/bitcoin/bitcoin/issues"
- | #define PACKAGE_URL "https://bitcoincore.org/"
- | #define HAVE_CXX11 1
- | #define STDC_HEADERS 1
- | #define HAVE_SYS_TYPES_H 1
- | #define HAVE_SYS_STAT_H 1
- | #define HAVE_STDLIB_H 1
- | #define HAVE_STRING_H 1
- | #define HAVE_MEMORY_H 1
- | #define HAVE_STRINGS_H 1
- | #define HAVE_INTTYPES_H 1
- | #define HAVE_STDINT_H 1
- | #define HAVE_UNISTD_H 1
- | #define HAVE_DLFCN_H 1
- | #define LT_OBJDIR ".libs/"
- | #define HAVE_PTHREAD_PRIO_INHERIT 1
- | #define HAVE_PTHREAD 1
- | #define HAVE_DECL_STRERROR_R 1
- | #define HAVE_STRERROR_R 1
- | /* end confdefs.h. */
- | #include <endian.h>
- configure:22806: result: no
- configure:22806: checking for endian.h
- configure:22806: result: no
- configure:22806: checking sys/endian.h usability
- configure:22806: g++ -std=c++11 -c -g -O2 -Wall -Wextra -Wformat -Wvla -Wformat-security -Wno-unused-parameter -Wno-self-assign -Wno-unused-local-typedef -Wno-deprecated-register -Wno-implicit-fallthrough -DHAVE_BUILD_INFO -D__STDC_FORMAT_MACROS -I/usr/local/opt/berkeley-db@4/include -DMAC_OSX conftest.cpp >&5
- conftest.cpp:59:10: fatal error: 'sys/endian.h' file not found
- #include <sys/endian.h>
- ^
- 1 error generated.
- configure:22806: $? = 1
- configure: failed program was:
- | /* confdefs.h */
- | #define PACKAGE_NAME "Bitcoin Core"
- | #define PACKAGE_TARNAME "bitcoin"
- | #define PACKAGE_VERSION "0.14.99"
- | #define PACKAGE_STRING "Bitcoin Core 0.14.99"
- | #define PACKAGE_BUGREPORT "https://github.com/bitcoin/bitcoin/issues"
- | #define PACKAGE_URL "https://bitcoincore.org/"
- | #define HAVE_CXX11 1
- | #define STDC_HEADERS 1
- | #define HAVE_SYS_TYPES_H 1
- | #define HAVE_SYS_STAT_H 1
- | #define HAVE_STDLIB_H 1
- | #define HAVE_STRING_H 1
- | #define HAVE_MEMORY_H 1
- | #define HAVE_STRINGS_H 1
- | #define HAVE_INTTYPES_H 1
- | #define HAVE_STDINT_H 1
- | #define HAVE_UNISTD_H 1
- | #define HAVE_DLFCN_H 1
- | #define LT_OBJDIR ".libs/"
- | #define HAVE_PTHREAD_PRIO_INHERIT 1
- | #define HAVE_PTHREAD 1
- | #define HAVE_DECL_STRERROR_R 1
- | #define HAVE_STRERROR_R 1
- | /* end confdefs.h. */
- | #include <stdio.h>
- | #ifdef HAVE_SYS_TYPES_H
- | # include <sys/types.h>
- | #endif
- | #ifdef HAVE_SYS_STAT_H
- | # include <sys/stat.h>
- | #endif
- | #ifdef STDC_HEADERS
- | # include <stdlib.h>
- | # include <stddef.h>
- | #else
- | # ifdef HAVE_STDLIB_H
- | # include <stdlib.h>
- | # endif
- | #endif
- | #ifdef HAVE_STRING_H
- | # if !defined STDC_HEADERS && defined HAVE_MEMORY_H
- | # include <memory.h>
- | # endif
- | # include <string.h>
- | #endif
- | #ifdef HAVE_STRINGS_H
- | # include <strings.h>
- | #endif
- | #ifdef HAVE_INTTYPES_H
- | # include <inttypes.h>
- | #endif
- | #ifdef HAVE_STDINT_H
- | # include <stdint.h>
- | #endif
- | #ifdef HAVE_UNISTD_H
- | # include <unistd.h>
- | #endif
- | #include <sys/endian.h>
- configure:22806: result: no
- configure:22806: checking sys/endian.h presence
- configure:22806: g++ -std=c++11 -E -DHAVE_BUILD_INFO -D__STDC_FORMAT_MACROS -I/usr/local/opt/berkeley-db@4/include -DMAC_OSX conftest.cpp
- conftest.cpp:26:10: fatal error: 'sys/endian.h' file not found
- #include <sys/endian.h>
- ^
- 1 error generated.
- configure:22806: $? = 1
- configure: failed program was:
- | /* confdefs.h */
- | #define PACKAGE_NAME "Bitcoin Core"
- | #define PACKAGE_TARNAME "bitcoin"
- | #define PACKAGE_VERSION "0.14.99"
- | #define PACKAGE_STRING "Bitcoin Core 0.14.99"
- | #define PACKAGE_BUGREPORT "https://github.com/bitcoin/bitcoin/issues"
- | #define PACKAGE_URL "https://bitcoincore.org/"
- | #define HAVE_CXX11 1
- | #define STDC_HEADERS 1
- | #define HAVE_SYS_TYPES_H 1
- | #define HAVE_SYS_STAT_H 1
- | #define HAVE_STDLIB_H 1
- | #define HAVE_STRING_H 1
- | #define HAVE_MEMORY_H 1
- | #define HAVE_STRINGS_H 1
- | #define HAVE_INTTYPES_H 1
- | #define HAVE_STDINT_H 1
- | #define HAVE_UNISTD_H 1
- | #define HAVE_DLFCN_H 1
- | #define LT_OBJDIR ".libs/"
- | #define HAVE_PTHREAD_PRIO_INHERIT 1
- | #define HAVE_PTHREAD 1
- | #define HAVE_DECL_STRERROR_R 1
- | #define HAVE_STRERROR_R 1
- | /* end confdefs.h. */
- | #include <sys/endian.h>
- configure:22806: result: no
- configure:22806: checking for sys/endian.h
- configure:22806: result: no
- configure:22806: checking byteswap.h usability
- configure:22806: g++ -std=c++11 -c -g -O2 -Wall -Wextra -Wformat -Wvla -Wformat-security -Wno-unused-parameter -Wno-self-assign -Wno-unused-local-typedef -Wno-deprecated-register -Wno-implicit-fallthrough -DHAVE_BUILD_INFO -D__STDC_FORMAT_MACROS -I/usr/local/opt/berkeley-db@4/include -DMAC_OSX conftest.cpp >&5
- conftest.cpp:59:10: fatal error: 'byteswap.h' file not found
- #include <byteswap.h>
- ^
- 1 error generated.
- configure:22806: $? = 1
- configure: failed program was:
- | /* confdefs.h */
- | #define PACKAGE_NAME "Bitcoin Core"
- | #define PACKAGE_TARNAME "bitcoin"
- | #define PACKAGE_VERSION "0.14.99"
- | #define PACKAGE_STRING "Bitcoin Core 0.14.99"
- | #define PACKAGE_BUGREPORT "https://github.com/bitcoin/bitcoin/issues"
- | #define PACKAGE_URL "https://bitcoincore.org/"
- | #define HAVE_CXX11 1
- | #define STDC_HEADERS 1
- | #define HAVE_SYS_TYPES_H 1
- | #define HAVE_SYS_STAT_H 1
- | #define HAVE_STDLIB_H 1
- | #define HAVE_STRING_H 1
- | #define HAVE_MEMORY_H 1
- | #define HAVE_STRINGS_H 1
- | #define HAVE_INTTYPES_H 1
- | #define HAVE_STDINT_H 1
- | #define HAVE_UNISTD_H 1
- | #define HAVE_DLFCN_H 1
- | #define LT_OBJDIR ".libs/"
- | #define HAVE_PTHREAD_PRIO_INHERIT 1
- | #define HAVE_PTHREAD 1
- | #define HAVE_DECL_STRERROR_R 1
- | #define HAVE_STRERROR_R 1
- | /* end confdefs.h. */
- | #include <stdio.h>
- | #ifdef HAVE_SYS_TYPES_H
- | # include <sys/types.h>
- | #endif
- | #ifdef HAVE_SYS_STAT_H
- | # include <sys/stat.h>
- | #endif
- | #ifdef STDC_HEADERS
- | # include <stdlib.h>
- | # include <stddef.h>
- | #else
- | # ifdef HAVE_STDLIB_H
- | # include <stdlib.h>
- | # endif
- | #endif
- | #ifdef HAVE_STRING_H
- | # if !defined STDC_HEADERS && defined HAVE_MEMORY_H
- | # include <memory.h>
- | # endif
- | # include <string.h>
- | #endif
- | #ifdef HAVE_STRINGS_H
- | # include <strings.h>
- | #endif
- | #ifdef HAVE_INTTYPES_H
- | # include <inttypes.h>
- | #endif
- | #ifdef HAVE_STDINT_H
- | # include <stdint.h>
- | #endif
- | #ifdef HAVE_UNISTD_H
- | # include <unistd.h>
- | #endif
- | #include <byteswap.h>
- configure:22806: result: no
- configure:22806: checking byteswap.h presence
- configure:22806: g++ -std=c++11 -E -DHAVE_BUILD_INFO -D__STDC_FORMAT_MACROS -I/usr/local/opt/berkeley-db@4/include -DMAC_OSX conftest.cpp
- conftest.cpp:26:10: fatal error: 'byteswap.h' file not found
- #include <byteswap.h>
- ^
- 1 error generated.
- configure:22806: $? = 1
- configure: failed program was:
- | /* confdefs.h */
- | #define PACKAGE_NAME "Bitcoin Core"
- | #define PACKAGE_TARNAME "bitcoin"
- | #define PACKAGE_VERSION "0.14.99"
- | #define PACKAGE_STRING "Bitcoin Core 0.14.99"
- | #define PACKAGE_BUGREPORT "https://github.com/bitcoin/bitcoin/issues"
- | #define PACKAGE_URL "https://bitcoincore.org/"
- | #define HAVE_CXX11 1
- | #define STDC_HEADERS 1
- | #define HAVE_SYS_TYPES_H 1
- | #define HAVE_SYS_STAT_H 1
- | #define HAVE_STDLIB_H 1
- | #define HAVE_STRING_H 1
- | #define HAVE_MEMORY_H 1
- | #define HAVE_STRINGS_H 1
- | #define HAVE_INTTYPES_H 1
- | #define HAVE_STDINT_H 1
- | #define HAVE_UNISTD_H 1
- | #define HAVE_DLFCN_H 1
- | #define LT_OBJDIR ".libs/"
- | #define HAVE_PTHREAD_PRIO_INHERIT 1
- | #define HAVE_PTHREAD 1
- | #define HAVE_DECL_STRERROR_R 1
- | #define HAVE_STRERROR_R 1
- | /* end confdefs.h. */
- | #include <byteswap.h>
- configure:22806: result: no
- configure:22806: checking for byteswap.h
- configure:22806: result: no
- configure:22806: checking stdio.h usability
- configure:22806: g++ -std=c++11 -c -g -O2 -Wall -Wextra -Wformat -Wvla -Wformat-security -Wno-unused-parameter -Wno-self-assign -Wno-unused-local-typedef -Wno-deprecated-register -Wno-implicit-fallthrough -DHAVE_BUILD_INFO -D__STDC_FORMAT_MACROS -I/usr/local/opt/berkeley-db@4/include -DMAC_OSX conftest.cpp >&5
- configure:22806: $? = 0
- configure:22806: result: yes
- configure:22806: checking stdio.h presence
- configure:22806: g++ -std=c++11 -E -DHAVE_BUILD_INFO -D__STDC_FORMAT_MACROS -I/usr/local/opt/berkeley-db@4/include -DMAC_OSX conftest.cpp
- configure:22806: $? = 0
- configure:22806: result: yes
- configure:22806: checking for stdio.h
- configure:22806: result: yes
- configure:22806: checking for stdlib.h
- configure:22806: result: yes
- configure:22806: checking for unistd.h
- configure:22806: result: yes
- configure:22806: checking for strings.h
- configure:22806: result: yes
- configure:22806: checking for sys/types.h
- configure:22806: result: yes
- configure:22806: checking for sys/stat.h
- configure:22806: result: yes
- configure:22806: checking sys/select.h usability
- configure:22806: g++ -std=c++11 -c -g -O2 -Wall -Wextra -Wformat -Wvla -Wformat-security -Wno-unused-parameter -Wno-self-assign -Wno-unused-local-typedef -Wno-deprecated-register -Wno-implicit-fallthrough -DHAVE_BUILD_INFO -D__STDC_FORMAT_MACROS -I/usr/local/opt/berkeley-db@4/include -DMAC_OSX conftest.cpp >&5
- configure:22806: $? = 0
- configure:22806: result: yes
- configure:22806: checking sys/select.h presence
- configure:22806: g++ -std=c++11 -E -DHAVE_BUILD_INFO -D__STDC_FORMAT_MACROS -I/usr/local/opt/berkeley-db@4/include -DMAC_OSX conftest.cpp
- configure:22806: $? = 0
- configure:22806: result: yes
- configure:22806: checking for sys/select.h
- configure:22806: result: yes
- configure:22806: checking sys/prctl.h usability
- configure:22806: g++ -std=c++11 -c -g -O2 -Wall -Wextra -Wformat -Wvla -Wformat-security -Wno-unused-parameter -Wno-self-assign -Wno-unused-local-typedef -Wno-deprecated-register -Wno-implicit-fallthrough -DHAVE_BUILD_INFO -D__STDC_FORMAT_MACROS -I/usr/local/opt/berkeley-db@4/include -DMAC_OSX conftest.cpp >&5
- conftest.cpp:66:10: fatal error: 'sys/prctl.h' file not found
- #include <sys/prctl.h>
- ^
- 1 error generated.
- configure:22806: $? = 1
- configure: failed program was:
- | /* confdefs.h */
- | #define PACKAGE_NAME "Bitcoin Core"
- | #define PACKAGE_TARNAME "bitcoin"
- | #define PACKAGE_VERSION "0.14.99"
- | #define PACKAGE_STRING "Bitcoin Core 0.14.99"
- | #define PACKAGE_BUGREPORT "https://github.com/bitcoin/bitcoin/issues"
- | #define PACKAGE_URL "https://bitcoincore.org/"
- | #define HAVE_CXX11 1
- | #define STDC_HEADERS 1
- | #define HAVE_SYS_TYPES_H 1
- | #define HAVE_SYS_STAT_H 1
- | #define HAVE_STDLIB_H 1
- | #define HAVE_STRING_H 1
- | #define HAVE_MEMORY_H 1
- | #define HAVE_STRINGS_H 1
- | #define HAVE_INTTYPES_H 1
- | #define HAVE_STDINT_H 1
- | #define HAVE_UNISTD_H 1
- | #define HAVE_DLFCN_H 1
- | #define LT_OBJDIR ".libs/"
- | #define HAVE_PTHREAD_PRIO_INHERIT 1
- | #define HAVE_PTHREAD 1
- | #define HAVE_DECL_STRERROR_R 1
- | #define HAVE_STRERROR_R 1
- | #define HAVE_STDIO_H 1
- | #define HAVE_STDLIB_H 1
- | #define HAVE_UNISTD_H 1
- | #define HAVE_STRINGS_H 1
- | #define HAVE_SYS_TYPES_H 1
- | #define HAVE_SYS_STAT_H 1
- | #define HAVE_SYS_SELECT_H 1
- | /* end confdefs.h. */
- | #include <stdio.h>
- | #ifdef HAVE_SYS_TYPES_H
- | # include <sys/types.h>
- | #endif
- | #ifdef HAVE_SYS_STAT_H
- | # include <sys/stat.h>
- | #endif
- | #ifdef STDC_HEADERS
- | # include <stdlib.h>
- | # include <stddef.h>
- | #else
- | # ifdef HAVE_STDLIB_H
- | # include <stdlib.h>
- | # endif
- | #endif
- | #ifdef HAVE_STRING_H
- | # if !defined STDC_HEADERS && defined HAVE_MEMORY_H
- | # include <memory.h>
- | # endif
- | # include <string.h>
- | #endif
- | #ifdef HAVE_STRINGS_H
- | # include <strings.h>
- | #endif
- | #ifdef HAVE_INTTYPES_H
- | # include <inttypes.h>
- | #endif
- | #ifdef HAVE_STDINT_H
- | # include <stdint.h>
- | #endif
- | #ifdef HAVE_UNISTD_H
- | # include <unistd.h>
- | #endif
- | #include <sys/prctl.h>
- configure:22806: result: no
- configure:22806: checking sys/prctl.h presence
- configure:22806: g++ -std=c++11 -E -DHAVE_BUILD_INFO -D__STDC_FORMAT_MACROS -I/usr/local/opt/berkeley-db@4/include -DMAC_OSX conftest.cpp
- conftest.cpp:33:10: fatal error: 'sys/prctl.h' file not found
- #include <sys/prctl.h>
- ^
- 1 error generated.
- configure:22806: $? = 1
- configure: failed program was:
- | /* confdefs.h */
- | #define PACKAGE_NAME "Bitcoin Core"
- | #define PACKAGE_TARNAME "bitcoin"
- | #define PACKAGE_VERSION "0.14.99"
- | #define PACKAGE_STRING "Bitcoin Core 0.14.99"
- | #define PACKAGE_BUGREPORT "https://github.com/bitcoin/bitcoin/issues"
- | #define PACKAGE_URL "https://bitcoincore.org/"
- | #define HAVE_CXX11 1
- | #define STDC_HEADERS 1
- | #define HAVE_SYS_TYPES_H 1
- | #define HAVE_SYS_STAT_H 1
- | #define HAVE_STDLIB_H 1
- | #define HAVE_STRING_H 1
- | #define HAVE_MEMORY_H 1
- | #define HAVE_STRINGS_H 1
- | #define HAVE_INTTYPES_H 1
- | #define HAVE_STDINT_H 1
- | #define HAVE_UNISTD_H 1
- | #define HAVE_DLFCN_H 1
- | #define LT_OBJDIR ".libs/"
- | #define HAVE_PTHREAD_PRIO_INHERIT 1
- | #define HAVE_PTHREAD 1
- | #define HAVE_DECL_STRERROR_R 1
- | #define HAVE_STRERROR_R 1
- | #define HAVE_STDIO_H 1
- | #define HAVE_STDLIB_H 1
- | #define HAVE_UNISTD_H 1
- | #define HAVE_STRINGS_H 1
- | #define HAVE_SYS_TYPES_H 1
- | #define HAVE_SYS_STAT_H 1
- | #define HAVE_SYS_SELECT_H 1
- | /* end confdefs.h. */
- | #include <sys/prctl.h>
- configure:22806: result: no
- configure:22806: checking for sys/prctl.h
- configure:22806: result: no
- configure:22817: checking whether strnlen is declared
- configure:22817: g++ -std=c++11 -c -g -O2 -Wall -Wextra -Wformat -Wvla -Wformat-security -Wno-unused-parameter -Wno-self-assign -Wno-unused-local-typedef -Wno-deprecated-register -Wno-implicit-fallthrough -DHAVE_BUILD_INFO -D__STDC_FORMAT_MACROS -I/usr/local/opt/berkeley-db@4/include -DMAC_OSX conftest.cpp >&5
- configure:22817: $? = 0
- configure:22817: result: yes
- configure:22830: checking whether daemon is declared
- configure:22830: g++ -std=c++11 -c -g -O2 -Wall -Wextra -Wformat -Wvla -Wformat-security -Wno-unused-parameter -Wno-self-assign -Wno-unused-local-typedef -Wno-deprecated-register -Wno-implicit-fallthrough -DHAVE_BUILD_INFO -D__STDC_FORMAT_MACROS -I/usr/local/opt/berkeley-db@4/include -DMAC_OSX conftest.cpp >&5
- conftest.cpp:72:10: warning: 'daemon' is deprecated: first deprecated in macOS 10.5 - Use posix_spawn APIs instead. [-Wdeprecated-declarations]
- (void) daemon;
- ^
- /usr/include/stdlib.h:285:6: note: 'daemon' has been explicitly marked deprecated here
- int daemon(int, int) __DARWIN_1050(daemon) __OSX_AVAILABLE_BUT_DEPRECATED_MSG(__MAC_10_0, __MAC_10_5, __IPHONE_2_0, __IPHONE_2_0, "Use posix_spawn APIs instead.") __WATCHOS_PROHIBITED __TVOS_PROHIBITED;
- ^
- 1 warning generated.
- configure:22830: $? = 0
- configure:22830: result: yes
- configure:22842: checking whether le16toh is declared
- configure:22842: g++ -std=c++11 -c -g -O2 -Wall -Wextra -Wformat -Wvla -Wformat-security -Wno-unused-parameter -Wno-self-assign -Wno-unused-local-typedef -Wno-deprecated-register -Wno-implicit-fallthrough -DHAVE_BUILD_INFO -D__STDC_FORMAT_MACROS -I/usr/local/opt/berkeley-db@4/include -DMAC_OSX conftest.cpp >&5
- conftest.cpp:46:10: error: use of undeclared identifier 'le16toh'
- (void) le16toh;
- ^
- 1 error generated.
- configure:22842: $? = 1
- configure: failed program was:
- | /* confdefs.h */
- | #define PACKAGE_NAME "Bitcoin Core"
- | #define PACKAGE_TARNAME "bitcoin"
- | #define PACKAGE_VERSION "0.14.99"
- | #define PACKAGE_STRING "Bitcoin Core 0.14.99"
- | #define PACKAGE_BUGREPORT "https://github.com/bitcoin/bitcoin/issues"
- | #define PACKAGE_URL "https://bitcoincore.org/"
- | #define HAVE_CXX11 1
- | #define STDC_HEADERS 1
- | #define HAVE_SYS_TYPES_H 1
- | #define HAVE_SYS_STAT_H 1
- | #define HAVE_STDLIB_H 1
- | #define HAVE_STRING_H 1
- | #define HAVE_MEMORY_H 1
- | #define HAVE_STRINGS_H 1
- | #define HAVE_INTTYPES_H 1
- | #define HAVE_STDINT_H 1
- | #define HAVE_UNISTD_H 1
- | #define HAVE_DLFCN_H 1
- | #define LT_OBJDIR ".libs/"
- | #define HAVE_PTHREAD_PRIO_INHERIT 1
- | #define HAVE_PTHREAD 1
- | #define HAVE_DECL_STRERROR_R 1
- | #define HAVE_STRERROR_R 1
- | #define HAVE_STDIO_H 1
- | #define HAVE_STDLIB_H 1
- | #define HAVE_UNISTD_H 1
- | #define HAVE_STRINGS_H 1
- | #define HAVE_SYS_TYPES_H 1
- | #define HAVE_SYS_STAT_H 1
- | #define HAVE_SYS_SELECT_H 1
- | #define HAVE_DECL_STRNLEN 1
- | #define HAVE_DECL_DAEMON 1
- | /* end confdefs.h. */
- | #if HAVE_ENDIAN_H
- | #include <endian.h>
- | #elif HAVE_SYS_ENDIAN_H
- | #include <sys/endian.h>
- | #endif
- |
- | int
- | main ()
- | {
- | #ifndef le16toh
- | #ifdef __cplusplus
- | (void) le16toh;
- | #else
- | (void) le16toh;
- | #endif
- | #endif
- |
- | ;
- | return 0;
- | }
- configure:22842: result: no
- configure:22857: checking whether le32toh is declared
- configure:22857: g++ -std=c++11 -c -g -O2 -Wall -Wextra -Wformat -Wvla -Wformat-security -Wno-unused-parameter -Wno-self-assign -Wno-unused-local-typedef -Wno-deprecated-register -Wno-implicit-fallthrough -DHAVE_BUILD_INFO -D__STDC_FORMAT_MACROS -I/usr/local/opt/berkeley-db@4/include -DMAC_OSX conftest.cpp >&5
- conftest.cpp:47:10: error: use of undeclared identifier 'le32toh'
- (void) le32toh;
- ^
- 1 error generated.
- configure:22857: $? = 1
- configure: failed program was:
- | /* confdefs.h */
- | #define PACKAGE_NAME "Bitcoin Core"
- | #define PACKAGE_TARNAME "bitcoin"
- | #define PACKAGE_VERSION "0.14.99"
- | #define PACKAGE_STRING "Bitcoin Core 0.14.99"
- | #define PACKAGE_BUGREPORT "https://github.com/bitcoin/bitcoin/issues"
- | #define PACKAGE_URL "https://bitcoincore.org/"
- | #define HAVE_CXX11 1
- | #define STDC_HEADERS 1
- | #define HAVE_SYS_TYPES_H 1
- | #define HAVE_SYS_STAT_H 1
- | #define HAVE_STDLIB_H 1
- | #define HAVE_STRING_H 1
- | #define HAVE_MEMORY_H 1
- | #define HAVE_STRINGS_H 1
- | #define HAVE_INTTYPES_H 1
- | #define HAVE_STDINT_H 1
- | #define HAVE_UNISTD_H 1
- | #define HAVE_DLFCN_H 1
- | #define LT_OBJDIR ".libs/"
- | #define HAVE_PTHREAD_PRIO_INHERIT 1
- | #define HAVE_PTHREAD 1
- | #define HAVE_DECL_STRERROR_R 1
- | #define HAVE_STRERROR_R 1
- | #define HAVE_STDIO_H 1
- | #define HAVE_STDLIB_H 1
- | #define HAVE_UNISTD_H 1
- | #define HAVE_STRINGS_H 1
- | #define HAVE_SYS_TYPES_H 1
- | #define HAVE_SYS_STAT_H 1
- | #define HAVE_SYS_SELECT_H 1
- | #define HAVE_DECL_STRNLEN 1
- | #define HAVE_DECL_DAEMON 1
- | #define HAVE_DECL_LE16TOH 0
- | /* end confdefs.h. */
- | #if HAVE_ENDIAN_H
- | #include <endian.h>
- | #elif HAVE_SYS_ENDIAN_H
- | #include <sys/endian.h>
- | #endif
- |
- | int
- | main ()
- | {
- | #ifndef le32toh
- | #ifdef __cplusplus
- | (void) le32toh;
- | #else
- | (void) le32toh;
- | #endif
- | #endif
- |
- | ;
- | return 0;
- | }
- configure:22857: result: no
- configure:22872: checking whether le64toh is declared
- configure:22872: g++ -std=c++11 -c -g -O2 -Wall -Wextra -Wformat -Wvla -Wformat-security -Wno-unused-parameter -Wno-self-assign -Wno-unused-local-typedef -Wno-deprecated-register -Wno-implicit-fallthrough -DHAVE_BUILD_INFO -D__STDC_FORMAT_MACROS -I/usr/local/opt/berkeley-db@4/include -DMAC_OSX conftest.cpp >&5
- conftest.cpp:48:10: error: use of undeclared identifier 'le64toh'
- (void) le64toh;
- ^
- 1 error generated.
- configure:22872: $? = 1
- configure: failed program was:
- | /* confdefs.h */
- | #define PACKAGE_NAME "Bitcoin Core"
- | #define PACKAGE_TARNAME "bitcoin"
- | #define PACKAGE_VERSION "0.14.99"
- | #define PACKAGE_STRING "Bitcoin Core 0.14.99"
- | #define PACKAGE_BUGREPORT "https://github.com/bitcoin/bitcoin/issues"
- | #define PACKAGE_URL "https://bitcoincore.org/"
- | #define HAVE_CXX11 1
- | #define STDC_HEADERS 1
- | #define HAVE_SYS_TYPES_H 1
- | #define HAVE_SYS_STAT_H 1
- | #define HAVE_STDLIB_H 1
- | #define HAVE_STRING_H 1
- | #define HAVE_MEMORY_H 1
- | #define HAVE_STRINGS_H 1
- | #define HAVE_INTTYPES_H 1
- | #define HAVE_STDINT_H 1
- | #define HAVE_UNISTD_H 1
- | #define HAVE_DLFCN_H 1
- | #define LT_OBJDIR ".libs/"
- | #define HAVE_PTHREAD_PRIO_INHERIT 1
- | #define HAVE_PTHREAD 1
- | #define HAVE_DECL_STRERROR_R 1
- | #define HAVE_STRERROR_R 1
- | #define HAVE_STDIO_H 1
- | #define HAVE_STDLIB_H 1
- | #define HAVE_UNISTD_H 1
- | #define HAVE_STRINGS_H 1
- | #define HAVE_SYS_TYPES_H 1
- | #define HAVE_SYS_STAT_H 1
- | #define HAVE_SYS_SELECT_H 1
- | #define HAVE_DECL_STRNLEN 1
- | #define HAVE_DECL_DAEMON 1
- | #define HAVE_DECL_LE16TOH 0
- | #define HAVE_DECL_LE32TOH 0
- | /* end confdefs.h. */
- | #if HAVE_ENDIAN_H
- | #include <endian.h>
- | #elif HAVE_SYS_ENDIAN_H
- | #include <sys/endian.h>
- | #endif
- |
- | int
- | main ()
- | {
- | #ifndef le64toh
- | #ifdef __cplusplus
- | (void) le64toh;
- | #else
- | (void) le64toh;
- | #endif
- | #endif
- |
- | ;
- | return 0;
- | }
- configure:22872: result: no
- configure:22887: checking whether htole16 is declared
- configure:22887: g++ -std=c++11 -c -g -O2 -Wall -Wextra -Wformat -Wvla -Wformat-security -Wno-unused-parameter -Wno-self-assign -Wno-unused-local-typedef -Wno-deprecated-register -Wno-implicit-fallthrough -DHAVE_BUILD_INFO -D__STDC_FORMAT_MACROS -I/usr/local/opt/berkeley-db@4/include -DMAC_OSX conftest.cpp >&5
- conftest.cpp:49:10: error: use of undeclared identifier 'htole16'
- (void) htole16;
- ^
- 1 error generated.
- configure:22887: $? = 1
- configure: failed program was:
- | /* confdefs.h */
- | #define PACKAGE_NAME "Bitcoin Core"
- | #define PACKAGE_TARNAME "bitcoin"
- | #define PACKAGE_VERSION "0.14.99"
- | #define PACKAGE_STRING "Bitcoin Core 0.14.99"
- | #define PACKAGE_BUGREPORT "https://github.com/bitcoin/bitcoin/issues"
- | #define PACKAGE_URL "https://bitcoincore.org/"
- | #define HAVE_CXX11 1
- | #define STDC_HEADERS 1
- | #define HAVE_SYS_TYPES_H 1
- | #define HAVE_SYS_STAT_H 1
- | #define HAVE_STDLIB_H 1
- | #define HAVE_STRING_H 1
- | #define HAVE_MEMORY_H 1
- | #define HAVE_STRINGS_H 1
- | #define HAVE_INTTYPES_H 1
- | #define HAVE_STDINT_H 1
- | #define HAVE_UNISTD_H 1
- | #define HAVE_DLFCN_H 1
- | #define LT_OBJDIR ".libs/"
- | #define HAVE_PTHREAD_PRIO_INHERIT 1
- | #define HAVE_PTHREAD 1
- | #define HAVE_DECL_STRERROR_R 1
- | #define HAVE_STRERROR_R 1
- | #define HAVE_STDIO_H 1
- | #define HAVE_STDLIB_H 1
- | #define HAVE_UNISTD_H 1
- | #define HAVE_STRINGS_H 1
- | #define HAVE_SYS_TYPES_H 1
- | #define HAVE_SYS_STAT_H 1
- | #define HAVE_SYS_SELECT_H 1
- | #define HAVE_DECL_STRNLEN 1
- | #define HAVE_DECL_DAEMON 1
- | #define HAVE_DECL_LE16TOH 0
- | #define HAVE_DECL_LE32TOH 0
- | #define HAVE_DECL_LE64TOH 0
- | /* end confdefs.h. */
- | #if HAVE_ENDIAN_H
- | #include <endian.h>
- | #elif HAVE_SYS_ENDIAN_H
- | #include <sys/endian.h>
- | #endif
- |
- | int
- | main ()
- | {
- | #ifndef htole16
- | #ifdef __cplusplus
- | (void) htole16;
- | #else
- | (void) htole16;
- | #endif
- | #endif
- |
- | ;
- | return 0;
- | }
- configure:22887: result: no
- configure:22902: checking whether htole32 is declared
- configure:22902: g++ -std=c++11 -c -g -O2 -Wall -Wextra -Wformat -Wvla -Wformat-security -Wno-unused-parameter -Wno-self-assign -Wno-unused-local-typedef -Wno-deprecated-register -Wno-implicit-fallthrough -DHAVE_BUILD_INFO -D__STDC_FORMAT_MACROS -I/usr/local/opt/berkeley-db@4/include -DMAC_OSX conftest.cpp >&5
- conftest.cpp:50:10: error: use of undeclared identifier 'htole32'
- (void) htole32;
- ^
- 1 error generated.
- configure:22902: $? = 1
- configure: failed program was:
- | /* confdefs.h */
- | #define PACKAGE_NAME "Bitcoin Core"
- | #define PACKAGE_TARNAME "bitcoin"
- | #define PACKAGE_VERSION "0.14.99"
- | #define PACKAGE_STRING "Bitcoin Core 0.14.99"
- | #define PACKAGE_BUGREPORT "https://github.com/bitcoin/bitcoin/issues"
- | #define PACKAGE_URL "https://bitcoincore.org/"
- | #define HAVE_CXX11 1
- | #define STDC_HEADERS 1
- | #define HAVE_SYS_TYPES_H 1
- | #define HAVE_SYS_STAT_H 1
- | #define HAVE_STDLIB_H 1
- | #define HAVE_STRING_H 1
- | #define HAVE_MEMORY_H 1
- | #define HAVE_STRINGS_H 1
- | #define HAVE_INTTYPES_H 1
- | #define HAVE_STDINT_H 1
- | #define HAVE_UNISTD_H 1
- | #define HAVE_DLFCN_H 1
- | #define LT_OBJDIR ".libs/"
- | #define HAVE_PTHREAD_PRIO_INHERIT 1
- | #define HAVE_PTHREAD 1
- | #define HAVE_DECL_STRERROR_R 1
- | #define HAVE_STRERROR_R 1
- | #define HAVE_STDIO_H 1
- | #define HAVE_STDLIB_H 1
- | #define HAVE_UNISTD_H 1
- | #define HAVE_STRINGS_H 1
- | #define HAVE_SYS_TYPES_H 1
- | #define HAVE_SYS_STAT_H 1
- | #define HAVE_SYS_SELECT_H 1
- | #define HAVE_DECL_STRNLEN 1
- | #define HAVE_DECL_DAEMON 1
- | #define HAVE_DECL_LE16TOH 0
- | #define HAVE_DECL_LE32TOH 0
- | #define HAVE_DECL_LE64TOH 0
- | #define HAVE_DECL_HTOLE16 0
- | /* end confdefs.h. */
- | #if HAVE_ENDIAN_H
- | #include <endian.h>
- | #elif HAVE_SYS_ENDIAN_H
- | #include <sys/endian.h>
- | #endif
- |
- | int
- | main ()
- | {
- | #ifndef htole32
- | #ifdef __cplusplus
- | (void) htole32;
- | #else
- | (void) htole32;
- | #endif
- | #endif
- |
- | ;
- | return 0;
- | }
- configure:22902: result: no
- configure:22917: checking whether htole64 is declared
- configure:22917: g++ -std=c++11 -c -g -O2 -Wall -Wextra -Wformat -Wvla -Wformat-security -Wno-unused-parameter -Wno-self-assign -Wno-unused-local-typedef -Wno-deprecated-register -Wno-implicit-fallthrough -DHAVE_BUILD_INFO -D__STDC_FORMAT_MACROS -I/usr/local/opt/berkeley-db@4/include -DMAC_OSX conftest.cpp >&5
- conftest.cpp:51:10: error: use of undeclared identifier 'htole64'
- (void) htole64;
- ^
- 1 error generated.
- configure:22917: $? = 1
- configure: failed program was:
- | /* confdefs.h */
- | #define PACKAGE_NAME "Bitcoin Core"
- | #define PACKAGE_TARNAME "bitcoin"
- | #define PACKAGE_VERSION "0.14.99"
- | #define PACKAGE_STRING "Bitcoin Core 0.14.99"
- | #define PACKAGE_BUGREPORT "https://github.com/bitcoin/bitcoin/issues"
- | #define PACKAGE_URL "https://bitcoincore.org/"
- | #define HAVE_CXX11 1
- | #define STDC_HEADERS 1
- | #define HAVE_SYS_TYPES_H 1
- | #define HAVE_SYS_STAT_H 1
- | #define HAVE_STDLIB_H 1
- | #define HAVE_STRING_H 1
- | #define HAVE_MEMORY_H 1
- | #define HAVE_STRINGS_H 1
- | #define HAVE_INTTYPES_H 1
- | #define HAVE_STDINT_H 1
- | #define HAVE_UNISTD_H 1
- | #define HAVE_DLFCN_H 1
- | #define LT_OBJDIR ".libs/"
- | #define HAVE_PTHREAD_PRIO_INHERIT 1
- | #define HAVE_PTHREAD 1
- | #define HAVE_DECL_STRERROR_R 1
- | #define HAVE_STRERROR_R 1
- | #define HAVE_STDIO_H 1
- | #define HAVE_STDLIB_H 1
- | #define HAVE_UNISTD_H 1
- | #define HAVE_STRINGS_H 1
- | #define HAVE_SYS_TYPES_H 1
- | #define HAVE_SYS_STAT_H 1
- | #define HAVE_SYS_SELECT_H 1
- | #define HAVE_DECL_STRNLEN 1
- | #define HAVE_DECL_DAEMON 1
- | #define HAVE_DECL_LE16TOH 0
- | #define HAVE_DECL_LE32TOH 0
- | #define HAVE_DECL_LE64TOH 0
- | #define HAVE_DECL_HTOLE16 0
- | #define HAVE_DECL_HTOLE32 0
- | /* end confdefs.h. */
- | #if HAVE_ENDIAN_H
- | #include <endian.h>
- | #elif HAVE_SYS_ENDIAN_H
- | #include <sys/endian.h>
- | #endif
- |
- | int
- | main ()
- | {
- | #ifndef htole64
- | #ifdef __cplusplus
- | (void) htole64;
- | #else
- | (void) htole64;
- | #endif
- | #endif
- |
- | ;
- | return 0;
- | }
- configure:22917: result: no
- configure:22932: checking whether be16toh is declared
- configure:22932: g++ -std=c++11 -c -g -O2 -Wall -Wextra -Wformat -Wvla -Wformat-security -Wno-unused-parameter -Wno-self-assign -Wno-unused-local-typedef -Wno-deprecated-register -Wno-implicit-fallthrough -DHAVE_BUILD_INFO -D__STDC_FORMAT_MACROS -I/usr/local/opt/berkeley-db@4/include -DMAC_OSX conftest.cpp >&5
- conftest.cpp:52:10: error: use of undeclared identifier 'be16toh'
- (void) be16toh;
- ^
- 1 error generated.
- configure:22932: $? = 1
- configure: failed program was:
- | /* confdefs.h */
- | #define PACKAGE_NAME "Bitcoin Core"
- | #define PACKAGE_TARNAME "bitcoin"
- | #define PACKAGE_VERSION "0.14.99"
- | #define PACKAGE_STRING "Bitcoin Core 0.14.99"
- | #define PACKAGE_BUGREPORT "https://github.com/bitcoin/bitcoin/issues"
- | #define PACKAGE_URL "https://bitcoincore.org/"
- | #define HAVE_CXX11 1
- | #define STDC_HEADERS 1
- | #define HAVE_SYS_TYPES_H 1
- | #define HAVE_SYS_STAT_H 1
- | #define HAVE_STDLIB_H 1
- | #define HAVE_STRING_H 1
- | #define HAVE_MEMORY_H 1
- | #define HAVE_STRINGS_H 1
- | #define HAVE_INTTYPES_H 1
- | #define HAVE_STDINT_H 1
- | #define HAVE_UNISTD_H 1
- | #define HAVE_DLFCN_H 1
- | #define LT_OBJDIR ".libs/"
- | #define HAVE_PTHREAD_PRIO_INHERIT 1
- | #define HAVE_PTHREAD 1
- | #define HAVE_DECL_STRERROR_R 1
- | #define HAVE_STRERROR_R 1
- | #define HAVE_STDIO_H 1
- | #define HAVE_STDLIB_H 1
- | #define HAVE_UNISTD_H 1
- | #define HAVE_STRINGS_H 1
- | #define HAVE_SYS_TYPES_H 1
- | #define HAVE_SYS_STAT_H 1
- | #define HAVE_SYS_SELECT_H 1
- | #define HAVE_DECL_STRNLEN 1
- | #define HAVE_DECL_DAEMON 1
- | #define HAVE_DECL_LE16TOH 0
- | #define HAVE_DECL_LE32TOH 0
- | #define HAVE_DECL_LE64TOH 0
- | #define HAVE_DECL_HTOLE16 0
- | #define HAVE_DECL_HTOLE32 0
- | #define HAVE_DECL_HTOLE64 0
- | /* end confdefs.h. */
- | #if HAVE_ENDIAN_H
- | #include <endian.h>
- | #elif HAVE_SYS_ENDIAN_H
- | #include <sys/endian.h>
- | #endif
- |
- | int
- | main ()
- | {
- | #ifndef be16toh
- | #ifdef __cplusplus
- | (void) be16toh;
- | #else
- | (void) be16toh;
- | #endif
- | #endif
- |
- | ;
- | return 0;
- | }
- configure:22932: result: no
- configure:22947: checking whether be32toh is declared
- configure:22947: g++ -std=c++11 -c -g -O2 -Wall -Wextra -Wformat -Wvla -Wformat-security -Wno-unused-parameter -Wno-self-assign -Wno-unused-local-typedef -Wno-deprecated-register -Wno-implicit-fallthrough -DHAVE_BUILD_INFO -D__STDC_FORMAT_MACROS -I/usr/local/opt/berkeley-db@4/include -DMAC_OSX conftest.cpp >&5
- conftest.cpp:53:10: error: use of undeclared identifier 'be32toh'
- (void) be32toh;
- ^
- 1 error generated.
- configure:22947: $? = 1
- configure: failed program was:
- | /* confdefs.h */
- | #define PACKAGE_NAME "Bitcoin Core"
- | #define PACKAGE_TARNAME "bitcoin"
- | #define PACKAGE_VERSION "0.14.99"
- | #define PACKAGE_STRING "Bitcoin Core 0.14.99"
- | #define PACKAGE_BUGREPORT "https://github.com/bitcoin/bitcoin/issues"
- | #define PACKAGE_URL "https://bitcoincore.org/"
- | #define HAVE_CXX11 1
- | #define STDC_HEADERS 1
- | #define HAVE_SYS_TYPES_H 1
- | #define HAVE_SYS_STAT_H 1
- | #define HAVE_STDLIB_H 1
- | #define HAVE_STRING_H 1
- | #define HAVE_MEMORY_H 1
- | #define HAVE_STRINGS_H 1
- | #define HAVE_INTTYPES_H 1
- | #define HAVE_STDINT_H 1
- | #define HAVE_UNISTD_H 1
- | #define HAVE_DLFCN_H 1
- | #define LT_OBJDIR ".libs/"
- | #define HAVE_PTHREAD_PRIO_INHERIT 1
- | #define HAVE_PTHREAD 1
- | #define HAVE_DECL_STRERROR_R 1
- | #define HAVE_STRERROR_R 1
- | #define HAVE_STDIO_H 1
- | #define HAVE_STDLIB_H 1
- | #define HAVE_UNISTD_H 1
- | #define HAVE_STRINGS_H 1
- | #define HAVE_SYS_TYPES_H 1
- | #define HAVE_SYS_STAT_H 1
- | #define HAVE_SYS_SELECT_H 1
- | #define HAVE_DECL_STRNLEN 1
- | #define HAVE_DECL_DAEMON 1
- | #define HAVE_DECL_LE16TOH 0
- | #define HAVE_DECL_LE32TOH 0
- | #define HAVE_DECL_LE64TOH 0
- | #define HAVE_DECL_HTOLE16 0
- | #define HAVE_DECL_HTOLE32 0
- | #define HAVE_DECL_HTOLE64 0
- | #define HAVE_DECL_BE16TOH 0
- | /* end confdefs.h. */
- | #if HAVE_ENDIAN_H
- | #include <endian.h>
- | #elif HAVE_SYS_ENDIAN_H
- | #include <sys/endian.h>
- | #endif
- |
- | int
- | main ()
- | {
- | #ifndef be32toh
- | #ifdef __cplusplus
- | (void) be32toh;
- | #else
- | (void) be32toh;
- | #endif
- | #endif
- |
- | ;
- | return 0;
- | }
- configure:22947: result: no
- configure:22962: checking whether be64toh is declared
- configure:22962: g++ -std=c++11 -c -g -O2 -Wall -Wextra -Wformat -Wvla -Wformat-security -Wno-unused-parameter -Wno-self-assign -Wno-unused-local-typedef -Wno-deprecated-register -Wno-implicit-fallthrough -DHAVE_BUILD_INFO -D__STDC_FORMAT_MACROS -I/usr/local/opt/berkeley-db@4/include -DMAC_OSX conftest.cpp >&5
- conftest.cpp:54:10: error: use of undeclared identifier 'be64toh'
- (void) be64toh;
- ^
- 1 error generated.
- configure:22962: $? = 1
- configure: failed program was:
- | /* confdefs.h */
- | #define PACKAGE_NAME "Bitcoin Core"
- | #define PACKAGE_TARNAME "bitcoin"
- | #define PACKAGE_VERSION "0.14.99"
- | #define PACKAGE_STRING "Bitcoin Core 0.14.99"
- | #define PACKAGE_BUGREPORT "https://github.com/bitcoin/bitcoin/issues"
- | #define PACKAGE_URL "https://bitcoincore.org/"
- | #define HAVE_CXX11 1
- | #define STDC_HEADERS 1
- | #define HAVE_SYS_TYPES_H 1
- | #define HAVE_SYS_STAT_H 1
- | #define HAVE_STDLIB_H 1
- | #define HAVE_STRING_H 1
- | #define HAVE_MEMORY_H 1
- | #define HAVE_STRINGS_H 1
- | #define HAVE_INTTYPES_H 1
- | #define HAVE_STDINT_H 1
- | #define HAVE_UNISTD_H 1
- | #define HAVE_DLFCN_H 1
- | #define LT_OBJDIR ".libs/"
- | #define HAVE_PTHREAD_PRIO_INHERIT 1
- | #define HAVE_PTHREAD 1
- | #define HAVE_DECL_STRERROR_R 1
- | #define HAVE_STRERROR_R 1
- | #define HAVE_STDIO_H 1
- | #define HAVE_STDLIB_H 1
- | #define HAVE_UNISTD_H 1
- | #define HAVE_STRINGS_H 1
- | #define HAVE_SYS_TYPES_H 1
- | #define HAVE_SYS_STAT_H 1
- | #define HAVE_SYS_SELECT_H 1
- | #define HAVE_DECL_STRNLEN 1
- | #define HAVE_DECL_DAEMON 1
- | #define HAVE_DECL_LE16TOH 0
- | #define HAVE_DECL_LE32TOH 0
- | #define HAVE_DECL_LE64TOH 0
- | #define HAVE_DECL_HTOLE16 0
- | #define HAVE_DECL_HTOLE32 0
- | #define HAVE_DECL_HTOLE64 0
- | #define HAVE_DECL_BE16TOH 0
- | #define HAVE_DECL_BE32TOH 0
- | /* end confdefs.h. */
- | #if HAVE_ENDIAN_H
- | #include <endian.h>
- | #elif HAVE_SYS_ENDIAN_H
- | #include <sys/endian.h>
- | #endif
- |
- | int
- | main ()
- | {
- | #ifndef be64toh
- | #ifdef __cplusplus
- | (void) be64toh;
- | #else
- | (void) be64toh;
- | #endif
- | #endif
- |
- | ;
- | return 0;
- | }
- configure:22962: result: no
- configure:22977: checking whether htobe16 is declared
- configure:22977: g++ -std=c++11 -c -g -O2 -Wall -Wextra -Wformat -Wvla -Wformat-security -Wno-unused-parameter -Wno-self-assign -Wno-unused-local-typedef -Wno-deprecated-register -Wno-implicit-fallthrough -DHAVE_BUILD_INFO -D__STDC_FORMAT_MACROS -I/usr/local/opt/berkeley-db@4/include -DMAC_OSX conftest.cpp >&5
- conftest.cpp:55:10: error: use of undeclared identifier 'htobe16'
- (void) htobe16;
- ^
- 1 error generated.
- configure:22977: $? = 1
- configure: failed program was:
- | /* confdefs.h */
- | #define PACKAGE_NAME "Bitcoin Core"
- | #define PACKAGE_TARNAME "bitcoin"
- | #define PACKAGE_VERSION "0.14.99"
- | #define PACKAGE_STRING "Bitcoin Core 0.14.99"
- | #define PACKAGE_BUGREPORT "https://github.com/bitcoin/bitcoin/issues"
- | #define PACKAGE_URL "https://bitcoincore.org/"
- | #define HAVE_CXX11 1
- | #define STDC_HEADERS 1
- | #define HAVE_SYS_TYPES_H 1
- | #define HAVE_SYS_STAT_H 1
- | #define HAVE_STDLIB_H 1
- | #define HAVE_STRING_H 1
- | #define HAVE_MEMORY_H 1
- | #define HAVE_STRINGS_H 1
- | #define HAVE_INTTYPES_H 1
- | #define HAVE_STDINT_H 1
- | #define HAVE_UNISTD_H 1
- | #define HAVE_DLFCN_H 1
- | #define LT_OBJDIR ".libs/"
- | #define HAVE_PTHREAD_PRIO_INHERIT 1
- | #define HAVE_PTHREAD 1
- | #define HAVE_DECL_STRERROR_R 1
- | #define HAVE_STRERROR_R 1
- | #define HAVE_STDIO_H 1
- | #define HAVE_STDLIB_H 1
- | #define HAVE_UNISTD_H 1
- | #define HAVE_STRINGS_H 1
- | #define HAVE_SYS_TYPES_H 1
- | #define HAVE_SYS_STAT_H 1
- | #define HAVE_SYS_SELECT_H 1
- | #define HAVE_DECL_STRNLEN 1
- | #define HAVE_DECL_DAEMON 1
- | #define HAVE_DECL_LE16TOH 0
- | #define HAVE_DECL_LE32TOH 0
- | #define HAVE_DECL_LE64TOH 0
- | #define HAVE_DECL_HTOLE16 0
- | #define HAVE_DECL_HTOLE32 0
- | #define HAVE_DECL_HTOLE64 0
- | #define HAVE_DECL_BE16TOH 0
- | #define HAVE_DECL_BE32TOH 0
- | #define HAVE_DECL_BE64TOH 0
- | /* end confdefs.h. */
- | #if HAVE_ENDIAN_H
- | #include <endian.h>
- | #elif HAVE_SYS_ENDIAN_H
- | #include <sys/endian.h>
- | #endif
- |
- | int
- | main ()
- | {
- | #ifndef htobe16
- | #ifdef __cplusplus
- | (void) htobe16;
- | #else
- | (void) htobe16;
- | #endif
- | #endif
- |
- | ;
- | return 0;
- | }
- configure:22977: result: no
- configure:22992: checking whether htobe32 is declared
- configure:22992: g++ -std=c++11 -c -g -O2 -Wall -Wextra -Wformat -Wvla -Wformat-security -Wno-unused-parameter -Wno-self-assign -Wno-unused-local-typedef -Wno-deprecated-register -Wno-implicit-fallthrough -DHAVE_BUILD_INFO -D__STDC_FORMAT_MACROS -I/usr/local/opt/berkeley-db@4/include -DMAC_OSX conftest.cpp >&5
- conftest.cpp:56:10: error: use of undeclared identifier 'htobe32'
- (void) htobe32;
- ^
- 1 error generated.
- configure:22992: $? = 1
- configure: failed program was:
- | /* confdefs.h */
- | #define PACKAGE_NAME "Bitcoin Core"
- | #define PACKAGE_TARNAME "bitcoin"
- | #define PACKAGE_VERSION "0.14.99"
- | #define PACKAGE_STRING "Bitcoin Core 0.14.99"
- | #define PACKAGE_BUGREPORT "https://github.com/bitcoin/bitcoin/issues"
- | #define PACKAGE_URL "https://bitcoincore.org/"
- | #define HAVE_CXX11 1
- | #define STDC_HEADERS 1
- | #define HAVE_SYS_TYPES_H 1
- | #define HAVE_SYS_STAT_H 1
- | #define HAVE_STDLIB_H 1
- | #define HAVE_STRING_H 1
- | #define HAVE_MEMORY_H 1
- | #define HAVE_STRINGS_H 1
- | #define HAVE_INTTYPES_H 1
- | #define HAVE_STDINT_H 1
- | #define HAVE_UNISTD_H 1
- | #define HAVE_DLFCN_H 1
- | #define LT_OBJDIR ".libs/"
- | #define HAVE_PTHREAD_PRIO_INHERIT 1
- | #define HAVE_PTHREAD 1
- | #define HAVE_DECL_STRERROR_R 1
- | #define HAVE_STRERROR_R 1
- | #define HAVE_STDIO_H 1
- | #define HAVE_STDLIB_H 1
- | #define HAVE_UNISTD_H 1
- | #define HAVE_STRINGS_H 1
- | #define HAVE_SYS_TYPES_H 1
- | #define HAVE_SYS_STAT_H 1
- | #define HAVE_SYS_SELECT_H 1
- | #define HAVE_DECL_STRNLEN 1
- | #define HAVE_DECL_DAEMON 1
- | #define HAVE_DECL_LE16TOH 0
- | #define HAVE_DECL_LE32TOH 0
- | #define HAVE_DECL_LE64TOH 0
- | #define HAVE_DECL_HTOLE16 0
- | #define HAVE_DECL_HTOLE32 0
- | #define HAVE_DECL_HTOLE64 0
- | #define HAVE_DECL_BE16TOH 0
- | #define HAVE_DECL_BE32TOH 0
- | #define HAVE_DECL_BE64TOH 0
- | #define HAVE_DECL_HTOBE16 0
- | /* end confdefs.h. */
- | #if HAVE_ENDIAN_H
- | #include <endian.h>
- | #elif HAVE_SYS_ENDIAN_H
- | #include <sys/endian.h>
- | #endif
- |
- | int
- | main ()
- | {
- | #ifndef htobe32
- | #ifdef __cplusplus
- | (void) htobe32;
- | #else
- | (void) htobe32;
- | #endif
- | #endif
- |
- | ;
- | return 0;
- | }
- configure:22992: result: no
- configure:23007: checking whether htobe64 is declared
- configure:23007: g++ -std=c++11 -c -g -O2 -Wall -Wextra -Wformat -Wvla -Wformat-security -Wno-unused-parameter -Wno-self-assign -Wno-unused-local-typedef -Wno-deprecated-register -Wno-implicit-fallthrough -DHAVE_BUILD_INFO -D__STDC_FORMAT_MACROS -I/usr/local/opt/berkeley-db@4/include -DMAC_OSX conftest.cpp >&5
- conftest.cpp:57:10: error: use of undeclared identifier 'htobe64'
- (void) htobe64;
- ^
- 1 error generated.
- configure:23007: $? = 1
- configure: failed program was:
- | /* confdefs.h */
- | #define PACKAGE_NAME "Bitcoin Core"
- | #define PACKAGE_TARNAME "bitcoin"
- | #define PACKAGE_VERSION "0.14.99"
- | #define PACKAGE_STRING "Bitcoin Core 0.14.99"
- | #define PACKAGE_BUGREPORT "https://github.com/bitcoin/bitcoin/issues"
- | #define PACKAGE_URL "https://bitcoincore.org/"
- | #define HAVE_CXX11 1
- | #define STDC_HEADERS 1
- | #define HAVE_SYS_TYPES_H 1
- | #define HAVE_SYS_STAT_H 1
- | #define HAVE_STDLIB_H 1
- | #define HAVE_STRING_H 1
- | #define HAVE_MEMORY_H 1
- | #define HAVE_STRINGS_H 1
- | #define HAVE_INTTYPES_H 1
- | #define HAVE_STDINT_H 1
- | #define HAVE_UNISTD_H 1
- | #define HAVE_DLFCN_H 1
- | #define LT_OBJDIR ".libs/"
- | #define HAVE_PTHREAD_PRIO_INHERIT 1
- | #define HAVE_PTHREAD 1
- | #define HAVE_DECL_STRERROR_R 1
- | #define HAVE_STRERROR_R 1
- | #define HAVE_STDIO_H 1
- | #define HAVE_STDLIB_H 1
- | #define HAVE_UNISTD_H 1
- | #define HAVE_STRINGS_H 1
- | #define HAVE_SYS_TYPES_H 1
- | #define HAVE_SYS_STAT_H 1
- | #define HAVE_SYS_SELECT_H 1
- | #define HAVE_DECL_STRNLEN 1
- | #define HAVE_DECL_DAEMON 1
- | #define HAVE_DECL_LE16TOH 0
- | #define HAVE_DECL_LE32TOH 0
- | #define HAVE_DECL_LE64TOH 0
- | #define HAVE_DECL_HTOLE16 0
- | #define HAVE_DECL_HTOLE32 0
- | #define HAVE_DECL_HTOLE64 0
- | #define HAVE_DECL_BE16TOH 0
- | #define HAVE_DECL_BE32TOH 0
- | #define HAVE_DECL_BE64TOH 0
- | #define HAVE_DECL_HTOBE16 0
- | #define HAVE_DECL_HTOBE32 0
- | /* end confdefs.h. */
- | #if HAVE_ENDIAN_H
- | #include <endian.h>
- | #elif HAVE_SYS_ENDIAN_H
- | #include <sys/endian.h>
- | #endif
- |
- | int
- | main ()
- | {
- | #ifndef htobe64
- | #ifdef __cplusplus
- | (void) htobe64;
- | #else
- | (void) htobe64;
- | #endif
- | #endif
- |
- | ;
- | return 0;
- | }
- configure:23007: result: no
- configure:23024: checking whether bswap_16 is declared
- configure:23024: g++ -std=c++11 -c -g -O2 -Wall -Wextra -Wformat -Wvla -Wformat-security -Wno-unused-parameter -Wno-self-assign -Wno-unused-local-typedef -Wno-deprecated-register -Wno-implicit-fallthrough -DHAVE_BUILD_INFO -D__STDC_FORMAT_MACROS -I/usr/local/opt/berkeley-db@4/include -DMAC_OSX conftest.cpp >&5
- conftest.cpp:56:10: error: use of undeclared identifier 'bswap_16'
- (void) bswap_16;
- ^
- 1 error generated.
- configure:23024: $? = 1
- configure: failed program was:
- | /* confdefs.h */
- | #define PACKAGE_NAME "Bitcoin Core"
- | #define PACKAGE_TARNAME "bitcoin"
- | #define PACKAGE_VERSION "0.14.99"
- | #define PACKAGE_STRING "Bitcoin Core 0.14.99"
- | #define PACKAGE_BUGREPORT "https://github.com/bitcoin/bitcoin/issues"
- | #define PACKAGE_URL "https://bitcoincore.org/"
- | #define HAVE_CXX11 1
- | #define STDC_HEADERS 1
- | #define HAVE_SYS_TYPES_H 1
- | #define HAVE_SYS_STAT_H 1
- | #define HAVE_STDLIB_H 1
- | #define HAVE_STRING_H 1
- | #define HAVE_MEMORY_H 1
- | #define HAVE_STRINGS_H 1
- | #define HAVE_INTTYPES_H 1
- | #define HAVE_STDINT_H 1
- | #define HAVE_UNISTD_H 1
- | #define HAVE_DLFCN_H 1
- | #define LT_OBJDIR ".libs/"
- | #define HAVE_PTHREAD_PRIO_INHERIT 1
- | #define HAVE_PTHREAD 1
- | #define HAVE_DECL_STRERROR_R 1
- | #define HAVE_STRERROR_R 1
- | #define HAVE_STDIO_H 1
- | #define HAVE_STDLIB_H 1
- | #define HAVE_UNISTD_H 1
- | #define HAVE_STRINGS_H 1
- | #define HAVE_SYS_TYPES_H 1
- | #define HAVE_SYS_STAT_H 1
- | #define HAVE_SYS_SELECT_H 1
- | #define HAVE_DECL_STRNLEN 1
- | #define HAVE_DECL_DAEMON 1
- | #define HAVE_DECL_LE16TOH 0
- | #define HAVE_DECL_LE32TOH 0
- | #define HAVE_DECL_LE64TOH 0
- | #define HAVE_DECL_HTOLE16 0
- | #define HAVE_DECL_HTOLE32 0
- | #define HAVE_DECL_HTOLE64 0
- | #define HAVE_DECL_BE16TOH 0
- | #define HAVE_DECL_BE32TOH 0
- | #define HAVE_DECL_BE64TOH 0
- | #define HAVE_DECL_HTOBE16 0
- | #define HAVE_DECL_HTOBE32 0
- | #define HAVE_DECL_HTOBE64 0
- | /* end confdefs.h. */
- | #if HAVE_BYTESWAP_H
- | #include <byteswap.h>
- | #endif
- |
- | int
- | main ()
- | {
- | #ifndef bswap_16
- | #ifdef __cplusplus
- | (void) bswap_16;
- | #else
- | (void) bswap_16;
- | #endif
- | #endif
- |
- | ;
- | return 0;
- | }
- configure:23024: result: no
- configure:23037: checking whether bswap_32 is declared
- configure:23037: g++ -std=c++11 -c -g -O2 -Wall -Wextra -Wformat -Wvla -Wformat-security -Wno-unused-parameter -Wno-self-assign -Wno-unused-local-typedef -Wno-deprecated-register -Wno-implicit-fallthrough -DHAVE_BUILD_INFO -D__STDC_FORMAT_MACROS -I/usr/local/opt/berkeley-db@4/include -DMAC_OSX conftest.cpp >&5
- conftest.cpp:57:10: error: use of undeclared identifier 'bswap_32'
- (void) bswap_32;
- ^
- 1 error generated.
- configure:23037: $? = 1
- configure: failed program was:
- | /* confdefs.h */
- | #define PACKAGE_NAME "Bitcoin Core"
- | #define PACKAGE_TARNAME "bitcoin"
- | #define PACKAGE_VERSION "0.14.99"
- | #define PACKAGE_STRING "Bitcoin Core 0.14.99"
- | #define PACKAGE_BUGREPORT "https://github.com/bitcoin/bitcoin/issues"
- | #define PACKAGE_URL "https://bitcoincore.org/"
- | #define HAVE_CXX11 1
- | #define STDC_HEADERS 1
- | #define HAVE_SYS_TYPES_H 1
- | #define HAVE_SYS_STAT_H 1
- | #define HAVE_STDLIB_H 1
- | #define HAVE_STRING_H 1
- | #define HAVE_MEMORY_H 1
- | #define HAVE_STRINGS_H 1
- | #define HAVE_INTTYPES_H 1
- | #define HAVE_STDINT_H 1
- | #define HAVE_UNISTD_H 1
- | #define HAVE_DLFCN_H 1
- | #define LT_OBJDIR ".libs/"
- | #define HAVE_PTHREAD_PRIO_INHERIT 1
- | #define HAVE_PTHREAD 1
- | #define HAVE_DECL_STRERROR_R 1
- | #define HAVE_STRERROR_R 1
- | #define HAVE_STDIO_H 1
- | #define HAVE_STDLIB_H 1
- | #define HAVE_UNISTD_H 1
- | #define HAVE_STRINGS_H 1
- | #define HAVE_SYS_TYPES_H 1
- | #define HAVE_SYS_STAT_H 1
- | #define HAVE_SYS_SELECT_H 1
- | #define HAVE_DECL_STRNLEN 1
- | #define HAVE_DECL_DAEMON 1
- | #define HAVE_DECL_LE16TOH 0
- | #define HAVE_DECL_LE32TOH 0
- | #define HAVE_DECL_LE64TOH 0
- | #define HAVE_DECL_HTOLE16 0
- | #define HAVE_DECL_HTOLE32 0
- | #define HAVE_DECL_HTOLE64 0
- | #define HAVE_DECL_BE16TOH 0
- | #define HAVE_DECL_BE32TOH 0
- | #define HAVE_DECL_BE64TOH 0
- | #define HAVE_DECL_HTOBE16 0
- | #define HAVE_DECL_HTOBE32 0
- | #define HAVE_DECL_HTOBE64 0
- | #define HAVE_DECL_BSWAP_16 0
- | /* end confdefs.h. */
- | #if HAVE_BYTESWAP_H
- | #include <byteswap.h>
- | #endif
- |
- | int
- | main ()
- | {
- | #ifndef bswap_32
- | #ifdef __cplusplus
- | (void) bswap_32;
- | #else
- | (void) bswap_32;
- | #endif
- | #endif
- |
- | ;
- | return 0;
- | }
- configure:23037: result: no
- configure:23050: checking whether bswap_64 is declared
- configure:23050: g++ -std=c++11 -c -g -O2 -Wall -Wextra -Wformat -Wvla -Wformat-security -Wno-unused-parameter -Wno-self-assign -Wno-unused-local-typedef -Wno-deprecated-register -Wno-implicit-fallthrough -DHAVE_BUILD_INFO -D__STDC_FORMAT_MACROS -I/usr/local/opt/berkeley-db@4/include -DMAC_OSX conftest.cpp >&5
- conftest.cpp:58:10: error: use of undeclared identifier 'bswap_64'
- (void) bswap_64;
- ^
- 1 error generated.
- configure:23050: $? = 1
- configure: failed program was:
- | /* confdefs.h */
- | #define PACKAGE_NAME "Bitcoin Core"
- | #define PACKAGE_TARNAME "bitcoin"
- | #define PACKAGE_VERSION "0.14.99"
- | #define PACKAGE_STRING "Bitcoin Core 0.14.99"
- | #define PACKAGE_BUGREPORT "https://github.com/bitcoin/bitcoin/issues"
- | #define PACKAGE_URL "https://bitcoincore.org/"
- | #define HAVE_CXX11 1
- | #define STDC_HEADERS 1
- | #define HAVE_SYS_TYPES_H 1
- | #define HAVE_SYS_STAT_H 1
- | #define HAVE_STDLIB_H 1
- | #define HAVE_STRING_H 1
- | #define HAVE_MEMORY_H 1
- | #define HAVE_STRINGS_H 1
- | #define HAVE_INTTYPES_H 1
- | #define HAVE_STDINT_H 1
- | #define HAVE_UNISTD_H 1
- | #define HAVE_DLFCN_H 1
- | #define LT_OBJDIR ".libs/"
- | #define HAVE_PTHREAD_PRIO_INHERIT 1
- | #define HAVE_PTHREAD 1
- | #define HAVE_DECL_STRERROR_R 1
- | #define HAVE_STRERROR_R 1
- | #define HAVE_STDIO_H 1
- | #define HAVE_STDLIB_H 1
- | #define HAVE_UNISTD_H 1
- | #define HAVE_STRINGS_H 1
- | #define HAVE_SYS_TYPES_H 1
- | #define HAVE_SYS_STAT_H 1
- | #define HAVE_SYS_SELECT_H 1
- | #define HAVE_DECL_STRNLEN 1
- | #define HAVE_DECL_DAEMON 1
- | #define HAVE_DECL_LE16TOH 0
- | #define HAVE_DECL_LE32TOH 0
- | #define HAVE_DECL_LE64TOH 0
- | #define HAVE_DECL_HTOLE16 0
- | #define HAVE_DECL_HTOLE32 0
- | #define HAVE_DECL_HTOLE64 0
- | #define HAVE_DECL_BE16TOH 0
- | #define HAVE_DECL_BE32TOH 0
- | #define HAVE_DECL_BE64TOH 0
- | #define HAVE_DECL_HTOBE16 0
- | #define HAVE_DECL_HTOBE32 0
- | #define HAVE_DECL_HTOBE64 0
- | #define HAVE_DECL_BSWAP_16 0
- | #define HAVE_DECL_BSWAP_32 0
- | /* end confdefs.h. */
- | #if HAVE_BYTESWAP_H
- | #include <byteswap.h>
- | #endif
- |
- | int
- | main ()
- | {
- | #ifndef bswap_64
- | #ifdef __cplusplus
- | (void) bswap_64;
- | #else
- | (void) bswap_64;
- | #endif
- | #endif
- |
- | ;
- | return 0;
- | }
- configure:23050: result: no
- configure:23065: checking whether __builtin_clz is declared
- configure:23065: g++ -std=c++11 -c -g -O2 -Wall -Wextra -Wformat -Wvla -Wformat-security -Wno-unused-parameter -Wno-self-assign -Wno-unused-local-typedef -Wno-deprecated-register -Wno-implicit-fallthrough -DHAVE_BUILD_INFO -D__STDC_FORMAT_MACROS -I/usr/local/opt/berkeley-db@4/include -DMAC_OSX conftest.cpp >&5
- conftest.cpp:88:10: error: builtin functions must be directly called
- (void) __builtin_clz;
- ^
- 1 error generated.
- configure:23065: $? = 1
- configure: failed program was:
- | /* confdefs.h */
- | #define PACKAGE_NAME "Bitcoin Core"
- | #define PACKAGE_TARNAME "bitcoin"
- | #define PACKAGE_VERSION "0.14.99"
- | #define PACKAGE_STRING "Bitcoin Core 0.14.99"
- | #define PACKAGE_BUGREPORT "https://github.com/bitcoin/bitcoin/issues"
- | #define PACKAGE_URL "https://bitcoincore.org/"
- | #define HAVE_CXX11 1
- | #define STDC_HEADERS 1
- | #define HAVE_SYS_TYPES_H 1
- | #define HAVE_SYS_STAT_H 1
- | #define HAVE_STDLIB_H 1
- | #define HAVE_STRING_H 1
- | #define HAVE_MEMORY_H 1
- | #define HAVE_STRINGS_H 1
- | #define HAVE_INTTYPES_H 1
- | #define HAVE_STDINT_H 1
- | #define HAVE_UNISTD_H 1
- | #define HAVE_DLFCN_H 1
- | #define LT_OBJDIR ".libs/"
- | #define HAVE_PTHREAD_PRIO_INHERIT 1
- | #define HAVE_PTHREAD 1
- | #define HAVE_DECL_STRERROR_R 1
- | #define HAVE_STRERROR_R 1
- | #define HAVE_STDIO_H 1
- | #define HAVE_STDLIB_H 1
- | #define HAVE_UNISTD_H 1
- | #define HAVE_STRINGS_H 1
- | #define HAVE_SYS_TYPES_H 1
- | #define HAVE_SYS_STAT_H 1
- | #define HAVE_SYS_SELECT_H 1
- | #define HAVE_DECL_STRNLEN 1
- | #define HAVE_DECL_DAEMON 1
- | #define HAVE_DECL_LE16TOH 0
- | #define HAVE_DECL_LE32TOH 0
- | #define HAVE_DECL_LE64TOH 0
- | #define HAVE_DECL_HTOLE16 0
- | #define HAVE_DECL_HTOLE32 0
- | #define HAVE_DECL_HTOLE64 0
- | #define HAVE_DECL_BE16TOH 0
- | #define HAVE_DECL_BE32TOH 0
- | #define HAVE_DECL_BE64TOH 0
- | #define HAVE_DECL_HTOBE16 0
- | #define HAVE_DECL_HTOBE32 0
- | #define HAVE_DECL_HTOBE64 0
- | #define HAVE_DECL_BSWAP_16 0
- | #define HAVE_DECL_BSWAP_32 0
- | #define HAVE_DECL_BSWAP_64 0
- | /* end confdefs.h. */
- | #include <stdio.h>
- | #ifdef HAVE_SYS_TYPES_H
- | # include <sys/types.h>
- | #endif
- | #ifdef HAVE_SYS_STAT_H
- | # include <sys/stat.h>
- | #endif
- | #ifdef STDC_HEADERS
- | # include <stdlib.h>
- | # include <stddef.h>
- | #else
- | # ifdef HAVE_STDLIB_H
- | # include <stdlib.h>
- | # endif
- | #endif
- | #ifdef HAVE_STRING_H
- | # if !defined STDC_HEADERS && defined HAVE_MEMORY_H
- | # include <memory.h>
- | # endif
- | # include <string.h>
- | #endif
- | #ifdef HAVE_STRINGS_H
- | # include <strings.h>
- | #endif
- | #ifdef HAVE_INTTYPES_H
- | # include <inttypes.h>
- | #endif
- | #ifdef HAVE_STDINT_H
- | # include <stdint.h>
- | #endif
- | #ifdef HAVE_UNISTD_H
- | # include <unistd.h>
- | #endif
- | int
- | main ()
- | {
- | #ifndef __builtin_clz
- | #ifdef __cplusplus
- | (void) __builtin_clz;
- | #else
- | (void) __builtin_clz;
- | #endif
- | #endif
- |
- | ;
- | return 0;
- | }
- configure:23065: result: no
- configure:23075: checking whether __builtin_clzl is declared
- configure:23075: g++ -std=c++11 -c -g -O2 -Wall -Wextra -Wformat -Wvla -Wformat-security -Wno-unused-parameter -Wno-self-assign -Wno-unused-local-typedef -Wno-deprecated-register -Wno-implicit-fallthrough -DHAVE_BUILD_INFO -D__STDC_FORMAT_MACROS -I/usr/local/opt/berkeley-db@4/include -DMAC_OSX conftest.cpp >&5
- conftest.cpp:89:10: error: builtin functions must be directly called
- (void) __builtin_clzl;
- ^
- 1 error generated.
- configure:23075: $? = 1
- configure: failed program was:
- | /* confdefs.h */
- | #define PACKAGE_NAME "Bitcoin Core"
- | #define PACKAGE_TARNAME "bitcoin"
- | #define PACKAGE_VERSION "0.14.99"
- | #define PACKAGE_STRING "Bitcoin Core 0.14.99"
- | #define PACKAGE_BUGREPORT "https://github.com/bitcoin/bitcoin/issues"
- | #define PACKAGE_URL "https://bitcoincore.org/"
- | #define HAVE_CXX11 1
- | #define STDC_HEADERS 1
- | #define HAVE_SYS_TYPES_H 1
- | #define HAVE_SYS_STAT_H 1
- | #define HAVE_STDLIB_H 1
- | #define HAVE_STRING_H 1
- | #define HAVE_MEMORY_H 1
- | #define HAVE_STRINGS_H 1
- | #define HAVE_INTTYPES_H 1
- | #define HAVE_STDINT_H 1
- | #define HAVE_UNISTD_H 1
- | #define HAVE_DLFCN_H 1
- | #define LT_OBJDIR ".libs/"
- | #define HAVE_PTHREAD_PRIO_INHERIT 1
- | #define HAVE_PTHREAD 1
- | #define HAVE_DECL_STRERROR_R 1
- | #define HAVE_STRERROR_R 1
- | #define HAVE_STDIO_H 1
- | #define HAVE_STDLIB_H 1
- | #define HAVE_UNISTD_H 1
- | #define HAVE_STRINGS_H 1
- | #define HAVE_SYS_TYPES_H 1
- | #define HAVE_SYS_STAT_H 1
- | #define HAVE_SYS_SELECT_H 1
- | #define HAVE_DECL_STRNLEN 1
- | #define HAVE_DECL_DAEMON 1
- | #define HAVE_DECL_LE16TOH 0
- | #define HAVE_DECL_LE32TOH 0
- | #define HAVE_DECL_LE64TOH 0
- | #define HAVE_DECL_HTOLE16 0
- | #define HAVE_DECL_HTOLE32 0
- | #define HAVE_DECL_HTOLE64 0
- | #define HAVE_DECL_BE16TOH 0
- | #define HAVE_DECL_BE32TOH 0
- | #define HAVE_DECL_BE64TOH 0
- | #define HAVE_DECL_HTOBE16 0
- | #define HAVE_DECL_HTOBE32 0
- | #define HAVE_DECL_HTOBE64 0
- | #define HAVE_DECL_BSWAP_16 0
- | #define HAVE_DECL_BSWAP_32 0
- | #define HAVE_DECL_BSWAP_64 0
- | #define HAVE_DECL___BUILTIN_CLZ 0
- | /* end confdefs.h. */
- | #include <stdio.h>
- | #ifdef HAVE_SYS_TYPES_H
- | # include <sys/types.h>
- | #endif
- | #ifdef HAVE_SYS_STAT_H
- | # include <sys/stat.h>
- | #endif
- | #ifdef STDC_HEADERS
- | # include <stdlib.h>
- | # include <stddef.h>
- | #else
- | # ifdef HAVE_STDLIB_H
- | # include <stdlib.h>
- | # endif
- | #endif
- | #ifdef HAVE_STRING_H
- | # if !defined STDC_HEADERS && defined HAVE_MEMORY_H
- | # include <memory.h>
- | # endif
- | # include <string.h>
- | #endif
- | #ifdef HAVE_STRINGS_H
- | # include <strings.h>
- | #endif
- | #ifdef HAVE_INTTYPES_H
- | # include <inttypes.h>
- | #endif
- | #ifdef HAVE_STDINT_H
- | # include <stdint.h>
- | #endif
- | #ifdef HAVE_UNISTD_H
- | # include <unistd.h>
- | #endif
- | int
- | main ()
- | {
- | #ifndef __builtin_clzl
- | #ifdef __cplusplus
- | (void) __builtin_clzl;
- | #else
- | (void) __builtin_clzl;
- | #endif
- | #endif
- |
- | ;
- | return 0;
- | }
- configure:23075: result: no
- configure:23085: checking whether __builtin_clzll is declared
- configure:23085: g++ -std=c++11 -c -g -O2 -Wall -Wextra -Wformat -Wvla -Wformat-security -Wno-unused-parameter -Wno-self-assign -Wno-unused-local-typedef -Wno-deprecated-register -Wno-implicit-fallthrough -DHAVE_BUILD_INFO -D__STDC_FORMAT_MACROS -I/usr/local/opt/berkeley-db@4/include -DMAC_OSX conftest.cpp >&5
- conftest.cpp:90:10: error: builtin functions must be directly called
- (void) __builtin_clzll;
- ^
- 1 error generated.
- configure:23085: $? = 1
- configure: failed program was:
- | /* confdefs.h */
- | #define PACKAGE_NAME "Bitcoin Core"
- | #define PACKAGE_TARNAME "bitcoin"
- | #define PACKAGE_VERSION "0.14.99"
- | #define PACKAGE_STRING "Bitcoin Core 0.14.99"
- | #define PACKAGE_BUGREPORT "https://github.com/bitcoin/bitcoin/issues"
- | #define PACKAGE_URL "https://bitcoincore.org/"
- | #define HAVE_CXX11 1
- | #define STDC_HEADERS 1
- | #define HAVE_SYS_TYPES_H 1
- | #define HAVE_SYS_STAT_H 1
- | #define HAVE_STDLIB_H 1
- | #define HAVE_STRING_H 1
- | #define HAVE_MEMORY_H 1
- | #define HAVE_STRINGS_H 1
- | #define HAVE_INTTYPES_H 1
- | #define HAVE_STDINT_H 1
- | #define HAVE_UNISTD_H 1
- | #define HAVE_DLFCN_H 1
- | #define LT_OBJDIR ".libs/"
- | #define HAVE_PTHREAD_PRIO_INHERIT 1
- | #define HAVE_PTHREAD 1
- | #define HAVE_DECL_STRERROR_R 1
- | #define HAVE_STRERROR_R 1
- | #define HAVE_STDIO_H 1
- | #define HAVE_STDLIB_H 1
- | #define HAVE_UNISTD_H 1
- | #define HAVE_STRINGS_H 1
- | #define HAVE_SYS_TYPES_H 1
- | #define HAVE_SYS_STAT_H 1
- | #define HAVE_SYS_SELECT_H 1
- | #define HAVE_DECL_STRNLEN 1
- | #define HAVE_DECL_DAEMON 1
- | #define HAVE_DECL_LE16TOH 0
- | #define HAVE_DECL_LE32TOH 0
- | #define HAVE_DECL_LE64TOH 0
- | #define HAVE_DECL_HTOLE16 0
- | #define HAVE_DECL_HTOLE32 0
- | #define HAVE_DECL_HTOLE64 0
- | #define HAVE_DECL_BE16TOH 0
- | #define HAVE_DECL_BE32TOH 0
- | #define HAVE_DECL_BE64TOH 0
- | #define HAVE_DECL_HTOBE16 0
- | #define HAVE_DECL_HTOBE32 0
- | #define HAVE_DECL_HTOBE64 0
- | #define HAVE_DECL_BSWAP_16 0
- | #define HAVE_DECL_BSWAP_32 0
- | #define HAVE_DECL_BSWAP_64 0
- | #define HAVE_DECL___BUILTIN_CLZ 0
- | #define HAVE_DECL___BUILTIN_CLZL 0
- | /* end confdefs.h. */
- | #include <stdio.h>
- | #ifdef HAVE_SYS_TYPES_H
- | # include <sys/types.h>
- | #endif
- | #ifdef HAVE_SYS_STAT_H
- | # include <sys/stat.h>
- | #endif
- | #ifdef STDC_HEADERS
- | # include <stdlib.h>
- | # include <stddef.h>
- | #else
- | # ifdef HAVE_STDLIB_H
- | # include <stdlib.h>
- | # endif
- | #endif
- | #ifdef HAVE_STRING_H
- | # if !defined STDC_HEADERS && defined HAVE_MEMORY_H
- | # include <memory.h>
- | # endif
- | # include <string.h>
- | #endif
- | #ifdef HAVE_STRINGS_H
- | # include <strings.h>
- | #endif
- | #ifdef HAVE_INTTYPES_H
- | # include <inttypes.h>
- | #endif
- | #ifdef HAVE_STDINT_H
- | # include <stdint.h>
- | #endif
- | #ifdef HAVE_UNISTD_H
- | # include <unistd.h>
- | #endif
- | int
- | main ()
- | {
- | #ifndef __builtin_clzll
- | #ifdef __cplusplus
- | (void) __builtin_clzll;
- | #else
- | (void) __builtin_clzll;
- | #endif
- | #endif
- |
- | ;
- | return 0;
- | }
- configure:23085: result: no
- configure:23097: checking for MSG_NOSIGNAL
- configure:23110: g++ -std=c++11 -c -g -O2 -Wall -Wextra -Wformat -Wvla -Wformat-security -Wno-unused-parameter -Wno-self-assign -Wno-unused-local-typedef -Wno-deprecated-register -Wno-implicit-fallthrough -DHAVE_BUILD_INFO -D__STDC_FORMAT_MACROS -I/usr/local/opt/berkeley-db@4/include -DMAC_OSX conftest.cpp >&5
- conftest.cpp:57:10: error: use of undeclared identifier 'MSG_NOSIGNAL'
- int f = MSG_NOSIGNAL;
- ^
- 1 error generated.
- configure:23110: $? = 1
- configure: failed program was:
- | /* confdefs.h */
- | #define PACKAGE_NAME "Bitcoin Core"
- | #define PACKAGE_TARNAME "bitcoin"
- | #define PACKAGE_VERSION "0.14.99"
- | #define PACKAGE_STRING "Bitcoin Core 0.14.99"
- | #define PACKAGE_BUGREPORT "https://github.com/bitcoin/bitcoin/issues"
- | #define PACKAGE_URL "https://bitcoincore.org/"
- | #define HAVE_CXX11 1
- | #define STDC_HEADERS 1
- | #define HAVE_SYS_TYPES_H 1
- | #define HAVE_SYS_STAT_H 1
- | #define HAVE_STDLIB_H 1
- | #define HAVE_STRING_H 1
- | #define HAVE_MEMORY_H 1
- | #define HAVE_STRINGS_H 1
- | #define HAVE_INTTYPES_H 1
- | #define HAVE_STDINT_H 1
- | #define HAVE_UNISTD_H 1
- | #define HAVE_DLFCN_H 1
- | #define LT_OBJDIR ".libs/"
- | #define HAVE_PTHREAD_PRIO_INHERIT 1
- | #define HAVE_PTHREAD 1
- | #define HAVE_DECL_STRERROR_R 1
- | #define HAVE_STRERROR_R 1
- | #define HAVE_STDIO_H 1
- | #define HAVE_STDLIB_H 1
- | #define HAVE_UNISTD_H 1
- | #define HAVE_STRINGS_H 1
- | #define HAVE_SYS_TYPES_H 1
- | #define HAVE_SYS_STAT_H 1
- | #define HAVE_SYS_SELECT_H 1
- | #define HAVE_DECL_STRNLEN 1
- | #define HAVE_DECL_DAEMON 1
- | #define HAVE_DECL_LE16TOH 0
- | #define HAVE_DECL_LE32TOH 0
- | #define HAVE_DECL_LE64TOH 0
- | #define HAVE_DECL_HTOLE16 0
- | #define HAVE_DECL_HTOLE32 0
- | #define HAVE_DECL_HTOLE64 0
- | #define HAVE_DECL_BE16TOH 0
- | #define HAVE_DECL_BE32TOH 0
- | #define HAVE_DECL_BE64TOH 0
- | #define HAVE_DECL_HTOBE16 0
- | #define HAVE_DECL_HTOBE32 0
- | #define HAVE_DECL_HTOBE64 0
- | #define HAVE_DECL_BSWAP_16 0
- | #define HAVE_DECL_BSWAP_32 0
- | #define HAVE_DECL_BSWAP_64 0
- | #define HAVE_DECL___BUILTIN_CLZ 0
- | #define HAVE_DECL___BUILTIN_CLZL 0
- | #define HAVE_DECL___BUILTIN_CLZLL 0
- | /* end confdefs.h. */
- | #include <sys/socket.h>
- | int
- | main ()
- | {
- | int f = MSG_NOSIGNAL;
- | ;
- | return 0;
- | }
- configure:23116: result: no
- configure:23122: checking for MSG_DONTWAIT
- configure:23135: g++ -std=c++11 -c -g -O2 -Wall -Wextra -Wformat -Wvla -Wformat-security -Wno-unused-parameter -Wno-self-assign -Wno-unused-local-typedef -Wno-deprecated-register -Wno-implicit-fallthrough -DHAVE_BUILD_INFO -D__STDC_FORMAT_MACROS -I/usr/local/opt/berkeley-db@4/include -DMAC_OSX conftest.cpp >&5
- conftest.cpp:57:6: warning: unused variable 'f' [-Wunused-variable]
- int f = MSG_DONTWAIT;
- ^
- 1 warning generated.
- configure:23135: $? = 0
- configure:23136: result: yes
- configure:23147: checking for getmemoryinfo
- configure:23160: g++ -std=c++11 -c -g -O2 -Wall -Wextra -Wformat -Wvla -Wformat-security -Wno-unused-parameter -Wno-self-assign -Wno-unused-local-typedef -Wno-deprecated-register -Wno-implicit-fallthrough -DHAVE_BUILD_INFO -D__STDC_FORMAT_MACROS -I/usr/local/opt/berkeley-db@4/include -DMAC_OSX conftest.cpp >&5
- conftest.cpp:54:10: fatal error: 'malloc.h' file not found
- #include <malloc.h>
- ^
- 1 error generated.
- configure:23160: $? = 1
- configure: failed program was:
- | /* confdefs.h */
- | #define PACKAGE_NAME "Bitcoin Core"
- | #define PACKAGE_TARNAME "bitcoin"
- | #define PACKAGE_VERSION "0.14.99"
- | #define PACKAGE_STRING "Bitcoin Core 0.14.99"
- | #define PACKAGE_BUGREPORT "https://github.com/bitcoin/bitcoin/issues"
- | #define PACKAGE_URL "https://bitcoincore.org/"
- | #define HAVE_CXX11 1
- | #define STDC_HEADERS 1
- | #define HAVE_SYS_TYPES_H 1
- | #define HAVE_SYS_STAT_H 1
- | #define HAVE_STDLIB_H 1
- | #define HAVE_STRING_H 1
- | #define HAVE_MEMORY_H 1
- | #define HAVE_STRINGS_H 1
- | #define HAVE_INTTYPES_H 1
- | #define HAVE_STDINT_H 1
- | #define HAVE_UNISTD_H 1
- | #define HAVE_DLFCN_H 1
- | #define LT_OBJDIR ".libs/"
- | #define HAVE_PTHREAD_PRIO_INHERIT 1
- | #define HAVE_PTHREAD 1
- | #define HAVE_DECL_STRERROR_R 1
- | #define HAVE_STRERROR_R 1
- | #define HAVE_STDIO_H 1
- | #define HAVE_STDLIB_H 1
- | #define HAVE_UNISTD_H 1
- | #define HAVE_STRINGS_H 1
- | #define HAVE_SYS_TYPES_H 1
- | #define HAVE_SYS_STAT_H 1
- | #define HAVE_SYS_SELECT_H 1
- | #define HAVE_DECL_STRNLEN 1
- | #define HAVE_DECL_DAEMON 1
- | #define HAVE_DECL_LE16TOH 0
- | #define HAVE_DECL_LE32TOH 0
- | #define HAVE_DECL_LE64TOH 0
- | #define HAVE_DECL_HTOLE16 0
- | #define HAVE_DECL_HTOLE32 0
- | #define HAVE_DECL_HTOLE64 0
- | #define HAVE_DECL_BE16TOH 0
- | #define HAVE_DECL_BE32TOH 0
- | #define HAVE_DECL_BE64TOH 0
- | #define HAVE_DECL_HTOBE16 0
- | #define HAVE_DECL_HTOBE32 0
- | #define HAVE_DECL_HTOBE64 0
- | #define HAVE_DECL_BSWAP_16 0
- | #define HAVE_DECL_BSWAP_32 0
- | #define HAVE_DECL_BSWAP_64 0
- | #define HAVE_DECL___BUILTIN_CLZ 0
- | #define HAVE_DECL___BUILTIN_CLZL 0
- | #define HAVE_DECL___BUILTIN_CLZLL 0
- | #define HAVE_MSG_DONTWAIT 1
- | /* end confdefs.h. */
- | #include <malloc.h>
- | int
- | main ()
- | {
- | int f = malloc_info(0, NULL);
- | ;
- | return 0;
- | }
- configure:23166: result: no
- configure:23172: checking for mallopt M_ARENA_MAX
- configure:23185: g++ -std=c++11 -c -g -O2 -Wall -Wextra -Wformat -Wvla -Wformat-security -Wno-unused-parameter -Wno-self-assign -Wno-unused-local-typedef -Wno-deprecated-register -Wno-implicit-fallthrough -DHAVE_BUILD_INFO -D__STDC_FORMAT_MACROS -I/usr/local/opt/berkeley-db@4/include -DMAC_OSX conftest.cpp >&5
- conftest.cpp:54:10: fatal error: 'malloc.h' file not found
- #include <malloc.h>
- ^
- 1 error generated.
- configure:23185: $? = 1
- configure: failed program was:
- | /* confdefs.h */
- | #define PACKAGE_NAME "Bitcoin Core"
- | #define PACKAGE_TARNAME "bitcoin"
- | #define PACKAGE_VERSION "0.14.99"
- | #define PACKAGE_STRING "Bitcoin Core 0.14.99"
- | #define PACKAGE_BUGREPORT "https://github.com/bitcoin/bitcoin/issues"
- | #define PACKAGE_URL "https://bitcoincore.org/"
- | #define HAVE_CXX11 1
- | #define STDC_HEADERS 1
- | #define HAVE_SYS_TYPES_H 1
- | #define HAVE_SYS_STAT_H 1
- | #define HAVE_STDLIB_H 1
- | #define HAVE_STRING_H 1
- | #define HAVE_MEMORY_H 1
- | #define HAVE_STRINGS_H 1
- | #define HAVE_INTTYPES_H 1
- | #define HAVE_STDINT_H 1
- | #define HAVE_UNISTD_H 1
- | #define HAVE_DLFCN_H 1
- | #define LT_OBJDIR ".libs/"
- | #define HAVE_PTHREAD_PRIO_INHERIT 1
- | #define HAVE_PTHREAD 1
- | #define HAVE_DECL_STRERROR_R 1
- | #define HAVE_STRERROR_R 1
- | #define HAVE_STDIO_H 1
- | #define HAVE_STDLIB_H 1
- | #define HAVE_UNISTD_H 1
- | #define HAVE_STRINGS_H 1
- | #define HAVE_SYS_TYPES_H 1
- | #define HAVE_SYS_STAT_H 1
- | #define HAVE_SYS_SELECT_H 1
- | #define HAVE_DECL_STRNLEN 1
- | #define HAVE_DECL_DAEMON 1
- | #define HAVE_DECL_LE16TOH 0
- | #define HAVE_DECL_LE32TOH 0
- | #define HAVE_DECL_LE64TOH 0
- | #define HAVE_DECL_HTOLE16 0
- | #define HAVE_DECL_HTOLE32 0
- | #define HAVE_DECL_HTOLE64 0
- | #define HAVE_DECL_BE16TOH 0
- | #define HAVE_DECL_BE32TOH 0
- | #define HAVE_DECL_BE64TOH 0
- | #define HAVE_DECL_HTOBE16 0
- | #define HAVE_DECL_HTOBE32 0
- | #define HAVE_DECL_HTOBE64 0
- | #define HAVE_DECL_BSWAP_16 0
- | #define HAVE_DECL_BSWAP_32 0
- | #define HAVE_DECL_BSWAP_64 0
- | #define HAVE_DECL___BUILTIN_CLZ 0
- | #define HAVE_DECL___BUILTIN_CLZL 0
- | #define HAVE_DECL___BUILTIN_CLZLL 0
- | #define HAVE_MSG_DONTWAIT 1
- | /* end confdefs.h. */
- | #include <malloc.h>
- | int
- | main ()
- | {
- | mallopt(M_ARENA_MAX, 1);
- | ;
- | return 0;
- | }
- configure:23191: result: no
- configure:23197: checking for visibility attribute
- configure:23206: g++ -std=c++11 -o conftest -g -O2 -Wall -Wextra -Wformat -Wvla -Wformat-security -Wno-unused-parameter -Wno-self-assign -Wno-unused-local-typedef -Wno-deprecated-register -Wno-implicit-fallthrough -DHAVE_BUILD_INFO -D__STDC_FORMAT_MACROS -I/usr/local/opt/berkeley-db@4/include -DMAC_OSX -Wl,-headerpad_max_install_names -Wl,-dead_strip conftest.cpp -L/usr/local/opt/berkeley-db@4/lib >&5
- configure:23206: $? = 0
- configure:23211: result: yes
- configure:23228: checking for Linux getrandom syscall
- configure:23243: g++ -std=c++11 -c -g -O2 -Wall -Wextra -Wformat -Wvla -Wformat-security -Wno-unused-parameter -Wno-self-assign -Wno-unused-local-typedef -Wno-deprecated-register -Wno-implicit-fallthrough -DHAVE_BUILD_INFO -D__STDC_FORMAT_MACROS -I/usr/local/opt/berkeley-db@4/include -DMAC_OSX conftest.cpp >&5
- conftest.cpp:57:12: fatal error: 'linux/random.h' file not found
- #include <linux/random.h>
- ^
- 1 error generated.
- configure:23243: $? = 1
- configure: failed program was:
- | /* confdefs.h */
- | #define PACKAGE_NAME "Bitcoin Core"
- | #define PACKAGE_TARNAME "bitcoin"
- | #define PACKAGE_VERSION "0.14.99"
- | #define PACKAGE_STRING "Bitcoin Core 0.14.99"
- | #define PACKAGE_BUGREPORT "https://github.com/bitcoin/bitcoin/issues"
- | #define PACKAGE_URL "https://bitcoincore.org/"
- | #define HAVE_CXX11 1
- | #define STDC_HEADERS 1
- | #define HAVE_SYS_TYPES_H 1
- | #define HAVE_SYS_STAT_H 1
- | #define HAVE_STDLIB_H 1
- | #define HAVE_STRING_H 1
- | #define HAVE_MEMORY_H 1
- | #define HAVE_STRINGS_H 1
- | #define HAVE_INTTYPES_H 1
- | #define HAVE_STDINT_H 1
- | #define HAVE_UNISTD_H 1
- | #define HAVE_DLFCN_H 1
- | #define LT_OBJDIR ".libs/"
- | #define HAVE_PTHREAD_PRIO_INHERIT 1
- | #define HAVE_PTHREAD 1
- | #define HAVE_DECL_STRERROR_R 1
- | #define HAVE_STRERROR_R 1
- | #define HAVE_STDIO_H 1
- | #define HAVE_STDLIB_H 1
- | #define HAVE_UNISTD_H 1
- | #define HAVE_STRINGS_H 1
- | #define HAVE_SYS_TYPES_H 1
- | #define HAVE_SYS_STAT_H 1
- | #define HAVE_SYS_SELECT_H 1
- | #define HAVE_DECL_STRNLEN 1
- | #define HAVE_DECL_DAEMON 1
- | #define HAVE_DECL_LE16TOH 0
- | #define HAVE_DECL_LE32TOH 0
- | #define HAVE_DECL_LE64TOH 0
- | #define HAVE_DECL_HTOLE16 0
- | #define HAVE_DECL_HTOLE32 0
- | #define HAVE_DECL_HTOLE64 0
- | #define HAVE_DECL_BE16TOH 0
- | #define HAVE_DECL_BE32TOH 0
- | #define HAVE_DECL_BE64TOH 0
- | #define HAVE_DECL_HTOBE16 0
- | #define HAVE_DECL_HTOBE32 0
- | #define HAVE_DECL_HTOBE64 0
- | #define HAVE_DECL_BSWAP_16 0
- | #define HAVE_DECL_BSWAP_32 0
- | #define HAVE_DECL_BSWAP_64 0
- | #define HAVE_DECL___BUILTIN_CLZ 0
- | #define HAVE_DECL___BUILTIN_CLZL 0
- | #define HAVE_DECL___BUILTIN_CLZLL 0
- | #define HAVE_MSG_DONTWAIT 1
- | #define HAVE_VISIBILITY_ATTRIBUTE 1
- | /* end confdefs.h. */
- | #include <unistd.h>
- | #include <sys/syscall.h>
- | #include <linux/random.h>
- | int
- | main ()
- | {
- | syscall(SYS_getrandom, nullptr, 32, 0);
- | ;
- | return 0;
- | }
- configure:23249: result: no
- configure:23255: checking for getentropy
- configure:23268: g++ -std=c++11 -c -g -O2 -Wall -Wextra -Wformat -Wvla -Wformat-security -Wno-unused-parameter -Wno-self-assign -Wno-unused-local-typedef -Wno-deprecated-register -Wno-implicit-fallthrough -DHAVE_BUILD_INFO -D__STDC_FORMAT_MACROS -I/usr/local/opt/berkeley-db@4/include -DMAC_OSX conftest.cpp >&5
- conftest.cpp:59:2: error: use of undeclared identifier 'getentropy'
- getentropy(nullptr, 32)
- ^
- 1 error generated.
- configure:23268: $? = 1
- configure: failed program was:
- | /* confdefs.h */
- | #define PACKAGE_NAME "Bitcoin Core"
- | #define PACKAGE_TARNAME "bitcoin"
- | #define PACKAGE_VERSION "0.14.99"
- | #define PACKAGE_STRING "Bitcoin Core 0.14.99"
- | #define PACKAGE_BUGREPORT "https://github.com/bitcoin/bitcoin/issues"
- | #define PACKAGE_URL "https://bitcoincore.org/"
- | #define HAVE_CXX11 1
- | #define STDC_HEADERS 1
- | #define HAVE_SYS_TYPES_H 1
- | #define HAVE_SYS_STAT_H 1
- | #define HAVE_STDLIB_H 1
- | #define HAVE_STRING_H 1
- | #define HAVE_MEMORY_H 1
- | #define HAVE_STRINGS_H 1
- | #define HAVE_INTTYPES_H 1
- | #define HAVE_STDINT_H 1
- | #define HAVE_UNISTD_H 1
- | #define HAVE_DLFCN_H 1
- | #define LT_OBJDIR ".libs/"
- | #define HAVE_PTHREAD_PRIO_INHERIT 1
- | #define HAVE_PTHREAD 1
- | #define HAVE_DECL_STRERROR_R 1
- | #define HAVE_STRERROR_R 1
- | #define HAVE_STDIO_H 1
- | #define HAVE_STDLIB_H 1
- | #define HAVE_UNISTD_H 1
- | #define HAVE_STRINGS_H 1
- | #define HAVE_SYS_TYPES_H 1
- | #define HAVE_SYS_STAT_H 1
- | #define HAVE_SYS_SELECT_H 1
- | #define HAVE_DECL_STRNLEN 1
- | #define HAVE_DECL_DAEMON 1
- | #define HAVE_DECL_LE16TOH 0
- | #define HAVE_DECL_LE32TOH 0
- | #define HAVE_DECL_LE64TOH 0
- | #define HAVE_DECL_HTOLE16 0
- | #define HAVE_DECL_HTOLE32 0
- | #define HAVE_DECL_HTOLE64 0
- | #define HAVE_DECL_BE16TOH 0
- | #define HAVE_DECL_BE32TOH 0
- | #define HAVE_DECL_BE64TOH 0
- | #define HAVE_DECL_HTOBE16 0
- | #define HAVE_DECL_HTOBE32 0
- | #define HAVE_DECL_HTOBE64 0
- | #define HAVE_DECL_BSWAP_16 0
- | #define HAVE_DECL_BSWAP_32 0
- | #define HAVE_DECL_BSWAP_64 0
- | #define HAVE_DECL___BUILTIN_CLZ 0
- | #define HAVE_DECL___BUILTIN_CLZL 0
- | #define HAVE_DECL___BUILTIN_CLZLL 0
- | #define HAVE_MSG_DONTWAIT 1
- | #define HAVE_VISIBILITY_ATTRIBUTE 1
- | /* end confdefs.h. */
- | #include <unistd.h>
- | int
- | main ()
- | {
- | getentropy(nullptr, 32)
- | ;
- | return 0;
- | }
- configure:23274: result: no
- configure:23280: checking for sysctl KERN_ARND
- configure:23295: g++ -std=c++11 -c -g -O2 -Wall -Wextra -Wformat -Wvla -Wformat-security -Wno-unused-parameter -Wno-self-assign -Wno-unused-local-typedef -Wno-deprecated-register -Wno-implicit-fallthrough -DHAVE_BUILD_INFO -D__STDC_FORMAT_MACROS -I/usr/local/opt/berkeley-db@4/include -DMAC_OSX conftest.cpp >&5
- conftest.cpp:60:40: error: use of undeclared identifier 'KERN_ARND'
- static const int name[2] = {CTL_KERN, KERN_ARND};
- ^
- conftest.cpp:61:5: error: no matching function for call to 'sysctl'
- sysctl(name, 2, nullptr, nullptr, nullptr, 0);
- ^~~~~~
- /usr/include/sys/sysctl.h:759:5: note: candidate function not viable: no known conversion from 'const int [2]' to 'int *' for 1st argument
- int sysctl(int *, u_int, void *, size_t *, void *, size_t);
- ^
- 2 errors generated.
- configure:23295: $? = 1
- configure: failed program was:
- | /* confdefs.h */
- | #define PACKAGE_NAME "Bitcoin Core"
- | #define PACKAGE_TARNAME "bitcoin"
- | #define PACKAGE_VERSION "0.14.99"
- | #define PACKAGE_STRING "Bitcoin Core 0.14.99"
- | #define PACKAGE_BUGREPORT "https://github.com/bitcoin/bitcoin/issues"
- | #define PACKAGE_URL "https://bitcoincore.org/"
- | #define HAVE_CXX11 1
- | #define STDC_HEADERS 1
- | #define HAVE_SYS_TYPES_H 1
- | #define HAVE_SYS_STAT_H 1
- | #define HAVE_STDLIB_H 1
- | #define HAVE_STRING_H 1
- | #define HAVE_MEMORY_H 1
- | #define HAVE_STRINGS_H 1
- | #define HAVE_INTTYPES_H 1
- | #define HAVE_STDINT_H 1
- | #define HAVE_UNISTD_H 1
- | #define HAVE_DLFCN_H 1
- | #define LT_OBJDIR ".libs/"
- | #define HAVE_PTHREAD_PRIO_INHERIT 1
- | #define HAVE_PTHREAD 1
- | #define HAVE_DECL_STRERROR_R 1
- | #define HAVE_STRERROR_R 1
- | #define HAVE_STDIO_H 1
- | #define HAVE_STDLIB_H 1
- | #define HAVE_UNISTD_H 1
- | #define HAVE_STRINGS_H 1
- | #define HAVE_SYS_TYPES_H 1
- | #define HAVE_SYS_STAT_H 1
- | #define HAVE_SYS_SELECT_H 1
- | #define HAVE_DECL_STRNLEN 1
- | #define HAVE_DECL_DAEMON 1
- | #define HAVE_DECL_LE16TOH 0
- | #define HAVE_DECL_LE32TOH 0
- | #define HAVE_DECL_LE64TOH 0
- | #define HAVE_DECL_HTOLE16 0
- | #define HAVE_DECL_HTOLE32 0
- | #define HAVE_DECL_HTOLE64 0
- | #define HAVE_DECL_BE16TOH 0
- | #define HAVE_DECL_BE32TOH 0
- | #define HAVE_DECL_BE64TOH 0
- | #define HAVE_DECL_HTOBE16 0
- | #define HAVE_DECL_HTOBE32 0
- | #define HAVE_DECL_HTOBE64 0
- | #define HAVE_DECL_BSWAP_16 0
- | #define HAVE_DECL_BSWAP_32 0
- | #define HAVE_DECL_BSWAP_64 0
- | #define HAVE_DECL___BUILTIN_CLZ 0
- | #define HAVE_DECL___BUILTIN_CLZL 0
- | #define HAVE_DECL___BUILTIN_CLZLL 0
- | #define HAVE_MSG_DONTWAIT 1
- | #define HAVE_VISIBILITY_ATTRIBUTE 1
- | /* end confdefs.h. */
- | #include <sys/types.h>
- | #include <sys/sysctl.h>
- | int
- | main ()
- | {
- | static const int name[2] = {CTL_KERN, KERN_ARND};
- | sysctl(name, 2, nullptr, nullptr, nullptr, 0);
- | ;
- | return 0;
- | }
- configure:23301: result: no
- configure:23367: checking for Berkeley DB C++ headers
- configure:23397: g++ -std=c++11 -c -g -O2 -Wall -Wextra -Wformat -Wvla -Wformat-security -Wno-unused-parameter -Wno-self-assign -Wno-unused-local-typedef -Wno-deprecated-register -Wno-implicit-fallthrough -DHAVE_BUILD_INFO -D__STDC_FORMAT_MACROS -I/usr/local/opt/berkeley-db@4/include -DMAC_OSX conftest.cpp >&5
- conftest.cpp:56:18: fatal error: 'bdb4.8/db_cxx.h' file not found
- #include <bdb4.8/db_cxx.h>
- ^
- 1 error generated.
- configure:23397: $? = 1
- configure: failed program was:
- | /* confdefs.h */
- | #define PACKAGE_NAME "Bitcoin Core"
- | #define PACKAGE_TARNAME "bitcoin"
- | #define PACKAGE_VERSION "0.14.99"
- | #define PACKAGE_STRING "Bitcoin Core 0.14.99"
- | #define PACKAGE_BUGREPORT "https://github.com/bitcoin/bitcoin/issues"
- | #define PACKAGE_URL "https://bitcoincore.org/"
- | #define HAVE_CXX11 1
- | #define STDC_HEADERS 1
- | #define HAVE_SYS_TYPES_H 1
- | #define HAVE_SYS_STAT_H 1
- | #define HAVE_STDLIB_H 1
- | #define HAVE_STRING_H 1
- | #define HAVE_MEMORY_H 1
- | #define HAVE_STRINGS_H 1
- | #define HAVE_INTTYPES_H 1
- | #define HAVE_STDINT_H 1
- | #define HAVE_UNISTD_H 1
- | #define HAVE_DLFCN_H 1
- | #define LT_OBJDIR ".libs/"
- | #define HAVE_PTHREAD_PRIO_INHERIT 1
- | #define HAVE_PTHREAD 1
- | #define HAVE_DECL_STRERROR_R 1
- | #define HAVE_STRERROR_R 1
- | #define HAVE_STDIO_H 1
- | #define HAVE_STDLIB_H 1
- | #define HAVE_UNISTD_H 1
- | #define HAVE_STRINGS_H 1
- | #define HAVE_SYS_TYPES_H 1
- | #define HAVE_SYS_STAT_H 1
- | #define HAVE_SYS_SELECT_H 1
- | #define HAVE_DECL_STRNLEN 1
- | #define HAVE_DECL_DAEMON 1
- | #define HAVE_DECL_LE16TOH 0
- | #define HAVE_DECL_LE32TOH 0
- | #define HAVE_DECL_LE64TOH 0
- | #define HAVE_DECL_HTOLE16 0
- | #define HAVE_DECL_HTOLE32 0
- | #define HAVE_DECL_HTOLE64 0
- | #define HAVE_DECL_BE16TOH 0
- | #define HAVE_DECL_BE32TOH 0
- | #define HAVE_DECL_BE64TOH 0
- | #define HAVE_DECL_HTOBE16 0
- | #define HAVE_DECL_HTOBE32 0
- | #define HAVE_DECL_HTOBE64 0
- | #define HAVE_DECL_BSWAP_16 0
- | #define HAVE_DECL_BSWAP_32 0
- | #define HAVE_DECL_BSWAP_64 0
- | #define HAVE_DECL___BUILTIN_CLZ 0
- | #define HAVE_DECL___BUILTIN_CLZL 0
- | #define HAVE_DECL___BUILTIN_CLZLL 0
- | #define HAVE_MSG_DONTWAIT 1
- | #define HAVE_VISIBILITY_ATTRIBUTE 1
- | /* end confdefs.h. */
- |
- | #include <bdb4.8/db_cxx.h>
- |
- | int
- | main ()
- | {
- |
- | #if !((DB_VERSION_MAJOR == 4 && DB_VERSION_MINOR >= 8) || DB_VERSION_MAJOR > 4)
- | #error "failed to find bdb 4.8+"
- | #endif
- |
- | ;
- | return 0;
- | }
- configure:23397: g++ -std=c++11 -c -g -O2 -Wall -Wextra -Wformat -Wvla -Wformat-security -Wno-unused-parameter -Wno-self-assign -Wno-unused-local-typedef -Wno-deprecated-register -Wno-implicit-fallthrough -DHAVE_BUILD_INFO -D__STDC_FORMAT_MACROS -I/usr/local/opt/berkeley-db@4/include -DMAC_OSX conftest.cpp >&5
- conftest.cpp:56:18: fatal error: 'libdb4.8/db_cxx.h' file not found
- #include <libdb4.8/db_cxx.h>
- ^
- 1 error generated.
- configure:23397: $? = 1
- configure: failed program was:
- | /* confdefs.h */
- | #define PACKAGE_NAME "Bitcoin Core"
- | #define PACKAGE_TARNAME "bitcoin"
- | #define PACKAGE_VERSION "0.14.99"
- | #define PACKAGE_STRING "Bitcoin Core 0.14.99"
- | #define PACKAGE_BUGREPORT "https://github.com/bitcoin/bitcoin/issues"
- | #define PACKAGE_URL "https://bitcoincore.org/"
- | #define HAVE_CXX11 1
- | #define STDC_HEADERS 1
- | #define HAVE_SYS_TYPES_H 1
- | #define HAVE_SYS_STAT_H 1
- | #define HAVE_STDLIB_H 1
- | #define HAVE_STRING_H 1
- | #define HAVE_MEMORY_H 1
- | #define HAVE_STRINGS_H 1
- | #define HAVE_INTTYPES_H 1
- | #define HAVE_STDINT_H 1
- | #define HAVE_UNISTD_H 1
- | #define HAVE_DLFCN_H 1
- | #define LT_OBJDIR ".libs/"
- | #define HAVE_PTHREAD_PRIO_INHERIT 1
- | #define HAVE_PTHREAD 1
- | #define HAVE_DECL_STRERROR_R 1
- | #define HAVE_STRERROR_R 1
- | #define HAVE_STDIO_H 1
- | #define HAVE_STDLIB_H 1
- | #define HAVE_UNISTD_H 1
- | #define HAVE_STRINGS_H 1
- | #define HAVE_SYS_TYPES_H 1
- | #define HAVE_SYS_STAT_H 1
- | #define HAVE_SYS_SELECT_H 1
- | #define HAVE_DECL_STRNLEN 1
- | #define HAVE_DECL_DAEMON 1
- | #define HAVE_DECL_LE16TOH 0
- | #define HAVE_DECL_LE32TOH 0
- | #define HAVE_DECL_LE64TOH 0
- | #define HAVE_DECL_HTOLE16 0
- | #define HAVE_DECL_HTOLE32 0
- | #define HAVE_DECL_HTOLE64 0
- | #define HAVE_DECL_BE16TOH 0
- | #define HAVE_DECL_BE32TOH 0
- | #define HAVE_DECL_BE64TOH 0
- | #define HAVE_DECL_HTOBE16 0
- | #define HAVE_DECL_HTOBE32 0
- | #define HAVE_DECL_HTOBE64 0
- | #define HAVE_DECL_BSWAP_16 0
- | #define HAVE_DECL_BSWAP_32 0
- | #define HAVE_DECL_BSWAP_64 0
- | #define HAVE_DECL___BUILTIN_CLZ 0
- | #define HAVE_DECL___BUILTIN_CLZL 0
- | #define HAVE_DECL___BUILTIN_CLZLL 0
- | #define HAVE_MSG_DONTWAIT 1
- | #define HAVE_VISIBILITY_ATTRIBUTE 1
- | /* end confdefs.h. */
- |
- | #include <libdb4.8/db_cxx.h>
- |
- | int
- | main ()
- | {
- |
- | #if !((DB_VERSION_MAJOR == 4 && DB_VERSION_MINOR >= 8) || DB_VERSION_MAJOR > 4)
- | #error "failed to find bdb 4.8+"
- | #endif
- |
- | ;
- | return 0;
- | }
- configure:23397: g++ -std=c++11 -c -g -O2 -Wall -Wextra -Wformat -Wvla -Wformat-security -Wno-unused-parameter -Wno-self-assign -Wno-unused-local-typedef -Wno-deprecated-register -Wno-implicit-fallthrough -DHAVE_BUILD_INFO -D__STDC_FORMAT_MACROS -I/usr/local/opt/berkeley-db@4/include -DMAC_OSX conftest.cpp >&5
- conftest.cpp:56:18: fatal error: 'db4.8/db_cxx.h' file not found
- #include <db4.8/db_cxx.h>
- ^
- 1 error generated.
- configure:23397: $? = 1
- configure: failed program was:
- | /* confdefs.h */
- | #define PACKAGE_NAME "Bitcoin Core"
- | #define PACKAGE_TARNAME "bitcoin"
- | #define PACKAGE_VERSION "0.14.99"
- | #define PACKAGE_STRING "Bitcoin Core 0.14.99"
- | #define PACKAGE_BUGREPORT "https://github.com/bitcoin/bitcoin/issues"
- | #define PACKAGE_URL "https://bitcoincore.org/"
- | #define HAVE_CXX11 1
- | #define STDC_HEADERS 1
- | #define HAVE_SYS_TYPES_H 1
- | #define HAVE_SYS_STAT_H 1
- | #define HAVE_STDLIB_H 1
- | #define HAVE_STRING_H 1
- | #define HAVE_MEMORY_H 1
- | #define HAVE_STRINGS_H 1
- | #define HAVE_INTTYPES_H 1
- | #define HAVE_STDINT_H 1
- | #define HAVE_UNISTD_H 1
- | #define HAVE_DLFCN_H 1
- | #define LT_OBJDIR ".libs/"
- | #define HAVE_PTHREAD_PRIO_INHERIT 1
- | #define HAVE_PTHREAD 1
- | #define HAVE_DECL_STRERROR_R 1
- | #define HAVE_STRERROR_R 1
- | #define HAVE_STDIO_H 1
- | #define HAVE_STDLIB_H 1
- | #define HAVE_UNISTD_H 1
- | #define HAVE_STRINGS_H 1
- | #define HAVE_SYS_TYPES_H 1
- | #define HAVE_SYS_STAT_H 1
- | #define HAVE_SYS_SELECT_H 1
- | #define HAVE_DECL_STRNLEN 1
- | #define HAVE_DECL_DAEMON 1
- | #define HAVE_DECL_LE16TOH 0
- | #define HAVE_DECL_LE32TOH 0
- | #define HAVE_DECL_LE64TOH 0
- | #define HAVE_DECL_HTOLE16 0
- | #define HAVE_DECL_HTOLE32 0
- | #define HAVE_DECL_HTOLE64 0
- | #define HAVE_DECL_BE16TOH 0
- | #define HAVE_DECL_BE32TOH 0
- | #define HAVE_DECL_BE64TOH 0
- | #define HAVE_DECL_HTOBE16 0
- | #define HAVE_DECL_HTOBE32 0
- | #define HAVE_DECL_HTOBE64 0
- | #define HAVE_DECL_BSWAP_16 0
- | #define HAVE_DECL_BSWAP_32 0
- | #define HAVE_DECL_BSWAP_64 0
- | #define HAVE_DECL___BUILTIN_CLZ 0
- | #define HAVE_DECL___BUILTIN_CLZL 0
- | #define HAVE_DECL___BUILTIN_CLZLL 0
- | #define HAVE_MSG_DONTWAIT 1
- | #define HAVE_VISIBILITY_ATTRIBUTE 1
- | /* end confdefs.h. */
- |
- | #include <db4.8/db_cxx.h>
- |
- | int
- | main ()
- | {
- |
- | #if !((DB_VERSION_MAJOR == 4 && DB_VERSION_MINOR >= 8) || DB_VERSION_MAJOR > 4)
- | #error "failed to find bdb 4.8+"
- | #endif
- |
- | ;
- | return 0;
- | }
- configure:23397: g++ -std=c++11 -c -g -O2 -Wall -Wextra -Wformat -Wvla -Wformat-security -Wno-unused-parameter -Wno-self-assign -Wno-unused-local-typedef -Wno-deprecated-register -Wno-implicit-fallthrough -DHAVE_BUILD_INFO -D__STDC_FORMAT_MACROS -I/usr/local/opt/berkeley-db@4/include -DMAC_OSX conftest.cpp >&5
- conftest.cpp:56:18: fatal error: 'bdb48/db_cxx.h' file not found
- #include <bdb48/db_cxx.h>
- ^
- 1 error generated.
- configure:23397: $? = 1
- configure: failed program was:
- | /* confdefs.h */
- | #define PACKAGE_NAME "Bitcoin Core"
- | #define PACKAGE_TARNAME "bitcoin"
- | #define PACKAGE_VERSION "0.14.99"
- | #define PACKAGE_STRING "Bitcoin Core 0.14.99"
- | #define PACKAGE_BUGREPORT "https://github.com/bitcoin/bitcoin/issues"
- | #define PACKAGE_URL "https://bitcoincore.org/"
- | #define HAVE_CXX11 1
- | #define STDC_HEADERS 1
- | #define HAVE_SYS_TYPES_H 1
- | #define HAVE_SYS_STAT_H 1
- | #define HAVE_STDLIB_H 1
- | #define HAVE_STRING_H 1
- | #define HAVE_MEMORY_H 1
- | #define HAVE_STRINGS_H 1
- | #define HAVE_INTTYPES_H 1
- | #define HAVE_STDINT_H 1
- | #define HAVE_UNISTD_H 1
- | #define HAVE_DLFCN_H 1
- | #define LT_OBJDIR ".libs/"
- | #define HAVE_PTHREAD_PRIO_INHERIT 1
- | #define HAVE_PTHREAD 1
- | #define HAVE_DECL_STRERROR_R 1
- | #define HAVE_STRERROR_R 1
- | #define HAVE_STDIO_H 1
- | #define HAVE_STDLIB_H 1
- | #define HAVE_UNISTD_H 1
- | #define HAVE_STRINGS_H 1
- | #define HAVE_SYS_TYPES_H 1
- | #define HAVE_SYS_STAT_H 1
- | #define HAVE_SYS_SELECT_H 1
- | #define HAVE_DECL_STRNLEN 1
- | #define HAVE_DECL_DAEMON 1
- | #define HAVE_DECL_LE16TOH 0
- | #define HAVE_DECL_LE32TOH 0
- | #define HAVE_DECL_LE64TOH 0
- | #define HAVE_DECL_HTOLE16 0
- | #define HAVE_DECL_HTOLE32 0
- | #define HAVE_DECL_HTOLE64 0
- | #define HAVE_DECL_BE16TOH 0
- | #define HAVE_DECL_BE32TOH 0
- | #define HAVE_DECL_BE64TOH 0
- | #define HAVE_DECL_HTOBE16 0
- | #define HAVE_DECL_HTOBE32 0
- | #define HAVE_DECL_HTOBE64 0
- | #define HAVE_DECL_BSWAP_16 0
- | #define HAVE_DECL_BSWAP_32 0
- | #define HAVE_DECL_BSWAP_64 0
- | #define HAVE_DECL___BUILTIN_CLZ 0
- | #define HAVE_DECL___BUILTIN_CLZL 0
- | #define HAVE_DECL___BUILTIN_CLZLL 0
- | #define HAVE_MSG_DONTWAIT 1
- | #define HAVE_VISIBILITY_ATTRIBUTE 1
- | /* end confdefs.h. */
- |
- | #include <bdb48/db_cxx.h>
- |
- | int
- | main ()
- | {
- |
- | #if !((DB_VERSION_MAJOR == 4 && DB_VERSION_MINOR >= 8) || DB_VERSION_MAJOR > 4)
- | #error "failed to find bdb 4.8+"
- | #endif
- |
- | ;
- | return 0;
- | }
- configure:23397: g++ -std=c++11 -c -g -O2 -Wall -Wextra -Wformat -Wvla -Wformat-security -Wno-unused-parameter -Wno-self-assign -Wno-unused-local-typedef -Wno-deprecated-register -Wno-implicit-fallthrough -DHAVE_BUILD_INFO -D__STDC_FORMAT_MACROS -I/usr/local/opt/berkeley-db@4/include -DMAC_OSX conftest.cpp >&5
- conftest.cpp:56:18: fatal error: 'libdb48/db_cxx.h' file not found
- #include <libdb48/db_cxx.h>
- ^
- 1 error generated.
- configure:23397: $? = 1
- configure: failed program was:
- | /* confdefs.h */
- | #define PACKAGE_NAME "Bitcoin Core"
- | #define PACKAGE_TARNAME "bitcoin"
- | #define PACKAGE_VERSION "0.14.99"
- | #define PACKAGE_STRING "Bitcoin Core 0.14.99"
- | #define PACKAGE_BUGREPORT "https://github.com/bitcoin/bitcoin/issues"
- | #define PACKAGE_URL "https://bitcoincore.org/"
- | #define HAVE_CXX11 1
- | #define STDC_HEADERS 1
- | #define HAVE_SYS_TYPES_H 1
- | #define HAVE_SYS_STAT_H 1
- | #define HAVE_STDLIB_H 1
- | #define HAVE_STRING_H 1
- | #define HAVE_MEMORY_H 1
- | #define HAVE_STRINGS_H 1
- | #define HAVE_INTTYPES_H 1
- | #define HAVE_STDINT_H 1
- | #define HAVE_UNISTD_H 1
- | #define HAVE_DLFCN_H 1
- | #define LT_OBJDIR ".libs/"
- | #define HAVE_PTHREAD_PRIO_INHERIT 1
- | #define HAVE_PTHREAD 1
- | #define HAVE_DECL_STRERROR_R 1
- | #define HAVE_STRERROR_R 1
- | #define HAVE_STDIO_H 1
- | #define HAVE_STDLIB_H 1
- | #define HAVE_UNISTD_H 1
- | #define HAVE_STRINGS_H 1
- | #define HAVE_SYS_TYPES_H 1
- | #define HAVE_SYS_STAT_H 1
- | #define HAVE_SYS_SELECT_H 1
- | #define HAVE_DECL_STRNLEN 1
- | #define HAVE_DECL_DAEMON 1
- | #define HAVE_DECL_LE16TOH 0
- | #define HAVE_DECL_LE32TOH 0
- | #define HAVE_DECL_LE64TOH 0
- | #define HAVE_DECL_HTOLE16 0
- | #define HAVE_DECL_HTOLE32 0
- | #define HAVE_DECL_HTOLE64 0
- | #define HAVE_DECL_BE16TOH 0
- | #define HAVE_DECL_BE32TOH 0
- | #define HAVE_DECL_BE64TOH 0
- | #define HAVE_DECL_HTOBE16 0
- | #define HAVE_DECL_HTOBE32 0
- | #define HAVE_DECL_HTOBE64 0
- | #define HAVE_DECL_BSWAP_16 0
- | #define HAVE_DECL_BSWAP_32 0
- | #define HAVE_DECL_BSWAP_64 0
- | #define HAVE_DECL___BUILTIN_CLZ 0
- | #define HAVE_DECL___BUILTIN_CLZL 0
- | #define HAVE_DECL___BUILTIN_CLZLL 0
- | #define HAVE_MSG_DONTWAIT 1
- | #define HAVE_VISIBILITY_ATTRIBUTE 1
- | /* end confdefs.h. */
- |
- | #include <libdb48/db_cxx.h>
- |
- | int
- | main ()
- | {
- |
- | #if !((DB_VERSION_MAJOR == 4 && DB_VERSION_MINOR >= 8) || DB_VERSION_MAJOR > 4)
- | #error "failed to find bdb 4.8+"
- | #endif
- |
- | ;
- | return 0;
- | }
- configure:23397: g++ -std=c++11 -c -g -O2 -Wall -Wextra -Wformat -Wvla -Wformat-security -Wno-unused-parameter -Wno-self-assign -Wno-unused-local-typedef -Wno-deprecated-register -Wno-implicit-fallthrough -DHAVE_BUILD_INFO -D__STDC_FORMAT_MACROS -I/usr/local/opt/berkeley-db@4/include -DMAC_OSX conftest.cpp >&5
- conftest.cpp:56:18: fatal error: 'db48/db_cxx.h' file not found
- #include <db48/db_cxx.h>
- ^
- 1 error generated.
- configure:23397: $? = 1
- configure: failed program was:
- | /* confdefs.h */
- | #define PACKAGE_NAME "Bitcoin Core"
- | #define PACKAGE_TARNAME "bitcoin"
- | #define PACKAGE_VERSION "0.14.99"
- | #define PACKAGE_STRING "Bitcoin Core 0.14.99"
- | #define PACKAGE_BUGREPORT "https://github.com/bitcoin/bitcoin/issues"
- | #define PACKAGE_URL "https://bitcoincore.org/"
- | #define HAVE_CXX11 1
- | #define STDC_HEADERS 1
- | #define HAVE_SYS_TYPES_H 1
- | #define HAVE_SYS_STAT_H 1
- | #define HAVE_STDLIB_H 1
- | #define HAVE_STRING_H 1
- | #define HAVE_MEMORY_H 1
- | #define HAVE_STRINGS_H 1
- | #define HAVE_INTTYPES_H 1
- | #define HAVE_STDINT_H 1
- | #define HAVE_UNISTD_H 1
- | #define HAVE_DLFCN_H 1
- | #define LT_OBJDIR ".libs/"
- | #define HAVE_PTHREAD_PRIO_INHERIT 1
- | #define HAVE_PTHREAD 1
- | #define HAVE_DECL_STRERROR_R 1
- | #define HAVE_STRERROR_R 1
- | #define HAVE_STDIO_H 1
- | #define HAVE_STDLIB_H 1
- | #define HAVE_UNISTD_H 1
- | #define HAVE_STRINGS_H 1
- | #define HAVE_SYS_TYPES_H 1
- | #define HAVE_SYS_STAT_H 1
- | #define HAVE_SYS_SELECT_H 1
- | #define HAVE_DECL_STRNLEN 1
- | #define HAVE_DECL_DAEMON 1
- | #define HAVE_DECL_LE16TOH 0
- | #define HAVE_DECL_LE32TOH 0
- | #define HAVE_DECL_LE64TOH 0
- | #define HAVE_DECL_HTOLE16 0
- | #define HAVE_DECL_HTOLE32 0
- | #define HAVE_DECL_HTOLE64 0
- | #define HAVE_DECL_BE16TOH 0
- | #define HAVE_DECL_BE32TOH 0
- | #define HAVE_DECL_BE64TOH 0
- | #define HAVE_DECL_HTOBE16 0
- | #define HAVE_DECL_HTOBE32 0
- | #define HAVE_DECL_HTOBE64 0
- | #define HAVE_DECL_BSWAP_16 0
- | #define HAVE_DECL_BSWAP_32 0
- | #define HAVE_DECL_BSWAP_64 0
- | #define HAVE_DECL___BUILTIN_CLZ 0
- | #define HAVE_DECL___BUILTIN_CLZL 0
- | #define HAVE_DECL___BUILTIN_CLZLL 0
- | #define HAVE_MSG_DONTWAIT 1
- | #define HAVE_VISIBILITY_ATTRIBUTE 1
- | /* end confdefs.h. */
- |
- | #include <db48/db_cxx.h>
- |
- | int
- | main ()
- | {
- |
- | #if !((DB_VERSION_MAJOR == 4 && DB_VERSION_MINOR >= 8) || DB_VERSION_MAJOR > 4)
- | #error "failed to find bdb 4.8+"
- | #endif
- |
- | ;
- | return 0;
- | }
- configure:23397: g++ -std=c++11 -c -g -O2 -Wall -Wextra -Wformat -Wvla -Wformat-security -Wno-unused-parameter -Wno-self-assign -Wno-unused-local-typedef -Wno-deprecated-register -Wno-implicit-fallthrough -DHAVE_BUILD_INFO -D__STDC_FORMAT_MACROS -I/usr/local/opt/berkeley-db@4/include -DMAC_OSX conftest.cpp >&5
- conftest.cpp:56:18: fatal error: 'bdb4/db_cxx.h' file not found
- #include <bdb4/db_cxx.h>
- ^
- 1 error generated.
- configure:23397: $? = 1
- configure: failed program was:
- | /* confdefs.h */
- | #define PACKAGE_NAME "Bitcoin Core"
- | #define PACKAGE_TARNAME "bitcoin"
- | #define PACKAGE_VERSION "0.14.99"
- | #define PACKAGE_STRING "Bitcoin Core 0.14.99"
- | #define PACKAGE_BUGREPORT "https://github.com/bitcoin/bitcoin/issues"
- | #define PACKAGE_URL "https://bitcoincore.org/"
- | #define HAVE_CXX11 1
- | #define STDC_HEADERS 1
- | #define HAVE_SYS_TYPES_H 1
- | #define HAVE_SYS_STAT_H 1
- | #define HAVE_STDLIB_H 1
- | #define HAVE_STRING_H 1
- | #define HAVE_MEMORY_H 1
- | #define HAVE_STRINGS_H 1
- | #define HAVE_INTTYPES_H 1
- | #define HAVE_STDINT_H 1
- | #define HAVE_UNISTD_H 1
- | #define HAVE_DLFCN_H 1
- | #define LT_OBJDIR ".libs/"
- | #define HAVE_PTHREAD_PRIO_INHERIT 1
- | #define HAVE_PTHREAD 1
- | #define HAVE_DECL_STRERROR_R 1
- | #define HAVE_STRERROR_R 1
- | #define HAVE_STDIO_H 1
- | #define HAVE_STDLIB_H 1
- | #define HAVE_UNISTD_H 1
- | #define HAVE_STRINGS_H 1
- | #define HAVE_SYS_TYPES_H 1
- | #define HAVE_SYS_STAT_H 1
- | #define HAVE_SYS_SELECT_H 1
- | #define HAVE_DECL_STRNLEN 1
- | #define HAVE_DECL_DAEMON 1
- | #define HAVE_DECL_LE16TOH 0
- | #define HAVE_DECL_LE32TOH 0
- | #define HAVE_DECL_LE64TOH 0
- | #define HAVE_DECL_HTOLE16 0
- | #define HAVE_DECL_HTOLE32 0
- | #define HAVE_DECL_HTOLE64 0
- | #define HAVE_DECL_BE16TOH 0
- | #define HAVE_DECL_BE32TOH 0
- | #define HAVE_DECL_BE64TOH 0
- | #define HAVE_DECL_HTOBE16 0
- | #define HAVE_DECL_HTOBE32 0
- | #define HAVE_DECL_HTOBE64 0
- | #define HAVE_DECL_BSWAP_16 0
- | #define HAVE_DECL_BSWAP_32 0
- | #define HAVE_DECL_BSWAP_64 0
- | #define HAVE_DECL___BUILTIN_CLZ 0
- | #define HAVE_DECL___BUILTIN_CLZL 0
- | #define HAVE_DECL___BUILTIN_CLZLL 0
- | #define HAVE_MSG_DONTWAIT 1
- | #define HAVE_VISIBILITY_ATTRIBUTE 1
- | /* end confdefs.h. */
- |
- | #include <bdb4/db_cxx.h>
- |
- | int
- | main ()
- | {
- |
- | #if !((DB_VERSION_MAJOR == 4 && DB_VERSION_MINOR >= 8) || DB_VERSION_MAJOR > 4)
- | #error "failed to find bdb 4.8+"
- | #endif
- |
- | ;
- | return 0;
- | }
- configure:23397: g++ -std=c++11 -c -g -O2 -Wall -Wextra -Wformat -Wvla -Wformat-security -Wno-unused-parameter -Wno-self-assign -Wno-unused-local-typedef -Wno-deprecated-register -Wno-implicit-fallthrough -DHAVE_BUILD_INFO -D__STDC_FORMAT_MACROS -I/usr/local/opt/berkeley-db@4/include -DMAC_OSX conftest.cpp >&5
- conftest.cpp:56:18: fatal error: 'libdb4/db_cxx.h' file not found
- #include <libdb4/db_cxx.h>
- ^
- 1 error generated.
- configure:23397: $? = 1
- configure: failed program was:
- | /* confdefs.h */
- | #define PACKAGE_NAME "Bitcoin Core"
- | #define PACKAGE_TARNAME "bitcoin"
- | #define PACKAGE_VERSION "0.14.99"
- | #define PACKAGE_STRING "Bitcoin Core 0.14.99"
- | #define PACKAGE_BUGREPORT "https://github.com/bitcoin/bitcoin/issues"
- | #define PACKAGE_URL "https://bitcoincore.org/"
- | #define HAVE_CXX11 1
- | #define STDC_HEADERS 1
- | #define HAVE_SYS_TYPES_H 1
- | #define HAVE_SYS_STAT_H 1
- | #define HAVE_STDLIB_H 1
- | #define HAVE_STRING_H 1
- | #define HAVE_MEMORY_H 1
- | #define HAVE_STRINGS_H 1
- | #define HAVE_INTTYPES_H 1
- | #define HAVE_STDINT_H 1
- | #define HAVE_UNISTD_H 1
- | #define HAVE_DLFCN_H 1
- | #define LT_OBJDIR ".libs/"
- | #define HAVE_PTHREAD_PRIO_INHERIT 1
- | #define HAVE_PTHREAD 1
- | #define HAVE_DECL_STRERROR_R 1
- | #define HAVE_STRERROR_R 1
- | #define HAVE_STDIO_H 1
- | #define HAVE_STDLIB_H 1
- | #define HAVE_UNISTD_H 1
- | #define HAVE_STRINGS_H 1
- | #define HAVE_SYS_TYPES_H 1
- | #define HAVE_SYS_STAT_H 1
- | #define HAVE_SYS_SELECT_H 1
- | #define HAVE_DECL_STRNLEN 1
- | #define HAVE_DECL_DAEMON 1
- | #define HAVE_DECL_LE16TOH 0
- | #define HAVE_DECL_LE32TOH 0
- | #define HAVE_DECL_LE64TOH 0
- | #define HAVE_DECL_HTOLE16 0
- | #define HAVE_DECL_HTOLE32 0
- | #define HAVE_DECL_HTOLE64 0
- | #define HAVE_DECL_BE16TOH 0
- | #define HAVE_DECL_BE32TOH 0
- | #define HAVE_DECL_BE64TOH 0
- | #define HAVE_DECL_HTOBE16 0
- | #define HAVE_DECL_HTOBE32 0
- | #define HAVE_DECL_HTOBE64 0
- | #define HAVE_DECL_BSWAP_16 0
- | #define HAVE_DECL_BSWAP_32 0
- | #define HAVE_DECL_BSWAP_64 0
- | #define HAVE_DECL___BUILTIN_CLZ 0
- | #define HAVE_DECL___BUILTIN_CLZL 0
- | #define HAVE_DECL___BUILTIN_CLZLL 0
- | #define HAVE_MSG_DONTWAIT 1
- | #define HAVE_VISIBILITY_ATTRIBUTE 1
- | /* end confdefs.h. */
- |
- | #include <libdb4/db_cxx.h>
- |
- | int
- | main ()
- | {
- |
- | #if !((DB_VERSION_MAJOR == 4 && DB_VERSION_MINOR >= 8) || DB_VERSION_MAJOR > 4)
- | #error "failed to find bdb 4.8+"
- | #endif
- |
- | ;
- | return 0;
- | }
- configure:23397: g++ -std=c++11 -c -g -O2 -Wall -Wextra -Wformat -Wvla -Wformat-security -Wno-unused-parameter -Wno-self-assign -Wno-unused-local-typedef -Wno-deprecated-register -Wno-implicit-fallthrough -DHAVE_BUILD_INFO -D__STDC_FORMAT_MACROS -I/usr/local/opt/berkeley-db@4/include -DMAC_OSX conftest.cpp >&5
- conftest.cpp:56:18: fatal error: 'db4/db_cxx.h' file not found
- #include <db4/db_cxx.h>
- ^
- 1 error generated.
- configure:23397: $? = 1
- configure: failed program was:
- | /* confdefs.h */
- | #define PACKAGE_NAME "Bitcoin Core"
- | #define PACKAGE_TARNAME "bitcoin"
- | #define PACKAGE_VERSION "0.14.99"
- | #define PACKAGE_STRING "Bitcoin Core 0.14.99"
- | #define PACKAGE_BUGREPORT "https://github.com/bitcoin/bitcoin/issues"
- | #define PACKAGE_URL "https://bitcoincore.org/"
- | #define HAVE_CXX11 1
- | #define STDC_HEADERS 1
- | #define HAVE_SYS_TYPES_H 1
- | #define HAVE_SYS_STAT_H 1
- | #define HAVE_STDLIB_H 1
- | #define HAVE_STRING_H 1
- | #define HAVE_MEMORY_H 1
- | #define HAVE_STRINGS_H 1
- | #define HAVE_INTTYPES_H 1
- | #define HAVE_STDINT_H 1
- | #define HAVE_UNISTD_H 1
- | #define HAVE_DLFCN_H 1
- | #define LT_OBJDIR ".libs/"
- | #define HAVE_PTHREAD_PRIO_INHERIT 1
- | #define HAVE_PTHREAD 1
- | #define HAVE_DECL_STRERROR_R 1
- | #define HAVE_STRERROR_R 1
- | #define HAVE_STDIO_H 1
- | #define HAVE_STDLIB_H 1
- | #define HAVE_UNISTD_H 1
- | #define HAVE_STRINGS_H 1
- | #define HAVE_SYS_TYPES_H 1
- | #define HAVE_SYS_STAT_H 1
- | #define HAVE_SYS_SELECT_H 1
- | #define HAVE_DECL_STRNLEN 1
- | #define HAVE_DECL_DAEMON 1
- | #define HAVE_DECL_LE16TOH 0
- | #define HAVE_DECL_LE32TOH 0
- | #define HAVE_DECL_LE64TOH 0
- | #define HAVE_DECL_HTOLE16 0
- | #define HAVE_DECL_HTOLE32 0
- | #define HAVE_DECL_HTOLE64 0
- | #define HAVE_DECL_BE16TOH 0
- | #define HAVE_DECL_BE32TOH 0
- | #define HAVE_DECL_BE64TOH 0
- | #define HAVE_DECL_HTOBE16 0
- | #define HAVE_DECL_HTOBE32 0
- | #define HAVE_DECL_HTOBE64 0
- | #define HAVE_DECL_BSWAP_16 0
- | #define HAVE_DECL_BSWAP_32 0
- | #define HAVE_DECL_BSWAP_64 0
- | #define HAVE_DECL___BUILTIN_CLZ 0
- | #define HAVE_DECL___BUILTIN_CLZL 0
- | #define HAVE_DECL___BUILTIN_CLZLL 0
- | #define HAVE_MSG_DONTWAIT 1
- | #define HAVE_VISIBILITY_ATTRIBUTE 1
- | /* end confdefs.h. */
- |
- | #include <db4/db_cxx.h>
- |
- | int
- | main ()
- | {
- |
- | #if !((DB_VERSION_MAJOR == 4 && DB_VERSION_MINOR >= 8) || DB_VERSION_MAJOR > 4)
- | #error "failed to find bdb 4.8+"
- | #endif
- |
- | ;
- | return 0;
- | }
- configure:23397: g++ -std=c++11 -c -g -O2 -Wall -Wextra -Wformat -Wvla -Wformat-security -Wno-unused-parameter -Wno-self-assign -Wno-unused-local-typedef -Wno-deprecated-register -Wno-implicit-fallthrough -DHAVE_BUILD_INFO -D__STDC_FORMAT_MACROS -I/usr/local/opt/berkeley-db@4/include -DMAC_OSX conftest.cpp >&5
- conftest.cpp:56:18: fatal error: 'bdb5/db_cxx.h' file not found
- #include <bdb5/db_cxx.h>
- ^
- 1 error generated.
- configure:23397: $? = 1
- configure: failed program was:
- | /* confdefs.h */
- | #define PACKAGE_NAME "Bitcoin Core"
- | #define PACKAGE_TARNAME "bitcoin"
- | #define PACKAGE_VERSION "0.14.99"
- | #define PACKAGE_STRING "Bitcoin Core 0.14.99"
- | #define PACKAGE_BUGREPORT "https://github.com/bitcoin/bitcoin/issues"
- | #define PACKAGE_URL "https://bitcoincore.org/"
- | #define HAVE_CXX11 1
- | #define STDC_HEADERS 1
- | #define HAVE_SYS_TYPES_H 1
- | #define HAVE_SYS_STAT_H 1
- | #define HAVE_STDLIB_H 1
- | #define HAVE_STRING_H 1
- | #define HAVE_MEMORY_H 1
- | #define HAVE_STRINGS_H 1
- | #define HAVE_INTTYPES_H 1
- | #define HAVE_STDINT_H 1
- | #define HAVE_UNISTD_H 1
- | #define HAVE_DLFCN_H 1
- | #define LT_OBJDIR ".libs/"
- | #define HAVE_PTHREAD_PRIO_INHERIT 1
- | #define HAVE_PTHREAD 1
- | #define HAVE_DECL_STRERROR_R 1
- | #define HAVE_STRERROR_R 1
- | #define HAVE_STDIO_H 1
- | #define HAVE_STDLIB_H 1
- | #define HAVE_UNISTD_H 1
- | #define HAVE_STRINGS_H 1
- | #define HAVE_SYS_TYPES_H 1
- | #define HAVE_SYS_STAT_H 1
- | #define HAVE_SYS_SELECT_H 1
- | #define HAVE_DECL_STRNLEN 1
- | #define HAVE_DECL_DAEMON 1
- | #define HAVE_DECL_LE16TOH 0
- | #define HAVE_DECL_LE32TOH 0
- | #define HAVE_DECL_LE64TOH 0
- | #define HAVE_DECL_HTOLE16 0
- | #define HAVE_DECL_HTOLE32 0
- | #define HAVE_DECL_HTOLE64 0
- | #define HAVE_DECL_BE16TOH 0
- | #define HAVE_DECL_BE32TOH 0
- | #define HAVE_DECL_BE64TOH 0
- | #define HAVE_DECL_HTOBE16 0
- | #define HAVE_DECL_HTOBE32 0
- | #define HAVE_DECL_HTOBE64 0
- | #define HAVE_DECL_BSWAP_16 0
- | #define HAVE_DECL_BSWAP_32 0
- | #define HAVE_DECL_BSWAP_64 0
- | #define HAVE_DECL___BUILTIN_CLZ 0
- | #define HAVE_DECL___BUILTIN_CLZL 0
- | #define HAVE_DECL___BUILTIN_CLZLL 0
- | #define HAVE_MSG_DONTWAIT 1
- | #define HAVE_VISIBILITY_ATTRIBUTE 1
- | /* end confdefs.h. */
- |
- | #include <bdb5/db_cxx.h>
- |
- | int
- | main ()
- | {
- |
- | #if !((DB_VERSION_MAJOR == 4 && DB_VERSION_MINOR >= 8) || DB_VERSION_MAJOR > 4)
- | #error "failed to find bdb 4.8+"
- | #endif
- |
- | ;
- | return 0;
- | }
- configure:23397: g++ -std=c++11 -c -g -O2 -Wall -Wextra -Wformat -Wvla -Wformat-security -Wno-unused-parameter -Wno-self-assign -Wno-unused-local-typedef -Wno-deprecated-register -Wno-implicit-fallthrough -DHAVE_BUILD_INFO -D__STDC_FORMAT_MACROS -I/usr/local/opt/berkeley-db@4/include -DMAC_OSX conftest.cpp >&5
- conftest.cpp:56:18: fatal error: 'libdb5/db_cxx.h' file not found
- #include <libdb5/db_cxx.h>
- ^
- 1 error generated.
- configure:23397: $? = 1
- configure: failed program was:
- | /* confdefs.h */
- | #define PACKAGE_NAME "Bitcoin Core"
- | #define PACKAGE_TARNAME "bitcoin"
- | #define PACKAGE_VERSION "0.14.99"
- | #define PACKAGE_STRING "Bitcoin Core 0.14.99"
- | #define PACKAGE_BUGREPORT "https://github.com/bitcoin/bitcoin/issues"
- | #define PACKAGE_URL "https://bitcoincore.org/"
- | #define HAVE_CXX11 1
- | #define STDC_HEADERS 1
- | #define HAVE_SYS_TYPES_H 1
- | #define HAVE_SYS_STAT_H 1
- | #define HAVE_STDLIB_H 1
- | #define HAVE_STRING_H 1
- | #define HAVE_MEMORY_H 1
- | #define HAVE_STRINGS_H 1
- | #define HAVE_INTTYPES_H 1
- | #define HAVE_STDINT_H 1
- | #define HAVE_UNISTD_H 1
- | #define HAVE_DLFCN_H 1
- | #define LT_OBJDIR ".libs/"
- | #define HAVE_PTHREAD_PRIO_INHERIT 1
- | #define HAVE_PTHREAD 1
- | #define HAVE_DECL_STRERROR_R 1
- | #define HAVE_STRERROR_R 1
- | #define HAVE_STDIO_H 1
- | #define HAVE_STDLIB_H 1
- | #define HAVE_UNISTD_H 1
- | #define HAVE_STRINGS_H 1
- | #define HAVE_SYS_TYPES_H 1
- | #define HAVE_SYS_STAT_H 1
- | #define HAVE_SYS_SELECT_H 1
- | #define HAVE_DECL_STRNLEN 1
- | #define HAVE_DECL_DAEMON 1
- | #define HAVE_DECL_LE16TOH 0
- | #define HAVE_DECL_LE32TOH 0
- | #define HAVE_DECL_LE64TOH 0
- | #define HAVE_DECL_HTOLE16 0
- | #define HAVE_DECL_HTOLE32 0
- | #define HAVE_DECL_HTOLE64 0
- | #define HAVE_DECL_BE16TOH 0
- | #define HAVE_DECL_BE32TOH 0
- | #define HAVE_DECL_BE64TOH 0
- | #define HAVE_DECL_HTOBE16 0
- | #define HAVE_DECL_HTOBE32 0
- | #define HAVE_DECL_HTOBE64 0
- | #define HAVE_DECL_BSWAP_16 0
- | #define HAVE_DECL_BSWAP_32 0
- | #define HAVE_DECL_BSWAP_64 0
- | #define HAVE_DECL___BUILTIN_CLZ 0
- | #define HAVE_DECL___BUILTIN_CLZL 0
- | #define HAVE_DECL___BUILTIN_CLZLL 0
- | #define HAVE_MSG_DONTWAIT 1
- | #define HAVE_VISIBILITY_ATTRIBUTE 1
- | /* end confdefs.h. */
- |
- | #include <libdb5/db_cxx.h>
- |
- | int
- | main ()
- | {
- |
- | #if !((DB_VERSION_MAJOR == 4 && DB_VERSION_MINOR >= 8) || DB_VERSION_MAJOR > 4)
- | #error "failed to find bdb 4.8+"
- | #endif
- |
- | ;
- | return 0;
- | }
- configure:23397: g++ -std=c++11 -c -g -O2 -Wall -Wextra -Wformat -Wvla -Wformat-security -Wno-unused-parameter -Wno-self-assign -Wno-unused-local-typedef -Wno-deprecated-register -Wno-implicit-fallthrough -DHAVE_BUILD_INFO -D__STDC_FORMAT_MACROS -I/usr/local/opt/berkeley-db@4/include -DMAC_OSX conftest.cpp >&5
- conftest.cpp:56:18: fatal error: 'db5/db_cxx.h' file not found
- #include <db5/db_cxx.h>
- ^
- 1 error generated.
- configure:23397: $? = 1
- configure: failed program was:
- | /* confdefs.h */
- | #define PACKAGE_NAME "Bitcoin Core"
- | #define PACKAGE_TARNAME "bitcoin"
- | #define PACKAGE_VERSION "0.14.99"
- | #define PACKAGE_STRING "Bitcoin Core 0.14.99"
- | #define PACKAGE_BUGREPORT "https://github.com/bitcoin/bitcoin/issues"
- | #define PACKAGE_URL "https://bitcoincore.org/"
- | #define HAVE_CXX11 1
- | #define STDC_HEADERS 1
- | #define HAVE_SYS_TYPES_H 1
- | #define HAVE_SYS_STAT_H 1
- | #define HAVE_STDLIB_H 1
- | #define HAVE_STRING_H 1
- | #define HAVE_MEMORY_H 1
- | #define HAVE_STRINGS_H 1
- | #define HAVE_INTTYPES_H 1
- | #define HAVE_STDINT_H 1
- | #define HAVE_UNISTD_H 1
- | #define HAVE_DLFCN_H 1
- | #define LT_OBJDIR ".libs/"
- | #define HAVE_PTHREAD_PRIO_INHERIT 1
- | #define HAVE_PTHREAD 1
- | #define HAVE_DECL_STRERROR_R 1
- | #define HAVE_STRERROR_R 1
- | #define HAVE_STDIO_H 1
- | #define HAVE_STDLIB_H 1
- | #define HAVE_UNISTD_H 1
- | #define HAVE_STRINGS_H 1
- | #define HAVE_SYS_TYPES_H 1
- | #define HAVE_SYS_STAT_H 1
- | #define HAVE_SYS_SELECT_H 1
- | #define HAVE_DECL_STRNLEN 1
- | #define HAVE_DECL_DAEMON 1
- | #define HAVE_DECL_LE16TOH 0
- | #define HAVE_DECL_LE32TOH 0
- | #define HAVE_DECL_LE64TOH 0
- | #define HAVE_DECL_HTOLE16 0
- | #define HAVE_DECL_HTOLE32 0
- | #define HAVE_DECL_HTOLE64 0
- | #define HAVE_DECL_BE16TOH 0
- | #define HAVE_DECL_BE32TOH 0
- | #define HAVE_DECL_BE64TOH 0
- | #define HAVE_DECL_HTOBE16 0
- | #define HAVE_DECL_HTOBE32 0
- | #define HAVE_DECL_HTOBE64 0
- | #define HAVE_DECL_BSWAP_16 0
- | #define HAVE_DECL_BSWAP_32 0
- | #define HAVE_DECL_BSWAP_64 0
- | #define HAVE_DECL___BUILTIN_CLZ 0
- | #define HAVE_DECL___BUILTIN_CLZL 0
- | #define HAVE_DECL___BUILTIN_CLZLL 0
- | #define HAVE_MSG_DONTWAIT 1
- | #define HAVE_VISIBILITY_ATTRIBUTE 1
- | /* end confdefs.h. */
- |
- | #include <db5/db_cxx.h>
- |
- | int
- | main ()
- | {
- |
- | #if !((DB_VERSION_MAJOR == 4 && DB_VERSION_MINOR >= 8) || DB_VERSION_MAJOR > 4)
- | #error "failed to find bdb 4.8+"
- | #endif
- |
- | ;
- | return 0;
- | }
- configure:23397: g++ -std=c++11 -c -g -O2 -Wall -Wextra -Wformat -Wvla -Wformat-security -Wno-unused-parameter -Wno-self-assign -Wno-unused-local-typedef -Wno-deprecated-register -Wno-implicit-fallthrough -DHAVE_BUILD_INFO -D__STDC_FORMAT_MACROS -I/usr/local/opt/berkeley-db@4/include -DMAC_OSX conftest.cpp >&5
- conftest.cpp:56:18: fatal error: 'bdb/db_cxx.h' file not found
- #include <bdb/db_cxx.h>
- ^
- 1 error generated.
- configure:23397: $? = 1
- configure: failed program was:
- | /* confdefs.h */
- | #define PACKAGE_NAME "Bitcoin Core"
- | #define PACKAGE_TARNAME "bitcoin"
- | #define PACKAGE_VERSION "0.14.99"
- | #define PACKAGE_STRING "Bitcoin Core 0.14.99"
- | #define PACKAGE_BUGREPORT "https://github.com/bitcoin/bitcoin/issues"
- | #define PACKAGE_URL "https://bitcoincore.org/"
- | #define HAVE_CXX11 1
- | #define STDC_HEADERS 1
- | #define HAVE_SYS_TYPES_H 1
- | #define HAVE_SYS_STAT_H 1
- | #define HAVE_STDLIB_H 1
- | #define HAVE_STRING_H 1
- | #define HAVE_MEMORY_H 1
- | #define HAVE_STRINGS_H 1
- | #define HAVE_INTTYPES_H 1
- | #define HAVE_STDINT_H 1
- | #define HAVE_UNISTD_H 1
- | #define HAVE_DLFCN_H 1
- | #define LT_OBJDIR ".libs/"
- | #define HAVE_PTHREAD_PRIO_INHERIT 1
- | #define HAVE_PTHREAD 1
- | #define HAVE_DECL_STRERROR_R 1
- | #define HAVE_STRERROR_R 1
- | #define HAVE_STDIO_H 1
- | #define HAVE_STDLIB_H 1
- | #define HAVE_UNISTD_H 1
- | #define HAVE_STRINGS_H 1
- | #define HAVE_SYS_TYPES_H 1
- | #define HAVE_SYS_STAT_H 1
- | #define HAVE_SYS_SELECT_H 1
- | #define HAVE_DECL_STRNLEN 1
- | #define HAVE_DECL_DAEMON 1
- | #define HAVE_DECL_LE16TOH 0
- | #define HAVE_DECL_LE32TOH 0
- | #define HAVE_DECL_LE64TOH 0
- | #define HAVE_DECL_HTOLE16 0
- | #define HAVE_DECL_HTOLE32 0
- | #define HAVE_DECL_HTOLE64 0
- | #define HAVE_DECL_BE16TOH 0
- | #define HAVE_DECL_BE32TOH 0
- | #define HAVE_DECL_BE64TOH 0
- | #define HAVE_DECL_HTOBE16 0
- | #define HAVE_DECL_HTOBE32 0
- | #define HAVE_DECL_HTOBE64 0
- | #define HAVE_DECL_BSWAP_16 0
- | #define HAVE_DECL_BSWAP_32 0
- | #define HAVE_DECL_BSWAP_64 0
- | #define HAVE_DECL___BUILTIN_CLZ 0
- | #define HAVE_DECL___BUILTIN_CLZL 0
- | #define HAVE_DECL___BUILTIN_CLZLL 0
- | #define HAVE_MSG_DONTWAIT 1
- | #define HAVE_VISIBILITY_ATTRIBUTE 1
- | /* end confdefs.h. */
- |
- | #include <bdb/db_cxx.h>
- |
- | int
- | main ()
- | {
- |
- | #if !((DB_VERSION_MAJOR == 4 && DB_VERSION_MINOR >= 8) || DB_VERSION_MAJOR > 4)
- | #error "failed to find bdb 4.8+"
- | #endif
- |
- | ;
- | return 0;
- | }
- configure:23397: g++ -std=c++11 -c -g -O2 -Wall -Wextra -Wformat -Wvla -Wformat-security -Wno-unused-parameter -Wno-self-assign -Wno-unused-local-typedef -Wno-deprecated-register -Wno-implicit-fallthrough -DHAVE_BUILD_INFO -D__STDC_FORMAT_MACROS -I/usr/local/opt/berkeley-db@4/include -DMAC_OSX conftest.cpp >&5
- conftest.cpp:56:18: fatal error: 'libdb/db_cxx.h' file not found
- #include <libdb/db_cxx.h>
- ^
- 1 error generated.
- configure:23397: $? = 1
- configure: failed program was:
- | /* confdefs.h */
- | #define PACKAGE_NAME "Bitcoin Core"
- | #define PACKAGE_TARNAME "bitcoin"
- | #define PACKAGE_VERSION "0.14.99"
- | #define PACKAGE_STRING "Bitcoin Core 0.14.99"
- | #define PACKAGE_BUGREPORT "https://github.com/bitcoin/bitcoin/issues"
- | #define PACKAGE_URL "https://bitcoincore.org/"
- | #define HAVE_CXX11 1
- | #define STDC_HEADERS 1
- | #define HAVE_SYS_TYPES_H 1
- | #define HAVE_SYS_STAT_H 1
- | #define HAVE_STDLIB_H 1
- | #define HAVE_STRING_H 1
- | #define HAVE_MEMORY_H 1
- | #define HAVE_STRINGS_H 1
- | #define HAVE_INTTYPES_H 1
- | #define HAVE_STDINT_H 1
- | #define HAVE_UNISTD_H 1
- | #define HAVE_DLFCN_H 1
- | #define LT_OBJDIR ".libs/"
- | #define HAVE_PTHREAD_PRIO_INHERIT 1
- | #define HAVE_PTHREAD 1
- | #define HAVE_DECL_STRERROR_R 1
- | #define HAVE_STRERROR_R 1
- | #define HAVE_STDIO_H 1
- | #define HAVE_STDLIB_H 1
- | #define HAVE_UNISTD_H 1
- | #define HAVE_STRINGS_H 1
- | #define HAVE_SYS_TYPES_H 1
- | #define HAVE_SYS_STAT_H 1
- | #define HAVE_SYS_SELECT_H 1
- | #define HAVE_DECL_STRNLEN 1
- | #define HAVE_DECL_DAEMON 1
- | #define HAVE_DECL_LE16TOH 0
- | #define HAVE_DECL_LE32TOH 0
- | #define HAVE_DECL_LE64TOH 0
- | #define HAVE_DECL_HTOLE16 0
- | #define HAVE_DECL_HTOLE32 0
- | #define HAVE_DECL_HTOLE64 0
- | #define HAVE_DECL_BE16TOH 0
- | #define HAVE_DECL_BE32TOH 0
- | #define HAVE_DECL_BE64TOH 0
- | #define HAVE_DECL_HTOBE16 0
- | #define HAVE_DECL_HTOBE32 0
- | #define HAVE_DECL_HTOBE64 0
- | #define HAVE_DECL_BSWAP_16 0
- | #define HAVE_DECL_BSWAP_32 0
- | #define HAVE_DECL_BSWAP_64 0
- | #define HAVE_DECL___BUILTIN_CLZ 0
- | #define HAVE_DECL___BUILTIN_CLZL 0
- | #define HAVE_DECL___BUILTIN_CLZLL 0
- | #define HAVE_MSG_DONTWAIT 1
- | #define HAVE_VISIBILITY_ATTRIBUTE 1
- | /* end confdefs.h. */
- |
- | #include <libdb/db_cxx.h>
- |
- | int
- | main ()
- | {
- |
- | #if !((DB_VERSION_MAJOR == 4 && DB_VERSION_MINOR >= 8) || DB_VERSION_MAJOR > 4)
- | #error "failed to find bdb 4.8+"
- | #endif
- |
- | ;
- | return 0;
- | }
- configure:23397: g++ -std=c++11 -c -g -O2 -Wall -Wextra -Wformat -Wvla -Wformat-security -Wno-unused-parameter -Wno-self-assign -Wno-unused-local-typedef -Wno-deprecated-register -Wno-implicit-fallthrough -DHAVE_BUILD_INFO -D__STDC_FORMAT_MACROS -I/usr/local/opt/berkeley-db@4/include -DMAC_OSX conftest.cpp >&5
- conftest.cpp:56:18: fatal error: 'db/db_cxx.h' file not found
- #include <db/db_cxx.h>
- ^
- 1 error generated.
- configure:23397: $? = 1
- configure: failed program was:
- | /* confdefs.h */
- | #define PACKAGE_NAME "Bitcoin Core"
- | #define PACKAGE_TARNAME "bitcoin"
- | #define PACKAGE_VERSION "0.14.99"
- | #define PACKAGE_STRING "Bitcoin Core 0.14.99"
- | #define PACKAGE_BUGREPORT "https://github.com/bitcoin/bitcoin/issues"
- | #define PACKAGE_URL "https://bitcoincore.org/"
- | #define HAVE_CXX11 1
- | #define STDC_HEADERS 1
- | #define HAVE_SYS_TYPES_H 1
- | #define HAVE_SYS_STAT_H 1
- | #define HAVE_STDLIB_H 1
- | #define HAVE_STRING_H 1
- | #define HAVE_MEMORY_H 1
- | #define HAVE_STRINGS_H 1
- | #define HAVE_INTTYPES_H 1
- | #define HAVE_STDINT_H 1
- | #define HAVE_UNISTD_H 1
- | #define HAVE_DLFCN_H 1
- | #define LT_OBJDIR ".libs/"
- | #define HAVE_PTHREAD_PRIO_INHERIT 1
- | #define HAVE_PTHREAD 1
- | #define HAVE_DECL_STRERROR_R 1
- | #define HAVE_STRERROR_R 1
- | #define HAVE_STDIO_H 1
- | #define HAVE_STDLIB_H 1
- | #define HAVE_UNISTD_H 1
- | #define HAVE_STRINGS_H 1
- | #define HAVE_SYS_TYPES_H 1
- | #define HAVE_SYS_STAT_H 1
- | #define HAVE_SYS_SELECT_H 1
- | #define HAVE_DECL_STRNLEN 1
- | #define HAVE_DECL_DAEMON 1
- | #define HAVE_DECL_LE16TOH 0
- | #define HAVE_DECL_LE32TOH 0
- | #define HAVE_DECL_LE64TOH 0
- | #define HAVE_DECL_HTOLE16 0
- | #define HAVE_DECL_HTOLE32 0
- | #define HAVE_DECL_HTOLE64 0
- | #define HAVE_DECL_BE16TOH 0
- | #define HAVE_DECL_BE32TOH 0
- | #define HAVE_DECL_BE64TOH 0
- | #define HAVE_DECL_HTOBE16 0
- | #define HAVE_DECL_HTOBE32 0
- | #define HAVE_DECL_HTOBE64 0
- | #define HAVE_DECL_BSWAP_16 0
- | #define HAVE_DECL_BSWAP_32 0
- | #define HAVE_DECL_BSWAP_64 0
- | #define HAVE_DECL___BUILTIN_CLZ 0
- | #define HAVE_DECL___BUILTIN_CLZL 0
- | #define HAVE_DECL___BUILTIN_CLZLL 0
- | #define HAVE_MSG_DONTWAIT 1
- | #define HAVE_VISIBILITY_ATTRIBUTE 1
- | /* end confdefs.h. */
- |
- | #include <db/db_cxx.h>
- |
- | int
- | main ()
- | {
- |
- | #if !((DB_VERSION_MAJOR == 4 && DB_VERSION_MINOR >= 8) || DB_VERSION_MAJOR > 4)
- | #error "failed to find bdb 4.8+"
- | #endif
- |
- | ;
- | return 0;
- | }
- configure:23397: g++ -std=c++11 -c -g -O2 -Wall -Wextra -Wformat -Wvla -Wformat-security -Wno-unused-parameter -Wno-self-assign -Wno-unused-local-typedef -Wno-deprecated-register -Wno-implicit-fallthrough -DHAVE_BUILD_INFO -D__STDC_FORMAT_MACROS -I/usr/local/opt/berkeley-db@4/include -DMAC_OSX conftest.cpp >&5
- configure:23397: $? = 0
- configure:23426: g++ -std=c++11 -c -g -O2 -Wall -Wextra -Wformat -Wvla -Wformat-security -Wno-unused-parameter -Wno-self-assign -Wno-unused-local-typedef -Wno-deprecated-register -Wno-implicit-fallthrough -DHAVE_BUILD_INFO -D__STDC_FORMAT_MACROS -I/usr/local/opt/berkeley-db@4/include -DMAC_OSX conftest.cpp >&5
- configure:23426: $? = 0
- configure:23469: result: default
- configure:23492: checking for main in -ldb_cxx-4.8
- configure:23511: g++ -std=c++11 -o conftest -g -O2 -Wall -Wextra -Wformat -Wvla -Wformat-security -Wno-unused-parameter -Wno-self-assign -Wno-unused-local-typedef -Wno-deprecated-register -Wno-implicit-fallthrough -DHAVE_BUILD_INFO -D__STDC_FORMAT_MACROS -I/usr/local/opt/berkeley-db@4/include -DMAC_OSX -Wl,-headerpad_max_install_names -Wl,-dead_strip conftest.cpp -ldb_cxx-4.8 -L/usr/local/opt/berkeley-db@4/lib >&5
- conftest.cpp:59:1: warning: all paths through this function will call itself [-Winfinite-recursion]
- {
- ^
- 1 warning generated.
- configure:23511: $? = 0
- configure:23521: result: yes
- configure:23543: checking miniupnpc/miniwget.h usability
- configure:23543: g++ -std=c++11 -c -g -O2 -Wall -Wextra -Wformat -Wvla -Wformat-security -Wno-unused-parameter -Wno-self-assign -Wno-unused-local-typedef -Wno-deprecated-register -Wno-implicit-fallthrough -DHAVE_BUILD_INFO -D__STDC_FORMAT_MACROS -I/usr/local/opt/berkeley-db@4/include -DMAC_OSX conftest.cpp >&5
- configure:23543: $? = 0
- configure:23543: result: yes
- configure:23543: checking miniupnpc/miniwget.h presence
- configure:23543: g++ -std=c++11 -E -DHAVE_BUILD_INFO -D__STDC_FORMAT_MACROS -I/usr/local/opt/berkeley-db@4/include -DMAC_OSX conftest.cpp
- configure:23543: $? = 0
- configure:23543: result: yes
- configure:23543: checking for miniupnpc/miniwget.h
- configure:23543: result: yes
- configure:23548: checking for main in -lminiupnpc
- configure:23567: g++ -std=c++11 -o conftest -g -O2 -Wall -Wextra -Wformat -Wvla -Wformat-security -Wno-unused-parameter -Wno-self-assign -Wno-unused-local-typedef -Wno-deprecated-register -Wno-implicit-fallthrough -DHAVE_BUILD_INFO -D__STDC_FORMAT_MACROS -I/usr/local/opt/berkeley-db@4/include -DMAC_OSX -Wl,-headerpad_max_install_names -Wl,-dead_strip conftest.cpp -lminiupnpc -L/usr/local/opt/berkeley-db@4/lib >&5
- conftest.cpp:60:1: warning: all paths through this function will call itself [-Winfinite-recursion]
- {
- ^
- 1 warning generated.
- configure:23567: $? = 0
- configure:23576: result: yes
- configure:23543: checking miniupnpc/miniupnpc.h usability
- configure:23543: g++ -std=c++11 -c -g -O2 -Wall -Wextra -Wformat -Wvla -Wformat-security -Wno-unused-parameter -Wno-self-assign -Wno-unused-local-typedef -Wno-deprecated-register -Wno-implicit-fallthrough -DHAVE_BUILD_INFO -D__STDC_FORMAT_MACROS -I/usr/local/opt/berkeley-db@4/include -DMAC_OSX conftest.cpp >&5
- configure:23543: $? = 0
- configure:23543: result: yes
- configure:23543: checking miniupnpc/miniupnpc.h presence
- configure:23543: g++ -std=c++11 -E -DHAVE_BUILD_INFO -D__STDC_FORMAT_MACROS -I/usr/local/opt/berkeley-db@4/include -DMAC_OSX conftest.cpp
- configure:23543: $? = 0
- configure:23543: result: yes
- configure:23543: checking for miniupnpc/miniupnpc.h
- configure:23543: result: yes
- configure:23548: checking for main in -lminiupnpc
- configure:23576: result: yes
- configure:23543: checking miniupnpc/upnpcommands.h usability
- configure:23543: g++ -std=c++11 -c -g -O2 -Wall -Wextra -Wformat -Wvla -Wformat-security -Wno-unused-parameter -Wno-self-assign -Wno-unused-local-typedef -Wno-deprecated-register -Wno-implicit-fallthrough -DHAVE_BUILD_INFO -D__STDC_FORMAT_MACROS -I/usr/local/opt/berkeley-db@4/include -DMAC_OSX conftest.cpp >&5
- configure:23543: $? = 0
- configure:23543: result: yes
- configure:23543: checking miniupnpc/upnpcommands.h presence
- configure:23543: g++ -std=c++11 -E -DHAVE_BUILD_INFO -D__STDC_FORMAT_MACROS -I/usr/local/opt/berkeley-db@4/include -DMAC_OSX conftest.cpp
- configure:23543: $? = 0
- configure:23543: result: yes
- configure:23543: checking for miniupnpc/upnpcommands.h
- configure:23543: result: yes
- configure:23548: checking for main in -lminiupnpc
- configure:23576: result: yes
- configure:23543: checking miniupnpc/upnperrors.h usability
- configure:23543: g++ -std=c++11 -c -g -O2 -Wall -Wextra -Wformat -Wvla -Wformat-security -Wno-unused-parameter -Wno-self-assign -Wno-unused-local-typedef -Wno-deprecated-register -Wno-implicit-fallthrough -DHAVE_BUILD_INFO -D__STDC_FORMAT_MACROS -I/usr/local/opt/berkeley-db@4/include -DMAC_OSX conftest.cpp >&5
- configure:23543: $? = 0
- configure:23543: result: yes
- configure:23543: checking miniupnpc/upnperrors.h presence
- configure:23543: g++ -std=c++11 -E -DHAVE_BUILD_INFO -D__STDC_FORMAT_MACROS -I/usr/local/opt/berkeley-db@4/include -DMAC_OSX conftest.cpp
- configure:23543: $? = 0
- configure:23543: result: yes
- configure:23543: checking for miniupnpc/upnperrors.h
- configure:23543: result: yes
- configure:23548: checking for main in -lminiupnpc
- configure:23576: result: yes
- configure:23686: checking for Qt5Core Qt5Gui Qt5Network Qt5Widgets
- configure:23693: $PKG_CONFIG --exists --print-errors "$qt5_modules"
- configure:23696: $? = 0
- configure:23710: $PKG_CONFIG --exists --print-errors "$qt5_modules"
- configure:23713: $? = 0
- configure:23751: result: yes
- configure:24003: checking for Qt5Test
- configure:24010: $PKG_CONFIG --exists --print-errors "${QT_LIB_PREFIX}Test"
- configure:24013: $? = 0
- configure:24027: $PKG_CONFIG --exists --print-errors "${QT_LIB_PREFIX}Test"
- configure:24030: $? = 0
- configure:24068: result: yes
- configure:24075: checking for Qt5DBus
- configure:24082: $PKG_CONFIG --exists --print-errors "${QT_LIB_PREFIX}DBus"
- configure:24085: $? = 0
- configure:24099: $PKG_CONFIG --exists --print-errors "${QT_LIB_PREFIX}DBus"
- configure:24102: $? = 0
- configure:24140: result: yes
- configure:25106: checking for static Qt
- configure:25129: g++ -std=c++11 -c -fPIC -g -O2 -Wall -Wextra -Wformat -Wvla -Wformat-security -Wno-unused-parameter -Wno-self-assign -Wno-unused-local-typedef -Wno-deprecated-register -Wno-implicit-fallthrough -I/usr/local/Cellar/qt/5.9.0/include/QtNetwork -I/usr/local/Cellar/qt/5.9.0/include -I/usr/local/Cellar/qt/5.9.0/include/QtWidgets -I/usr/local/Cellar/qt/5.9.0/include -I/usr/local/Cellar/qt/5.9.0/include/QtGui -I/usr/local/Cellar/qt/5.9.0/include -I/usr/local/Cellar/qt/5.9.0/include/QtCore -I/usr/local/Cellar/qt/5.9.0/include -DHAVE_BUILD_INFO -D__STDC_FORMAT_MACROS -I/usr/local/opt/berkeley-db@4/include -DMAC_OSX conftest.cpp >&5
- conftest.cpp:67:7: error: unknown type name 'choke'
- choke me
- ^
- 1 error generated.
- configure:25129: $? = 1
- configure: failed program was:
- | /* confdefs.h */
- | #define PACKAGE_NAME "Bitcoin Core"
- | #define PACKAGE_TARNAME "bitcoin"
- | #define PACKAGE_VERSION "0.14.99"
- | #define PACKAGE_STRING "Bitcoin Core 0.14.99"
- | #define PACKAGE_BUGREPORT "https://github.com/bitcoin/bitcoin/issues"
- | #define PACKAGE_URL "https://bitcoincore.org/"
- | #define HAVE_CXX11 1
- | #define STDC_HEADERS 1
- | #define HAVE_SYS_TYPES_H 1
- | #define HAVE_SYS_STAT_H 1
- | #define HAVE_STDLIB_H 1
- | #define HAVE_STRING_H 1
- | #define HAVE_MEMORY_H 1
- | #define HAVE_STRINGS_H 1
- | #define HAVE_INTTYPES_H 1
- | #define HAVE_STDINT_H 1
- | #define HAVE_UNISTD_H 1
- | #define HAVE_DLFCN_H 1
- | #define LT_OBJDIR ".libs/"
- | #define HAVE_PTHREAD_PRIO_INHERIT 1
- | #define HAVE_PTHREAD 1
- | #define HAVE_DECL_STRERROR_R 1
- | #define HAVE_STRERROR_R 1
- | #define HAVE_STDIO_H 1
- | #define HAVE_STDLIB_H 1
- | #define HAVE_UNISTD_H 1
- | #define HAVE_STRINGS_H 1
- | #define HAVE_SYS_TYPES_H 1
- | #define HAVE_SYS_STAT_H 1
- | #define HAVE_SYS_SELECT_H 1
- | #define HAVE_DECL_STRNLEN 1
- | #define HAVE_DECL_DAEMON 1
- | #define HAVE_DECL_LE16TOH 0
- | #define HAVE_DECL_LE32TOH 0
- | #define HAVE_DECL_LE64TOH 0
- | #define HAVE_DECL_HTOLE16 0
- | #define HAVE_DECL_HTOLE32 0
- | #define HAVE_DECL_HTOLE64 0
- | #define HAVE_DECL_BE16TOH 0
- | #define HAVE_DECL_BE32TOH 0
- | #define HAVE_DECL_BE64TOH 0
- | #define HAVE_DECL_HTOBE16 0
- | #define HAVE_DECL_HTOBE32 0
- | #define HAVE_DECL_HTOBE64 0
- | #define HAVE_DECL_BSWAP_16 0
- | #define HAVE_DECL_BSWAP_32 0
- | #define HAVE_DECL_BSWAP_64 0
- | #define HAVE_DECL___BUILTIN_CLZ 0
- | #define HAVE_DECL___BUILTIN_CLZL 0
- | #define HAVE_DECL___BUILTIN_CLZLL 0
- | #define HAVE_MSG_DONTWAIT 1
- | #define HAVE_VISIBILITY_ATTRIBUTE 1
- | #define HAVE_MINIUPNPC_MINIWGET_H 1
- | #define HAVE_MINIUPNPC_MINIUPNPC_H 1
- | #define HAVE_MINIUPNPC_UPNPCOMMANDS_H 1
- | #define HAVE_MINIUPNPC_UPNPERRORS_H 1
- | /* end confdefs.h. */
- | #include <QtCore>
- | int
- | main ()
- | {
- |
- | #if defined(QT_STATIC)
- | return 0;
- | #else
- | choke me
- | #endif
- |
- | ;
- | return 0;
- | }
- configure:25137: result: no
- configure:25997: checking whether -fPIE can be used with this Qt config
- configure:26018: g++ -std=c++11 -c -fPIE -g -O2 -Wall -Wextra -Wformat -Wvla -Wformat-security -Wno-unused-parameter -Wno-self-assign -Wno-unused-local-typedef -Wno-deprecated-register -Wno-implicit-fallthrough -I/usr/local/Cellar/qt/5.9.0/include/QtNetwork -I/usr/local/Cellar/qt/5.9.0/include -I/usr/local/Cellar/qt/5.9.0/include/QtWidgets -I/usr/local/Cellar/qt/5.9.0/include -I/usr/local/Cellar/qt/5.9.0/include/QtGui -I/usr/local/Cellar/qt/5.9.0/include -I/usr/local/Cellar/qt/5.9.0/include/QtCore -I/usr/local/Cellar/qt/5.9.0/include -DHAVE_BUILD_INFO -D__STDC_FORMAT_MACROS -I/usr/local/opt/berkeley-db@4/include -DMAC_OSX conftest.cpp >&5
- configure:26018: $? = 0
- configure:26019: result: yes
- configure:26087: checking for moc-qt5
- configure:26120: result: no
- configure:26087: checking for moc5
- configure:26120: result: no
- configure:26087: checking for moc
- configure:26105: found /usr/local/Cellar/qt/5.9.0/bin/moc
- configure:26117: result: /usr/local/Cellar/qt/5.9.0/bin/moc
- configure:26206: checking for uic-qt5
- configure:26239: result: no
- configure:26206: checking for uic5
- configure:26239: result: no
- configure:26206: checking for uic
- configure:26224: found /usr/local/Cellar/qt/5.9.0/bin/uic
- configure:26236: result: /usr/local/Cellar/qt/5.9.0/bin/uic
- configure:26325: checking for rcc-qt5
- configure:26358: result: no
- configure:26325: checking for rcc5
- configure:26358: result: no
- configure:26325: checking for rcc
- configure:26343: found /usr/local/Cellar/qt/5.9.0/bin/rcc
- configure:26355: result: /usr/local/Cellar/qt/5.9.0/bin/rcc
- configure:26444: checking for lrelease-qt5
- configure:26477: result: no
- configure:26444: checking for lrelease5
- configure:26477: result: no
- configure:26444: checking for lrelease
- configure:26462: found /usr/local/Cellar/qt/5.9.0/bin/lrelease
- configure:26474: result: /usr/local/Cellar/qt/5.9.0/bin/lrelease
- configure:26563: checking for lupdate-qt5
- configure:26596: result: no
- configure:26563: checking for lupdate5
- configure:26596: result: no
- configure:26563: checking for lupdate
- configure:26581: found /usr/local/Cellar/qt/5.9.0/bin/lupdate
- configure:26593: result: /usr/local/Cellar/qt/5.9.0/bin/lupdate
- configure:26683: checking whether the linker accepts -framework Foundation -framework ApplicationServices -framework AppKit
- configure:26702: g++ -std=c++11 -o conftest -g -O2 -Wall -Wextra -Wformat -Wvla -Wformat-security -Wno-unused-parameter -Wno-self-assign -Wno-unused-local-typedef -Wno-deprecated-register -Wno-implicit-fallthrough -DHAVE_BUILD_INFO -D__STDC_FORMAT_MACROS -I/usr/local/opt/berkeley-db@4/include -DMAC_OSX -Wl,-headerpad_max_install_names -Wl,-dead_strip -framework Foundation -framework ApplicationServices -framework AppKit conftest.cpp -L/usr/local/opt/berkeley-db@4/lib >&5
- configure:26702: $? = 0
- configure:26712: result: yes
- configure:26778: checking whether to build Bitcoin Core GUI
- configure:26808: result: yes (Qt5)
- configure:26882: checking for boostlib >= 1.47.0
- configure:26967: g++ -std=c++11 -c -g -O2 -Wall -Wextra -Wformat -Wvla -Wformat-security -Wno-unused-parameter -Wno-self-assign -Wno-unused-local-typedef -Wno-deprecated-register -Wno-implicit-fallthrough -DHAVE_BUILD_INFO -D__STDC_FORMAT_MACROS -I/usr/local/opt/berkeley-db@4/include -DMAC_OSX -I/usr/local/include conftest.cpp >&5
- configure:26967: $? = 0
- configure:26969: result: yes
- configure:27156: checking whether the Boost::System library is available
- configure:27181: g++ -std=c++11 -c -DHAVE_BUILD_INFO -D__STDC_FORMAT_MACROS -I/usr/local/opt/berkeley-db@4/include -DMAC_OSX -I/usr/local/include conftest.cpp >&5
- configure:27181: $? = 0
- configure:27196: result: yes
- configure:27212: checking for exit in -lboost_system
- configure:27237: g++ -std=c++11 -o conftest -g -O2 -Wall -Wextra -Wformat -Wvla -Wformat-security -Wno-unused-parameter -Wno-self-assign -Wno-unused-local-typedef -Wno-deprecated-register -Wno-implicit-fallthrough -DHAVE_BUILD_INFO -D__STDC_FORMAT_MACROS -I/usr/local/opt/berkeley-db@4/include -DMAC_OSX -I/usr/local/include -Wl,-headerpad_max_install_names -Wl,-dead_strip -L/usr/local/lib conftest.cpp -lboost_system -L/usr/local/opt/berkeley-db@4/lib >&5
- configure:27237: $? = 0
- configure:27247: result: yes
- configure:27402: checking whether the Boost::Filesystem library is available
- configure:27426: g++ -std=c++11 -c -g -O2 -Wall -Wextra -Wformat -Wvla -Wformat-security -Wno-unused-parameter -Wno-self-assign -Wno-unused-local-typedef -Wno-deprecated-register -Wno-implicit-fallthrough -DHAVE_BUILD_INFO -D__STDC_FORMAT_MACROS -I/usr/local/opt/berkeley-db@4/include -DMAC_OSX -I/usr/local/include conftest.cpp >&5
- configure:27426: $? = 0
- configure:27440: result: yes
- configure:27452: checking for exit in -lboost_filesystem
- configure:27477: g++ -std=c++11 -o conftest -g -O2 -Wall -Wextra -Wformat -Wvla -Wformat-security -Wno-unused-parameter -Wno-self-assign -Wno-unused-local-typedef -Wno-deprecated-register -Wno-implicit-fallthrough -DHAVE_BUILD_INFO -D__STDC_FORMAT_MACROS -I/usr/local/opt/berkeley-db@4/include -DMAC_OSX -I/usr/local/include -Wl,-headerpad_max_install_names -Wl,-dead_strip -L/usr/local/lib conftest.cpp -lboost_filesystem -L/usr/local/opt/berkeley-db@4/lib -lboost_system >&5
- configure:27477: $? = 0
- configure:27487: result: yes
- configure:27637: checking whether the Boost::Program_Options library is available
- configure:27661: g++ -std=c++11 -c -g -O2 -Wall -Wextra -Wformat -Wvla -Wformat-security -Wno-unused-parameter -Wno-self-assign -Wno-unused-local-typedef -Wno-deprecated-register -Wno-implicit-fallthrough -DHAVE_BUILD_INFO -D__STDC_FORMAT_MACROS -I/usr/local/opt/berkeley-db@4/include -DMAC_OSX -I/usr/local/include conftest.cpp >&5
- configure:27661: $? = 0
- configure:27675: result: yes
- configure:27686: checking for exit in -lboost_program_options-mt
- configure:27711: g++ -std=c++11 -o conftest -g -O2 -Wall -Wextra -Wformat -Wvla -Wformat-security -Wno-unused-parameter -Wno-self-assign -Wno-unused-local-typedef -Wno-deprecated-register -Wno-implicit-fallthrough -DHAVE_BUILD_INFO -D__STDC_FORMAT_MACROS -I/usr/local/opt/berkeley-db@4/include -DMAC_OSX -I/usr/local/include -Wl,-headerpad_max_install_names -Wl,-dead_strip -L/usr/local/lib conftest.cpp -lboost_program_options-mt -L/usr/local/opt/berkeley-db@4/lib >&5
- configure:27711: $? = 0
- configure:27721: result: yes
- configure:27864: checking whether the Boost::Thread library is available
- configure:27896: g++ -std=c++11 -c -pthread -g -O2 -Wall -Wextra -Wformat -Wvla -Wformat-security -Wno-unused-parameter -Wno-self-assign -Wno-unused-local-typedef -Wno-deprecated-register -Wno-implicit-fallthrough -DHAVE_BUILD_INFO -D__STDC_FORMAT_MACROS -I/usr/local/opt/berkeley-db@4/include -DMAC_OSX -I/usr/local/include conftest.cpp >&5
- configure:27896: $? = 0
- configure:27911: result: yes
- configure:27941: checking for exit in -lboost_thread-mt
- configure:27966: g++ -std=c++11 -o conftest -g -O2 -Wall -Wextra -Wformat -Wvla -Wformat-security -Wno-unused-parameter -Wno-self-assign -Wno-unused-local-typedef -Wno-deprecated-register -Wno-implicit-fallthrough -DHAVE_BUILD_INFO -D__STDC_FORMAT_MACROS -I/usr/local/opt/berkeley-db@4/include -DMAC_OSX -I/usr/local/include -Wl,-headerpad_max_install_names -Wl,-dead_strip -L/usr/local/lib conftest.cpp -lboost_thread-mt -L/usr/local/opt/berkeley-db@4/lib >&5
- configure:27966: $? = 0
- configure:27976: result: yes
- configure:28136: checking whether the Boost::Chrono library is available
- configure:28160: g++ -std=c++11 -c -g -O2 -Wall -Wextra -Wformat -Wvla -Wformat-security -Wno-unused-parameter -Wno-self-assign -Wno-unused-local-typedef -Wno-deprecated-register -Wno-implicit-fallthrough -DHAVE_BUILD_INFO -D__STDC_FORMAT_MACROS -I/usr/local/opt/berkeley-db@4/include -DMAC_OSX -pthread -I/usr/local/include conftest.cpp >&5
- configure:28160: $? = 0
- configure:28175: result: yes
- configure:28191: checking for exit in -lboost_chrono-mt
- configure:28216: g++ -std=c++11 -o conftest -g -O2 -Wall -Wextra -Wformat -Wvla -Wformat-security -Wno-unused-parameter -Wno-self-assign -Wno-unused-local-typedef -Wno-deprecated-register -Wno-implicit-fallthrough -DHAVE_BUILD_INFO -D__STDC_FORMAT_MACROS -I/usr/local/opt/berkeley-db@4/include -DMAC_OSX -pthread -I/usr/local/include -Wl,-headerpad_max_install_names -Wl,-dead_strip -L/usr/local/lib conftest.cpp -lboost_chrono-mt -L/usr/local/opt/berkeley-db@4/lib >&5
- configure:28216: $? = 0
- configure:28226: result: yes
- configure:28468: checking whether the Boost::Unit_Test_Framework library is available
- configure:28491: g++ -std=c++11 -c -g -O2 -Wall -Wextra -Wformat -Wvla -Wformat-security -Wno-unused-parameter -Wno-self-assign -Wno-unused-local-typedef -Wno-deprecated-register -Wno-implicit-fallthrough -DHAVE_BUILD_INFO -D__STDC_FORMAT_MACROS -I/usr/local/opt/berkeley-db@4/include -DMAC_OSX -DBOOST_SP_USE_STD_ATOMIC -DBOOST_AC_USE_STD_ATOMIC -pthread -I/usr/local/include conftest.cpp >&5
- conftest.cpp:70:21: warning: unused variable 'test' [-Wunused-variable]
- test_suite* test= BOOST_TEST_SUITE( "Unit test example 1" ); return 0;
- ^
- 1 warning generated.
- configure:28491: $? = 0
- configure:28505: result: yes
- configure:28617: checking for dynamic linked boost test
- configure:28632: g++ -std=c++11 -o conftest -g -O2 -Wall -Wextra -Wformat -Wvla -Wformat-security -Wno-unused-parameter -Wno-self-assign -Wno-unused-local-typedef -Wno-deprecated-register -Wno-implicit-fallthrough -DHAVE_BUILD_INFO -D__STDC_FORMAT_MACROS -I/usr/local/opt/berkeley-db@4/include -DMAC_OSX -DBOOST_SP_USE_STD_ATOMIC -DBOOST_AC_USE_STD_ATOMIC -pthread -I/usr/local/include -Wl,-headerpad_max_install_names -Wl,-dead_strip conftest.cpp -L/usr/local/opt/berkeley-db@4/lib -L/usr/local/lib -lboost_unit_test_framework-mt >&5
- configure:28632: $? = 0
- configure:28633: result: yes
- configure:28659: checking for mismatched boost c++11 scoped enums
- configure:28687: g++ -std=c++11 -o conftest -g -O2 -Wall -Wextra -Wformat -Wvla -Wformat-security -Wno-unused-parameter -Wno-self-assign -Wno-unused-local-typedef -Wno-deprecated-register -Wno-implicit-fallthrough -DHAVE_BUILD_INFO -D__STDC_FORMAT_MACROS -I/usr/local/opt/berkeley-db@4/include -DMAC_OSX -DBOOST_SP_USE_STD_ATOMIC -DBOOST_AC_USE_STD_ATOMIC -pthread -I/usr/local/include -Wl,-headerpad_max_install_names -Wl,-dead_strip conftest.cpp -L/usr/local/lib -lboost_system -lboost_filesystem -lboost_program_options-mt -lboost_thread-mt -lboost_chrono-mt -L/usr/local/opt/berkeley-db@4/lib >&5
- conftest.cpp:83:5: error: use of undeclared identifier 'choke'
- choke;
- ^
- 1 error generated.
- configure:28687: $? = 1
- configure: failed program was:
- | /* confdefs.h */
- | #define PACKAGE_NAME "Bitcoin Core"
- | #define PACKAGE_TARNAME "bitcoin"
- | #define PACKAGE_VERSION "0.14.99"
- | #define PACKAGE_STRING "Bitcoin Core 0.14.99"
- | #define PACKAGE_BUGREPORT "https://github.com/bitcoin/bitcoin/issues"
- | #define PACKAGE_URL "https://bitcoincore.org/"
- | #define HAVE_CXX11 1
- | #define STDC_HEADERS 1
- | #define HAVE_SYS_TYPES_H 1
- | #define HAVE_SYS_STAT_H 1
- | #define HAVE_STDLIB_H 1
- | #define HAVE_STRING_H 1
- | #define HAVE_MEMORY_H 1
- | #define HAVE_STRINGS_H 1
- | #define HAVE_INTTYPES_H 1
- | #define HAVE_STDINT_H 1
- | #define HAVE_UNISTD_H 1
- | #define HAVE_DLFCN_H 1
- | #define LT_OBJDIR ".libs/"
- | #define HAVE_PTHREAD_PRIO_INHERIT 1
- | #define HAVE_PTHREAD 1
- | #define HAVE_DECL_STRERROR_R 1
- | #define HAVE_STRERROR_R 1
- | #define HAVE_STDIO_H 1
- | #define HAVE_STDLIB_H 1
- | #define HAVE_UNISTD_H 1
- | #define HAVE_STRINGS_H 1
- | #define HAVE_SYS_TYPES_H 1
- | #define HAVE_SYS_STAT_H 1
- | #define HAVE_SYS_SELECT_H 1
- | #define HAVE_DECL_STRNLEN 1
- | #define HAVE_DECL_DAEMON 1
- | #define HAVE_DECL_LE16TOH 0
- | #define HAVE_DECL_LE32TOH 0
- | #define HAVE_DECL_LE64TOH 0
- | #define HAVE_DECL_HTOLE16 0
- | #define HAVE_DECL_HTOLE32 0
- | #define HAVE_DECL_HTOLE64 0
- | #define HAVE_DECL_BE16TOH 0
- | #define HAVE_DECL_BE32TOH 0
- | #define HAVE_DECL_BE64TOH 0
- | #define HAVE_DECL_HTOBE16 0
- | #define HAVE_DECL_HTOBE32 0
- | #define HAVE_DECL_HTOBE64 0
- | #define HAVE_DECL_BSWAP_16 0
- | #define HAVE_DECL_BSWAP_32 0
- | #define HAVE_DECL_BSWAP_64 0
- | #define HAVE_DECL___BUILTIN_CLZ 0
- | #define HAVE_DECL___BUILTIN_CLZL 0
- | #define HAVE_DECL___BUILTIN_CLZLL 0
- | #define HAVE_MSG_DONTWAIT 1
- | #define HAVE_VISIBILITY_ATTRIBUTE 1
- | #define HAVE_MINIUPNPC_MINIWGET_H 1
- | #define HAVE_MINIUPNPC_MINIUPNPC_H 1
- | #define HAVE_MINIUPNPC_UPNPCOMMANDS_H 1
- | #define HAVE_MINIUPNPC_UPNPERRORS_H 1
- | #define HAVE_BOOST /**/
- | #define HAVE_BOOST_SYSTEM /**/
- | #define HAVE_BOOST_FILESYSTEM /**/
- | #define HAVE_BOOST_PROGRAM_OPTIONS /**/
- | #define HAVE_BOOST_THREAD /**/
- | #define HAVE_BOOST_CHRONO /**/
- | #define HAVE_BOOST_UNIT_TEST_FRAMEWORK /**/
- | /* end confdefs.h. */
- |
- | #include "boost/config.hpp"
- | #include "boost/version.hpp"
- | #if !defined(BOOST_NO_SCOPED_ENUMS) && !defined(BOOST_NO_CXX11_SCOPED_ENUMS) && BOOST_VERSION < 105700
- | #define BOOST_NO_SCOPED_ENUMS
- | #define BOOST_NO_CXX11_SCOPED_ENUMS
- | #define CHECK
- | #endif
- | #include "boost/filesystem.hpp"
- |
- | int
- | main ()
- | {
- |
- | #if defined(CHECK)
- | boost::filesystem::copy_file("foo", "bar");
- | #else
- | choke;
- | #endif
- |
- | ;
- | return 0;
- | }
- configure:28691: result: ok
- configure:28723: g++ -std=c++11 -o conftest -g -O2 -Wall -Wextra -Wformat -Wvla -Wformat-security -Wno-unused-parameter -Wno-self-assign -Wno-unused-local-typedef -Wno-deprecated-register -Wno-implicit-fallthrough -DHAVE_BUILD_INFO -D__STDC_FORMAT_MACROS -I/usr/local/opt/berkeley-db@4/include -DMAC_OSX -DBOOST_SP_USE_STD_ATOMIC -DBOOST_AC_USE_STD_ATOMIC -pthread -I/usr/local/include -Wl,-headerpad_max_install_names -Wl,-dead_strip conftest.cpp -L/usr/local/lib -lboost_system -lboost_filesystem -lboost_program_options-mt -lboost_thread-mt -lboost_chrono-mt -L/usr/local/opt/berkeley-db@4/lib >&5
- configure:28723: $? = 0
- configure:28785: checking for libssl
- configure:28792: $PKG_CONFIG --exists --print-errors "libssl"
- configure:28795: $? = 0
- configure:28809: $PKG_CONFIG --exists --print-errors "libssl"
- configure:28812: $? = 0
- configure:28850: result: yes
- configure:28856: checking for libcrypto
- configure:28863: $PKG_CONFIG --exists --print-errors "libcrypto"
- configure:28866: $? = 0
- configure:28880: $PKG_CONFIG --exists --print-errors "libcrypto"
- configure:28883: $? = 0
- configure:28921: result: yes
- configure:28930: checking for protobuf
- configure:28937: $PKG_CONFIG --exists --print-errors "protobuf"
- Package protobuf was not found in the pkg-config search path.
- Perhaps you should add the directory containing `protobuf.pc'
- to the PKG_CONFIG_PATH environment variable
- No package 'protobuf' found
- configure:28940: $? = 1
- configure:28954: $PKG_CONFIG --exists --print-errors "protobuf"
- Package protobuf was not found in the pkg-config search path.
- Perhaps you should add the directory containing `protobuf.pc'
- to the PKG_CONFIG_PATH environment variable
- No package 'protobuf' found
- configure:28957: $? = 1
- configure:28971: result: no
- No package 'protobuf' found
- configure:28990: WARNING: libprotobuf not found; bitcoin-qt frontend will not be built
- configure:29110: checking for libevent
- configure:29117: $PKG_CONFIG --exists --print-errors "libevent"
- configure:29120: $? = 0
- configure:29134: $PKG_CONFIG --exists --print-errors "libevent"
- configure:29137: $? = 0
- configure:29175: result: yes
- configure:29182: checking for libevent_pthreads
- configure:29189: $PKG_CONFIG --exists --print-errors "libevent_pthreads"
- configure:29192: $? = 0
- configure:29206: $PKG_CONFIG --exists --print-errors "libevent_pthreads"
- configure:29209: $? = 0
- configure:29247: result: yes
- configure:29257: checking for libzmq >= 4
- configure:29264: $PKG_CONFIG --exists --print-errors "libzmq >= 4"
- Package libzmq was not found in the pkg-config search path.
- Perhaps you should add the directory containing `libzmq.pc'
- to the PKG_CONFIG_PATH environment variable
- No package 'libzmq' found
- configure:29267: $? = 1
- configure:29281: $PKG_CONFIG --exists --print-errors "libzmq >= 4"
- Package libzmq was not found in the pkg-config search path.
- Perhaps you should add the directory containing `libzmq.pc'
- to the PKG_CONFIG_PATH environment variable
- No package 'libzmq' found
- configure:29284: $? = 1
- configure:29298: result: no
- No package 'libzmq' found
- configure:29317: WARNING: libzmq version 4.x or greater not found, disabling
- configure:29725: checking whether EVP_MD_CTX_new is declared
- configure:29725: g++ -std=c++11 -c -g -O2 -Wall -Wextra -Wformat -Wvla -Wformat-security -Wno-unused-parameter -Wno-self-assign -Wno-unused-local-typedef -Wno-deprecated-register -Wno-implicit-fallthrough -I/usr/local/Cellar/openssl/1.0.2l/include -I/usr/local/Cellar/openssl/1.0.2l/include -DHAVE_BUILD_INFO -D__STDC_FORMAT_MACROS -I/usr/local/opt/berkeley-db@4/include -DMAC_OSX conftest.cpp >&5
- conftest.cpp:109:10: error: use of undeclared identifier 'EVP_MD_CTX_new'
- (void) EVP_MD_CTX_new;
- ^
- 1 error generated.
- configure:29725: $? = 1
- configure: failed program was:
- | /* confdefs.h */
- | #define PACKAGE_NAME "Bitcoin Core"
- | #define PACKAGE_TARNAME "bitcoin"
- | #define PACKAGE_VERSION "0.14.99"
- | #define PACKAGE_STRING "Bitcoin Core 0.14.99"
- | #define PACKAGE_BUGREPORT "https://github.com/bitcoin/bitcoin/issues"
- | #define PACKAGE_URL "https://bitcoincore.org/"
- | #define HAVE_CXX11 1
- | #define STDC_HEADERS 1
- | #define HAVE_SYS_TYPES_H 1
- | #define HAVE_SYS_STAT_H 1
- | #define HAVE_STDLIB_H 1
- | #define HAVE_STRING_H 1
- | #define HAVE_MEMORY_H 1
- | #define HAVE_STRINGS_H 1
- | #define HAVE_INTTYPES_H 1
- | #define HAVE_STDINT_H 1
- | #define HAVE_UNISTD_H 1
- | #define HAVE_DLFCN_H 1
- | #define LT_OBJDIR ".libs/"
- | #define HAVE_PTHREAD_PRIO_INHERIT 1
- | #define HAVE_PTHREAD 1
- | #define HAVE_DECL_STRERROR_R 1
- | #define HAVE_STRERROR_R 1
- | #define HAVE_STDIO_H 1
- | #define HAVE_STDLIB_H 1
- | #define HAVE_UNISTD_H 1
- | #define HAVE_STRINGS_H 1
- | #define HAVE_SYS_TYPES_H 1
- | #define HAVE_SYS_STAT_H 1
- | #define HAVE_SYS_SELECT_H 1
- | #define HAVE_DECL_STRNLEN 1
- | #define HAVE_DECL_DAEMON 1
- | #define HAVE_DECL_LE16TOH 0
- | #define HAVE_DECL_LE32TOH 0
- | #define HAVE_DECL_LE64TOH 0
- | #define HAVE_DECL_HTOLE16 0
- | #define HAVE_DECL_HTOLE32 0
- | #define HAVE_DECL_HTOLE64 0
- | #define HAVE_DECL_BE16TOH 0
- | #define HAVE_DECL_BE32TOH 0
- | #define HAVE_DECL_BE64TOH 0
- | #define HAVE_DECL_HTOBE16 0
- | #define HAVE_DECL_HTOBE32 0
- | #define HAVE_DECL_HTOBE64 0
- | #define HAVE_DECL_BSWAP_16 0
- | #define HAVE_DECL_BSWAP_32 0
- | #define HAVE_DECL_BSWAP_64 0
- | #define HAVE_DECL___BUILTIN_CLZ 0
- | #define HAVE_DECL___BUILTIN_CLZL 0
- | #define HAVE_DECL___BUILTIN_CLZLL 0
- | #define HAVE_MSG_DONTWAIT 1
- | #define HAVE_VISIBILITY_ATTRIBUTE 1
- | #define HAVE_MINIUPNPC_MINIWGET_H 1
- | #define HAVE_MINIUPNPC_MINIUPNPC_H 1
- | #define HAVE_MINIUPNPC_UPNPCOMMANDS_H 1
- | #define HAVE_MINIUPNPC_UPNPERRORS_H 1
- | #define HAVE_BOOST /**/
- | #define HAVE_BOOST_SYSTEM /**/
- | #define HAVE_BOOST_FILESYSTEM /**/
- | #define HAVE_BOOST_PROGRAM_OPTIONS /**/
- | #define HAVE_BOOST_THREAD /**/
- | #define HAVE_BOOST_CHRONO /**/
- | #define HAVE_BOOST_UNIT_TEST_FRAMEWORK /**/
- | #define HAVE_WORKING_BOOST_SLEEP_FOR 1
- | #define ENABLE_ZMQ 0
- | /* end confdefs.h. */
- | #include <stdio.h>
- | #ifdef HAVE_SYS_TYPES_H
- | # include <sys/types.h>
- | #endif
- | #ifdef HAVE_SYS_STAT_H
- | # include <sys/stat.h>
- | #endif
- | #ifdef STDC_HEADERS
- | # include <stdlib.h>
- | # include <stddef.h>
- | #else
- | # ifdef HAVE_STDLIB_H
- | # include <stdlib.h>
- | # endif
- | #endif
- | #ifdef HAVE_STRING_H
- | # if !defined STDC_HEADERS && defined HAVE_MEMORY_H
- | # include <memory.h>
- | # endif
- | # include <string.h>
- | #endif
- | #ifdef HAVE_STRINGS_H
- | # include <strings.h>
- | #endif
- | #ifdef HAVE_INTTYPES_H
- | # include <inttypes.h>
- | #endif
- | #ifdef HAVE_STDINT_H
- | # include <stdint.h>
- | #endif
- | #ifdef HAVE_UNISTD_H
- | # include <unistd.h>
- | #endif
- | #include <openssl/x509_vfy.h>
- |
- |
- | int
- | main ()
- | {
- | #ifndef EVP_MD_CTX_new
- | #ifdef __cplusplus
- | (void) EVP_MD_CTX_new;
- | #else
- | (void) EVP_MD_CTX_new;
- | #endif
- | #endif
- |
- | ;
- | return 0;
- | }
- configure:29725: result: no
- configure:30025: checking whether to build bitcoind
- configure:30035: result: yes
- configure:30038: checking whether to build utils (bitcoin-cli bitcoin-tx)
- configure:30048: result: yes
- configure:30051: checking whether to build libraries
- configure:30068: result: yes
- configure:30079: checking if ccache should be used
- configure:30092: result: no
- configure:30133: checking if wallet should be enabled
- configure:30136: result: yes
- configure:30149: checking whether to build with support for UPnP
- configure:30159: result: yes
- configure:30161: checking whether to build with UPnP enabled by default
- configure:30169: result: no
- configure:30245: checking whether to build test_bitcoin
- configure:30248: result: yes
- configure:30257: checking whether to reduce exports
- configure:30263: result: no
- configure:30601: checking that generated files are newer than configure
- configure:30607: result: done
- configure:30723: creating ./config.status
- ## ---------------------- ##
- ## Running config.status. ##
- ## ---------------------- ##
- This file was extended by Bitcoin Core config.status 0.14.99, which was
- generated by GNU Autoconf 2.69. Invocation command line was
- CONFIG_FILES =
- CONFIG_HEADERS =
- CONFIG_LINKS =
- CONFIG_COMMANDS =
- $ ./config.status
- on Daniels-MBP
- config.status:1400: creating libbitcoinconsensus.pc
- config.status:1400: creating Makefile
- config.status:1400: creating src/Makefile
- config.status:1400: creating doc/man/Makefile
- config.status:1400: creating share/setup.nsi
- config.status:1400: creating share/qt/Info.plist
- config.status:1400: creating test/config.ini
- config.status:1400: creating contrib/devtools/split-debug.sh
- config.status:1400: creating doc/Doxyfile
- config.status:1400: creating src/config/bitcoin-config.h
- config.status:1660: executing depfiles commands
- config.status:1660: executing libtool commands
- configure:33245: === configuring in src/univalue (/Users/dwasyluk/Development/bitcoin/src/univalue)
- configure:33308: running /bin/sh ./configure --disable-option-checking '--prefix=/usr/local' '--disable-shared' '--with-pic' '--with-bignum=no' '--enable-module-recovery' --cache-file=/dev/null --srcdir=.
- configure:33245: === configuring in src/secp256k1 (/Users/dwasyluk/Development/bitcoin/src/secp256k1)
- configure:33308: running /bin/sh ./configure --disable-option-checking '--prefix=/usr/local' '--disable-shared' '--with-pic' '--with-bignum=no' '--enable-module-recovery' --cache-file=/dev/null --srcdir=.
- ## ---------------- ##
- ## Cache variables. ##
- ## ---------------- ##
- ac_cv_build=x86_64-apple-darwin16.6.0
- ac_cv_c_bigendian=no
- ac_cv_c_compiler_gnu=yes
- ac_cv_cxx_compiler_gnu=yes
- ac_cv_env_BDB_CFLAGS_set=
- ac_cv_env_BDB_CFLAGS_value=
- ac_cv_env_BDB_LIBS_set=
- ac_cv_env_BDB_LIBS_value=
- ac_cv_env_CCC_set=
- ac_cv_env_CCC_value=
- ac_cv_env_CC_set=
- ac_cv_env_CC_value=
- ac_cv_env_CFLAGS_set=
- ac_cv_env_CFLAGS_value=
- ac_cv_env_CPPFLAGS_set=
- ac_cv_env_CPPFLAGS_value=
- ac_cv_env_CPP_set=
- ac_cv_env_CPP_value=
- ac_cv_env_CRYPTO_CFLAGS_set=
- ac_cv_env_CRYPTO_CFLAGS_value=
- ac_cv_env_CRYPTO_LIBS_set=
- ac_cv_env_CRYPTO_LIBS_value=
- ac_cv_env_CXXCPP_set=
- ac_cv_env_CXXCPP_value=
- ac_cv_env_CXXFLAGS_set=
- ac_cv_env_CXXFLAGS_value=
- ac_cv_env_CXX_set=
- ac_cv_env_CXX_value=
- ac_cv_env_EVENT_CFLAGS_set=
- ac_cv_env_EVENT_CFLAGS_value=
- ac_cv_env_EVENT_LIBS_set=
- ac_cv_env_EVENT_LIBS_value=
- ac_cv_env_EVENT_PTHREADS_CFLAGS_set=
- ac_cv_env_EVENT_PTHREADS_CFLAGS_value=
- ac_cv_env_EVENT_PTHREADS_LIBS_set=
- ac_cv_env_EVENT_PTHREADS_LIBS_value=
- ac_cv_env_LDFLAGS_set=
- ac_cv_env_LDFLAGS_value=
- ac_cv_env_LIBS_set=
- ac_cv_env_LIBS_value=
- ac_cv_env_LT_SYS_LIBRARY_PATH_set=
- ac_cv_env_LT_SYS_LIBRARY_PATH_value=
- ac_cv_env_OBJCXXFLAGS_set=
- ac_cv_env_OBJCXXFLAGS_value=
- ac_cv_env_OBJCXX_set=
- ac_cv_env_OBJCXX_value=
- ac_cv_env_PKG_CONFIG_LIBDIR_set=
- ac_cv_env_PKG_CONFIG_LIBDIR_value=
- ac_cv_env_PKG_CONFIG_PATH_set=
- ac_cv_env_PKG_CONFIG_PATH_value=
- ac_cv_env_PKG_CONFIG_set=
- ac_cv_env_PKG_CONFIG_value=
- ac_cv_env_PROTOBUF_CFLAGS_set=
- ac_cv_env_PROTOBUF_CFLAGS_value=
- ac_cv_env_PROTOBUF_LIBS_set=
- ac_cv_env_PROTOBUF_LIBS_value=
- ac_cv_env_PYTHONPATH_set=
- ac_cv_env_PYTHONPATH_value=
- ac_cv_env_QR_CFLAGS_set=
- ac_cv_env_QR_CFLAGS_value=
- ac_cv_env_QR_LIBS_set=
- ac_cv_env_QR_LIBS_value=
- ac_cv_env_QT4_CFLAGS_set=
- ac_cv_env_QT4_CFLAGS_value=
- ac_cv_env_QT4_LIBS_set=
- ac_cv_env_QT4_LIBS_value=
- ac_cv_env_QT5_CFLAGS_set=
- ac_cv_env_QT5_CFLAGS_value=
- ac_cv_env_QT5_LIBS_set=
- ac_cv_env_QT5_LIBS_value=
- ac_cv_env_QTPLATFORM_CFLAGS_set=
- ac_cv_env_QTPLATFORM_CFLAGS_value=
- ac_cv_env_QTPLATFORM_LIBS_set=
- ac_cv_env_QTPLATFORM_LIBS_value=
- ac_cv_env_QTPRINT_CFLAGS_set=
- ac_cv_env_QTPRINT_CFLAGS_value=
- ac_cv_env_QTPRINT_LIBS_set=
- ac_cv_env_QTPRINT_LIBS_value=
- ac_cv_env_QTXCBQPA_CFLAGS_set=
- ac_cv_env_QTXCBQPA_CFLAGS_value=
- ac_cv_env_QTXCBQPA_LIBS_set=
- ac_cv_env_QTXCBQPA_LIBS_value=
- ac_cv_env_QT_DBUS_CFLAGS_set=
- ac_cv_env_QT_DBUS_CFLAGS_value=
- ac_cv_env_QT_DBUS_LIBS_set=
- ac_cv_env_QT_DBUS_LIBS_value=
- ac_cv_env_QT_TEST_CFLAGS_set=
- ac_cv_env_QT_TEST_CFLAGS_value=
- ac_cv_env_QT_TEST_LIBS_set=
- ac_cv_env_QT_TEST_LIBS_value=
- ac_cv_env_SSL_CFLAGS_set=
- ac_cv_env_SSL_CFLAGS_value=
- ac_cv_env_SSL_LIBS_set=
- ac_cv_env_SSL_LIBS_value=
- ac_cv_env_UNIVALUE_CFLAGS_set=
- ac_cv_env_UNIVALUE_CFLAGS_value=
- ac_cv_env_UNIVALUE_LIBS_set=
- ac_cv_env_UNIVALUE_LIBS_value=
- ac_cv_env_X11XCB_CFLAGS_set=
- ac_cv_env_X11XCB_CFLAGS_value=
- ac_cv_env_X11XCB_LIBS_set=
- ac_cv_env_X11XCB_LIBS_value=
- ac_cv_env_ZMQ_CFLAGS_set=
- ac_cv_env_ZMQ_CFLAGS_value=
- ac_cv_env_ZMQ_LIBS_set=
- ac_cv_env_ZMQ_LIBS_value=
- ac_cv_env_build_alias_set=
- ac_cv_env_build_alias_value=
- ac_cv_env_host_alias_set=
- ac_cv_env_host_alias_value=
- ac_cv_env_target_alias_set=
- ac_cv_env_target_alias_value=
- ac_cv_func_strerror_r=yes
- ac_cv_func_strerror_r_char_p=no
- ac_cv_have_decl_EVP_MD_CTX_new=no
- ac_cv_have_decl___builtin_clz=no
- ac_cv_have_decl___builtin_clzl=no
- ac_cv_have_decl___builtin_clzll=no
- ac_cv_have_decl_be16toh=no
- ac_cv_have_decl_be32toh=no
- ac_cv_have_decl_be64toh=no
- ac_cv_have_decl_bswap_16=no
- ac_cv_have_decl_bswap_32=no
- ac_cv_have_decl_bswap_64=no
- ac_cv_have_decl_daemon=yes
- ac_cv_have_decl_htobe16=no
- ac_cv_have_decl_htobe32=no
- ac_cv_have_decl_htobe64=no
- ac_cv_have_decl_htole16=no
- ac_cv_have_decl_htole32=no
- ac_cv_have_decl_htole64=no
- ac_cv_have_decl_le16toh=no
- ac_cv_have_decl_le32toh=no
- ac_cv_have_decl_le64toh=no
- ac_cv_have_decl_strerror_r=yes
- ac_cv_have_decl_strnlen=yes
- ac_cv_header_byteswap_h=no
- ac_cv_header_dlfcn_h=yes
- ac_cv_header_endian_h=no
- ac_cv_header_inttypes_h=yes
- ac_cv_header_memory_h=yes
- ac_cv_header_miniupnpc_miniupnpc_h=yes
- ac_cv_header_miniupnpc_miniwget_h=yes
- ac_cv_header_miniupnpc_upnpcommands_h=yes
- ac_cv_header_miniupnpc_upnperrors_h=yes
- ac_cv_header_stdc=yes
- ac_cv_header_stdint_h=yes
- ac_cv_header_stdio_h=yes
- ac_cv_header_stdlib_h=yes
- ac_cv_header_string_h=yes
- ac_cv_header_strings_h=yes
- ac_cv_header_sys_endian_h=no
- ac_cv_header_sys_prctl_h=no
- ac_cv_header_sys_select_h=yes
- ac_cv_header_sys_stat_h=yes
- ac_cv_header_sys_types_h=yes
- ac_cv_header_unistd_h=yes
- ac_cv_host=x86_64-apple-darwin16.6.0
- ac_cv_lib_boost_chrono_mt___exit=yes
- ac_cv_lib_boost_filesystem___exit=yes
- ac_cv_lib_boost_program_options_mt___exit=yes
- ac_cv_lib_boost_system___exit=yes
- ac_cv_lib_boost_thread_mt___exit=yes
- ac_cv_lib_db_cxx_4_8___main=yes
- ac_cv_lib_miniupnpc_main=yes
- ac_cv_objcxx_compiler_gnu=yes
- ac_cv_objext=o
- ac_cv_path_EGREP='/usr/bin/grep -E'
- ac_cv_path_FGREP='/usr/bin/grep -F'
- ac_cv_path_GIT=/usr/bin/git
- ac_cv_path_GREP=/usr/bin/grep
- ac_cv_path_HEXDUMP=/usr/bin/hexdump
- ac_cv_path_LRELEASE=/usr/local/Cellar/qt/5.9.0/bin/lrelease
- ac_cv_path_LUPDATE=/usr/local/Cellar/qt/5.9.0/bin/lupdate
- ac_cv_path_MOC=/usr/local/Cellar/qt/5.9.0/bin/moc
- ac_cv_path_PYTHON=/usr/local/bin/python2.7
- ac_cv_path_RCC=/usr/local/Cellar/qt/5.9.0/bin/rcc
- ac_cv_path_RSVG_CONVERT=/usr/local/bin/rsvg-convert
- ac_cv_path_SED=/usr/bin/sed
- ac_cv_path_UIC=/usr/local/Cellar/qt/5.9.0/bin/uic
- ac_cv_path_ac_pt_AR=/usr/bin/ar
- ac_cv_path_ac_pt_CPPFILT=/usr/bin/c++filt
- ac_cv_path_ac_pt_GCOV=/usr/bin/gcov
- ac_cv_path_ac_pt_PKG_CONFIG=/usr/local/bin/pkg-config
- ac_cv_path_ac_pt_RANLIB=/usr/bin/ranlib
- ac_cv_path_ac_pt_STRIP=/usr/bin/strip
- ac_cv_path_install='/usr/bin/install -c'
- ac_cv_path_lt_DD=/bin/dd
- ac_cv_prog_AWK=awk
- ac_cv_prog_BREW=brew
- ac_cv_prog_CPP='gcc -E'
- ac_cv_prog_CXXCPP='g++ -std=c++11 -E'
- ac_cv_prog_ac_ct_AR=ar
- ac_cv_prog_ac_ct_CC=gcc
- ac_cv_prog_ac_ct_CXX=g++
- ac_cv_prog_ac_ct_DSYMUTIL=dsymutil
- ac_cv_prog_ac_ct_LIPO=lipo
- ac_cv_prog_ac_ct_NMEDIT=nmedit
- ac_cv_prog_ac_ct_OBJDUMP=objdump
- ac_cv_prog_ac_ct_OTOOL=otool
- ac_cv_prog_ac_ct_RANLIB=ranlib
- ac_cv_prog_ac_ct_STRIP=strip
- ac_cv_prog_cc_c89=
- ac_cv_prog_cc_g=yes
- ac_cv_prog_cxx_g=yes
- ac_cv_prog_make_make_set=yes
- ac_cv_prog_objcxx_g=yes
- ac_cv_search_clock_gettime='none required'
- ac_cv_sys_file_offset_bits=no
- ac_cv_sys_largefile_CC=no
- am_cv_CC_dependencies_compiler_type=gcc3
- am_cv_CXX_dependencies_compiler_type=gcc3
- am_cv_OBJCXX_dependencies_compiler_type=gcc3
- am_cv_make_support_nested_variables=yes
- am_cv_prog_cc_c_o=yes
- ax_cv_PTHREAD_CLANG=yes
- ax_cv_PTHREAD_CLANG_NO_WARN_FLAG=-Qunused-arguments
- ax_cv_PTHREAD_JOINABLE_ATTR=PTHREAD_CREATE_JOINABLE
- ax_cv_PTHREAD_PRIO_INHERIT=yes
- ax_cv_PTHREAD_SPECIAL_FLAGS=no
- ax_cv_boost_chrono=yes
- ax_cv_boost_filesystem=yes
- ax_cv_boost_program_options=yes
- ax_cv_boost_system=yes
- ax_cv_boost_thread=yes
- ax_cv_boost_unit_test_framework=yes
- ax_cv_check_cxxcppflags___D_FORTIFY_SOURCE_2=yes
- ax_cv_check_cxxcppflags___U_FORTIFY_SOURCE=yes
- ax_cv_check_cxxflags__Wall=yes
- ax_cv_check_cxxflags__Wdeprecated_register=yes
- ax_cv_check_cxxflags__Wextra=yes
- ax_cv_check_cxxflags__Wformat=yes
- ax_cv_check_cxxflags__Wformat_security=yes
- ax_cv_check_cxxflags__Wimplicit_fallthrough=yes
- ax_cv_check_cxxflags__Wself_assign=yes
- ax_cv_check_cxxflags__Wunused_local_typedef=yes
- ax_cv_check_cxxflags__Wunused_parameter=yes
- ax_cv_check_cxxflags__Wvla=yes
- ax_cv_check_cxxflags___Werror=yes
- ax_cv_check_cxxflags___Wstack_protector=yes
- ax_cv_check_cxxflags___fPIC=yes
- ax_cv_check_cxxflags___fPIE=yes
- ax_cv_check_cxxflags___fstack_protector_all=yes
- ax_cv_check_cxxflags__msse4_2=yes
- ax_cv_check_ldflags___Wl___dynamicbase=no
- ax_cv_check_ldflags___Wl___high_entropy_va=no
- ax_cv_check_ldflags___Wl___large_address_aware=no
- ax_cv_check_ldflags___Wl___nxcompat=no
- ax_cv_check_ldflags___Wl__dead_strip=yes
- ax_cv_check_ldflags___Wl__headerpad_max_install_names=yes
- ax_cv_check_ldflags___Wl__z_now=no
- ax_cv_check_ldflags___Wl__z_relro=no
- ax_cv_check_ldflags___framework_Foundation__framework_ApplicationServices__framework_AppKit=yes
- ax_cv_check_ldflags___pie=yes
- ax_cv_cxx_compile_cxx11__std_cpp11=yes
- ax_cv_have_func_attribute_dllexport=no
- ax_cv_have_func_attribute_dllimport=no
- ax_cv_have_func_attribute_visibility=no
- bitcoin_cv_static_qt=no
- lt_cv_apple_cc_single_mod=yes
- lt_cv_ar_at_file=no
- lt_cv_deplibs_check_method=pass_all
- lt_cv_file_magic_cmd='$MAGIC_CMD'
- lt_cv_file_magic_test_file=
- lt_cv_ld_exported_symbols_list=yes
- lt_cv_ld_force_load=yes
- lt_cv_ld_reload_flag=-r
- lt_cv_nm_interface='BSD nm'
- lt_cv_objdir=.libs
- lt_cv_path_LD=/Library/Developer/CommandLineTools/usr/bin/ld
- lt_cv_path_LDCXX=/Library/Developer/CommandLineTools/usr/bin/ld
- lt_cv_path_NM='/usr/bin/nm -B'
- lt_cv_path_mainfest_tool=no
- lt_cv_prog_compiler_c_o=yes
- lt_cv_prog_compiler_c_o_CXX=yes
- lt_cv_prog_compiler_pic='-fno-common -DPIC'
- lt_cv_prog_compiler_pic_CXX='-fno-common -DPIC'
- lt_cv_prog_compiler_pic_works=yes
- lt_cv_prog_compiler_pic_works_CXX=yes
- lt_cv_prog_compiler_rtti_exceptions=yes
- lt_cv_prog_compiler_static_works=no
- lt_cv_prog_compiler_static_works_CXX=no
- lt_cv_prog_gnu_ld=no
- lt_cv_prog_gnu_ldcxx=no
- lt_cv_sharedlib_from_linklib_cmd='printf %s\n'
- lt_cv_sys_global_symbol_pipe='sed -n -e '\''s/^.*[ ]\([BCDEGRST][BCDEGRST]*\)[ ][ ]*_\([_A-Za-z][_A-Za-z0-9]*\)$/\1 _\2 \2/p'\'' | sed '\''/ __gnu_lto/d'\'''
- lt_cv_sys_global_symbol_to_c_name_address='sed -n -e '\''s/^: \(.*\) .*$/ {"\1", (void *) 0},/p'\'' -e '\''s/^[BCDEGRST][BCDEGRST]* .* \(.*\)$/ {"\1", (void *) \&\1},/p'\'''
- lt_cv_sys_global_symbol_to_c_name_address_lib_prefix='sed -n -e '\''s/^: \(.*\) .*$/ {"\1", (void *) 0},/p'\'' -e '\''s/^[BCDEGRST][BCDEGRST]* .* \(lib.*\)$/ {"\1", (void *) \&\1},/p'\'' -e '\''s/^[BCDEGRST][BCDEGRST]* .* \(.*\)$/ {"lib\1", (void *) \&\1},/p'\'''
- lt_cv_sys_global_symbol_to_cdecl='sed -n -e '\''s/^T .* \(.*\)$/extern int \1();/p'\'' -e '\''s/^[BCDEGRST][BCDEGRST]* .* \(.*\)$/extern char \1;/p'\'''
- lt_cv_sys_global_symbol_to_import=
- lt_cv_sys_max_cmd_len=196608
- lt_cv_to_host_file_cmd=func_convert_file_noop
- lt_cv_to_tool_file_cmd=func_convert_file_noop
- lt_cv_truncate_bin='/bin/dd bs=4096 count=1'
- pkg_cv_CRYPTO_CFLAGS=-I/usr/local/Cellar/openssl/1.0.2l/include
- pkg_cv_CRYPTO_LIBS='-L/usr/local/Cellar/openssl/1.0.2l/lib -lcrypto'
- pkg_cv_EVENT_CFLAGS=-I/usr/local/Cellar/libevent/2.1.8/include
- pkg_cv_EVENT_LIBS='-L/usr/local/Cellar/libevent/2.1.8/lib -levent'
- pkg_cv_EVENT_PTHREADS_CFLAGS='-D_THREAD_SAFE -I/usr/local/Cellar/libevent/2.1.8/include'
- pkg_cv_EVENT_PTHREADS_LIBS='-L/usr/local/Cellar/libevent/2.1.8/lib -levent_pthreads -levent'
- pkg_cv_QT5_CFLAGS='-I/usr/local/Cellar/qt/5.9.0/include/QtNetwork -I/usr/local/Cellar/qt/5.9.0/include -I/usr/local/Cellar/qt/5.9.0/include/QtWidgets -I/usr/local/Cellar/qt/5.9.0/include -I/usr/local/Cellar/qt/5.9.0/include/QtGui -I/usr/local/Cellar/qt/5.9.0/include -I/usr/local/Cellar/qt/5.9.0/include/QtCore -I/usr/local/Cellar/qt/5.9.0/include'
- pkg_cv_QT5_LIBS='-F/usr/local/Cellar/qt/5.9.0/lib -framework QtNetwork -F/usr/local/Cellar/qt/5.9.0/lib -framework QtWidgets -F/usr/local/Cellar/qt/5.9.0/lib -framework QtGui -F/usr/local/Cellar/qt/5.9.0/lib -framework QtCore'
- pkg_cv_QT_DBUS_CFLAGS='-I/usr/local/Cellar/qt/5.9.0/include/QtDBus -I/usr/local/Cellar/qt/5.9.0/include -I/usr/local/Cellar/qt/5.9.0/include/QtCore -I/usr/local/Cellar/qt/5.9.0/include'
- pkg_cv_QT_DBUS_LIBS='-F/usr/local/Cellar/qt/5.9.0/lib -framework QtDBus -F/usr/local/Cellar/qt/5.9.0/lib -framework QtCore'
- pkg_cv_QT_TEST_CFLAGS='-I/usr/local/Cellar/qt/5.9.0/include/QtTest -I/usr/local/Cellar/qt/5.9.0/include -I/usr/local/Cellar/qt/5.9.0/include/QtCore -I/usr/local/Cellar/qt/5.9.0/include'
- pkg_cv_QT_TEST_LIBS='-F/usr/local/Cellar/qt/5.9.0/lib -framework QtTest -F/usr/local/Cellar/qt/5.9.0/lib -framework QtCore'
- pkg_cv_SSL_CFLAGS=-I/usr/local/Cellar/openssl/1.0.2l/include
- pkg_cv_SSL_LIBS='-L/usr/local/Cellar/openssl/1.0.2l/lib -lssl'
- ## ----------------- ##
- ## Output variables. ##
- ## ----------------- ##
- ACLOCAL='${SHELL} /Users/dwasyluk/Development/bitcoin/build-aux/missing aclocal-1.15'
- AMDEPBACKSLASH='\'
- AMDEP_FALSE='#'
- AMDEP_TRUE=''
- AMTAR='$${TAR-tar}'
- AM_BACKSLASH='\'
- AM_DEFAULT_V='$(AM_DEFAULT_VERBOSITY)'
- AM_DEFAULT_VERBOSITY='0'
- AM_V='$(V)'
- AR='/usr/bin/ar'
- AUTOCONF='${SHELL} /Users/dwasyluk/Development/bitcoin/build-aux/missing autoconf'
- AUTOHEADER='${SHELL} /Users/dwasyluk/Development/bitcoin/build-aux/missing autoheader'
- AUTOMAKE='${SHELL} /Users/dwasyluk/Development/bitcoin/build-aux/missing automake-1.15'
- AWK='awk'
- BDB_CFLAGS=''
- BDB_CPPFLAGS=''
- BDB_LIBS='-ldb_cxx-4.8'
- BITCOIN_CLI_NAME='bitcoin-cli'
- BITCOIN_DAEMON_NAME='bitcoind'
- BITCOIN_GUI_NAME='bitcoin-qt'
- BITCOIN_TX_NAME='bitcoin-tx'
- BOOST_CHRONO_LIB='-lboost_chrono-mt'
- BOOST_CPPFLAGS='-DBOOST_SP_USE_STD_ATOMIC -DBOOST_AC_USE_STD_ATOMIC -pthread -I/usr/local/include'
- BOOST_FILESYSTEM_LIB='-lboost_filesystem'
- BOOST_LDFLAGS='-L/usr/local/lib'
- BOOST_LIBS='-L/usr/local/lib -lboost_system -lboost_filesystem -lboost_program_options-mt -lboost_thread-mt -lboost_chrono-mt'
- BOOST_PROGRAM_OPTIONS_LIB='-lboost_program_options-mt'
- BOOST_SYSTEM_LIB='-lboost_system'
- BOOST_THREAD_LIB='-lboost_thread-mt'
- BOOST_UNIT_TEST_FRAMEWORK_LIB='-lboost_unit_test_framework-mt'
- BREW='brew'
- BUILD_BITCOIND_FALSE='#'
- BUILD_BITCOIND_TRUE=''
- BUILD_BITCOIN_LIBS_FALSE='#'
- BUILD_BITCOIN_LIBS_TRUE=''
- BUILD_BITCOIN_UTILS_FALSE='#'
- BUILD_BITCOIN_UTILS_TRUE=''
- BUILD_DARWIN_FALSE='#'
- BUILD_DARWIN_TRUE=''
- CC='gcc'
- CCACHE=''
- CCDEPMODE='depmode=gcc3'
- CFLAGS='-g -O2'
- CLIENT_VERSION_BUILD='0'
- CLIENT_VERSION_IS_RELEASE='false'
- CLIENT_VERSION_MAJOR='0'
- CLIENT_VERSION_MINOR='14'
- CLIENT_VERSION_REVISION='99'
- COPYRIGHT_HOLDERS='The %s developers'
- COPYRIGHT_HOLDERS_FINAL='The Bitcoin Core developers'
- COPYRIGHT_HOLDERS_SUBSTITUTION='Bitcoin Core'
- COPYRIGHT_YEAR='2017'
- CPP='gcc -E'
- CPPFILT='/usr/bin/c++filt'
- CPPFLAGS=' -DHAVE_BUILD_INFO -D__STDC_FORMAT_MACROS -I/usr/local/opt/berkeley-db@4/include -DMAC_OSX'
- CRYPTO_CFLAGS='-I/usr/local/Cellar/openssl/1.0.2l/include'
- CRYPTO_LIBS='-L/usr/local/Cellar/openssl/1.0.2l/lib -lcrypto'
- CXX='g++ -std=c++11'
- CXXCPP='g++ -std=c++11 -E'
- CXXDEPMODE='depmode=gcc3'
- CXXFLAGS='-g -O2 -Wall -Wextra -Wformat -Wvla -Wformat-security -Wno-unused-parameter -Wno-self-assign -Wno-unused-local-typedef -Wno-deprecated-register -Wno-implicit-fallthrough'
- CYGPATH_W='echo'
- DEFS='-DHAVE_CONFIG_H'
- DEPDIR='.deps'
- DLLTOOL='false'
- DSYMUTIL='dsymutil'
- DUMPBIN=''
- ECHO_C='\c'
- ECHO_N=''
- ECHO_T=''
- EGREP='/usr/bin/grep -E'
- EMBEDDED_LEVELDB_FALSE='#'
- EMBEDDED_LEVELDB_TRUE=''
- EMBEDDED_UNIVALUE_FALSE='#'
- EMBEDDED_UNIVALUE_TRUE=''
- ENABLE_BENCH_FALSE='#'
- ENABLE_BENCH_TRUE=''
- ENABLE_MAN_FALSE='#'
- ENABLE_MAN_TRUE=''
- ENABLE_QT_FALSE=''
- ENABLE_QT_TESTS_FALSE=''
- ENABLE_QT_TESTS_TRUE='#'
- ENABLE_QT_TRUE='#'
- ENABLE_SSE42_FALSE='#'
- ENABLE_SSE42_TRUE=''
- ENABLE_TESTS_FALSE='#'
- ENABLE_TESTS_TRUE=''
- ENABLE_WALLET_FALSE='#'
- ENABLE_WALLET_TRUE=''
- ENABLE_ZMQ_FALSE=''
- ENABLE_ZMQ_TRUE='#'
- ERROR_CXXFLAGS=''
- EVENT_CFLAGS='-I/usr/local/Cellar/libevent/2.1.8/include'
- EVENT_LIBS='-L/usr/local/Cellar/libevent/2.1.8/lib -levent'
- EVENT_PTHREADS_CFLAGS='-D_THREAD_SAFE -I/usr/local/Cellar/libevent/2.1.8/include'
- EVENT_PTHREADS_LIBS='-L/usr/local/Cellar/libevent/2.1.8/lib -levent_pthreads -levent'
- EXEEXT=''
- EXTENDED_FUNCTIONAL_TESTS=''
- FGREP='/usr/bin/grep -F'
- GCOV='/usr/bin/gcov'
- GENHTML=''
- GENISOIMAGE=''
- GIT='/usr/bin/git'
- GLIBC_BACK_COMPAT_FALSE=''
- GLIBC_BACK_COMPAT_TRUE='#'
- GREP='/usr/bin/grep'
- HARDENED_CPPFLAGS=' -U_FORTIFY_SOURCE -D_FORTIFY_SOURCE=2'
- HARDENED_CXXFLAGS=' -Wstack-protector -fstack-protector-all'
- HARDENED_LDFLAGS=' -pie'
- HARDEN_FALSE='#'
- HARDEN_TRUE=''
- HAVE_CXX11='1'
- HEXDUMP='/usr/bin/hexdump'
- IMAGEMAGICK_CONVERT=''
- INSTALLNAMETOOL=''
- INSTALL_DATA='${INSTALL} -m 644'
- INSTALL_PROGRAM='${INSTALL}'
- INSTALL_SCRIPT='${INSTALL}'
- INSTALL_STRIP_PROGRAM='$(install_sh) -c -s'
- LCOV=''
- LD='/Library/Developer/CommandLineTools/usr/bin/ld'
- LDFLAGS=' -Wl,-headerpad_max_install_names -Wl,-dead_strip'
- LEVELDB_CPPFLAGS=''
- LEVELDB_TARGET_FLAGS='-DOS_MACOSX'
- LIBLEVELDB=''
- LIBMEMENV=''
- LIBOBJS=''
- LIBS=' -L/usr/local/opt/berkeley-db@4/lib'
- LIBTOOL='$(SHELL) $(top_builddir)/libtool'
- LIBTOOL_APP_LDFLAGS=''
- LIPO='lipo'
- LN_S='ln -s'
- LRELEASE='/usr/local/Cellar/qt/5.9.0/bin/lrelease'
- LTLIBOBJS=''
- LT_SYS_LIBRARY_PATH=''
- LUPDATE='/usr/local/Cellar/qt/5.9.0/bin/lupdate'
- MAINT=''
- MAINTAINER_MODE_FALSE='#'
- MAINTAINER_MODE_TRUE=''
- MAKEINFO='${SHELL} /Users/dwasyluk/Development/bitcoin/build-aux/missing makeinfo'
- MAKENSIS=''
- MANIFEST_TOOL=':'
- MINIUPNPC_CPPFLAGS=''
- MINIUPNPC_LIBS='-lminiupnpc'
- MKDIR_P='build-aux/install-sh -c -d'
- MOC='/usr/local/Cellar/qt/5.9.0/bin/moc'
- MOC_DEFS='-DHAVE_CONFIG_H -I$(srcdir) -DQ_OS_MAC'
- NM='/usr/bin/nm -B'
- NMEDIT='nmedit'
- OBJCOPY=''
- OBJCXX='g++ -std=c++11'
- OBJCXXDEPMODE='depmode=gcc3'
- OBJCXXFLAGS='-g -O2 -Wall -Wextra -Wformat -Wvla -Wformat-security -Wno-unused-parameter -Wno-self-assign -Wno-unused-local-typedef -Wno-deprecated-register -Wno-implicit-fallthrough'
- OBJDUMP='objdump'
- OBJEXT='o'
- OTOOL64=':'
- OTOOL='otool'
- PACKAGE='bitcoin'
- PACKAGE_BUGREPORT='https://github.com/bitcoin/bitcoin/issues'
- PACKAGE_NAME='Bitcoin Core'
- PACKAGE_STRING='Bitcoin Core 0.14.99'
- PACKAGE_TARNAME='bitcoin'
- PACKAGE_URL='https://bitcoincore.org/'
- PACKAGE_VERSION='0.14.99'
- PATH_SEPARATOR=':'
- PIC_FLAGS='-fPIC'
- PIE_FLAGS='-fPIE'
- PKG_CONFIG='/usr/local/bin/pkg-config'
- PKG_CONFIG_LIBDIR=''
- PKG_CONFIG_PATH='/usr/local/opt/qt/lib/pkgconfig:/usr/local/opt/openssl/lib/pkgconfig:'
- PORT=''
- PROTOBUF_CFLAGS=''
- PROTOBUF_LIBS=''
- PROTOC=''
- PTHREAD_CC='gcc'
- PTHREAD_CFLAGS='-Qunused-arguments -pthread'
- PTHREAD_LIBS=''
- PYTHON='/usr/local/bin/python2.7'
- PYTHONPATH=''
- QR_CFLAGS=''
- QR_LIBS=''
- QT4_CFLAGS=''
- QT4_LIBS=''
- QT5_CFLAGS='-I/usr/local/Cellar/qt/5.9.0/include/QtNetwork -I/usr/local/Cellar/qt/5.9.0/include -I/usr/local/Cellar/qt/5.9.0/include/QtWidgets -I/usr/local/Cellar/qt/5.9.0/include -I/usr/local/Cellar/qt/5.9.0/include/QtGui -I/usr/local/Cellar/qt/5.9.0/include -I/usr/local/Cellar/qt/5.9.0/include/QtCore -I/usr/local/Cellar/qt/5.9.0/include'
- QT5_LIBS='-F/usr/local/Cellar/qt/5.9.0/lib -framework QtNetwork -F/usr/local/Cellar/qt/5.9.0/lib -framework QtWidgets -F/usr/local/Cellar/qt/5.9.0/lib -framework QtGui -F/usr/local/Cellar/qt/5.9.0/lib -framework QtCore'
- QTPLATFORM_CFLAGS=''
- QTPLATFORM_LIBS=''
- QTPRINT_CFLAGS=''
- QTPRINT_LIBS=''
- QTXCBQPA_CFLAGS=''
- QTXCBQPA_LIBS=''
- QT_DBUS_CFLAGS='-I/usr/local/Cellar/qt/5.9.0/include/QtDBus -I/usr/local/Cellar/qt/5.9.0/include -I/usr/local/Cellar/qt/5.9.0/include/QtCore -I/usr/local/Cellar/qt/5.9.0/include'
- QT_DBUS_INCLUDES='-I/usr/local/Cellar/qt/5.9.0/include/QtDBus -I/usr/local/Cellar/qt/5.9.0/include -I/usr/local/Cellar/qt/5.9.0/include/QtCore -I/usr/local/Cellar/qt/5.9.0/include'
- QT_DBUS_LIBS='-F/usr/local/Cellar/qt/5.9.0/lib -framework QtDBus -F/usr/local/Cellar/qt/5.9.0/lib -framework QtCore'
- QT_INCLUDES='-I/usr/local/Cellar/qt/5.9.0/include/QtNetwork -I/usr/local/Cellar/qt/5.9.0/include -I/usr/local/Cellar/qt/5.9.0/include/QtWidgets -I/usr/local/Cellar/qt/5.9.0/include -I/usr/local/Cellar/qt/5.9.0/include/QtGui -I/usr/local/Cellar/qt/5.9.0/include -I/usr/local/Cellar/qt/5.9.0/include/QtCore -I/usr/local/Cellar/qt/5.9.0/include'
- QT_LDFLAGS=''
- QT_LIBS='-F/usr/local/Cellar/qt/5.9.0/lib -framework QtNetwork -F/usr/local/Cellar/qt/5.9.0/lib -framework QtWidgets -F/usr/local/Cellar/qt/5.9.0/lib -framework QtGui -F/usr/local/Cellar/qt/5.9.0/lib -framework QtCore -framework Foundation -framework ApplicationServices -framework AppKit'
- QT_PIE_FLAGS='-fPIE'
- QT_SELECT='qt5'
- QT_TEST_CFLAGS='-I/usr/local/Cellar/qt/5.9.0/include/QtTest -I/usr/local/Cellar/qt/5.9.0/include -I/usr/local/Cellar/qt/5.9.0/include/QtCore -I/usr/local/Cellar/qt/5.9.0/include'
- QT_TEST_INCLUDES='-I/usr/local/Cellar/qt/5.9.0/include/QtTest -I/usr/local/Cellar/qt/5.9.0/include -I/usr/local/Cellar/qt/5.9.0/include/QtCore -I/usr/local/Cellar/qt/5.9.0/include'
- QT_TEST_LIBS='-F/usr/local/Cellar/qt/5.9.0/lib -framework QtTest -F/usr/local/Cellar/qt/5.9.0/lib -framework QtCore'
- QT_TRANSLATION_DIR=''
- RANLIB='/usr/bin/ranlib'
- RCC='/usr/local/Cellar/qt/5.9.0/bin/rcc'
- READELF=''
- RELDFLAGS=''
- RSVG_CONVERT='/usr/local/bin/rsvg-convert'
- SED='/usr/bin/sed'
- SET_MAKE=''
- SHELL='/bin/sh'
- SSE42_CXXFLAGS='-msse4.2'
- SSL_CFLAGS='-I/usr/local/Cellar/openssl/1.0.2l/include'
- SSL_LIBS='-L/usr/local/Cellar/openssl/1.0.2l/lib -lssl'
- STRIP='/usr/bin/strip'
- TARGET_DARWIN_FALSE='#'
- TARGET_DARWIN_TRUE=''
- TARGET_WINDOWS_FALSE=''
- TARGET_WINDOWS_TRUE='#'
- TESTDEFS=' -DBOOST_TEST_DYN_LINK'
- TIFFCP=''
- UIC='/usr/local/Cellar/qt/5.9.0/bin/uic'
- UNIVALUE_CFLAGS='-I$(srcdir)/univalue/include'
- UNIVALUE_LIBS='univalue/libunivalue.la'
- USE_LCOV_FALSE=''
- USE_LCOV_TRUE='#'
- USE_QRCODE=''
- USE_QRCODE_FALSE=''
- USE_QRCODE_TRUE='#'
- USE_UPNP=''
- VERSION='0.14.99'
- WINDOWS_BITS=''
- WINDRES=''
- X11XCB_CFLAGS=''
- X11XCB_LIBS=''
- XGETTEXT=''
- ZMQ_CFLAGS=''
- ZMQ_LIBS=''
- ac_ct_AR='ar'
- ac_ct_CC='gcc'
- ac_ct_CXX='g++'
- ac_ct_DUMPBIN=''
- ac_ct_OBJCXX=''
- am__EXEEXT_FALSE=''
- am__EXEEXT_TRUE='#'
- am__fastdepCC_FALSE='#'
- am__fastdepCC_TRUE=''
- am__fastdepCXX_FALSE='#'
- am__fastdepCXX_TRUE=''
- am__fastdepOBJCXX_FALSE='#'
- am__fastdepOBJCXX_TRUE=''
- am__include='include'
- am__isrc=''
- am__leading_dot='.'
- am__nodep='_no'
- am__quote=''
- am__tar='$${TAR-tar} chof - "$$tardir"'
- am__untar='$${TAR-tar} xf -'
- ax_pthread_config=''
- bindir='${exec_prefix}/bin'
- build='x86_64-apple-darwin16.6.0'
- build_alias=''
- build_cpu='x86_64'
- build_os='darwin16.6.0'
- build_vendor='apple'
- datadir='${datarootdir}'
- datarootdir='${prefix}/share'
- docdir='${datarootdir}/doc/${PACKAGE_TARNAME}'
- dvidir='${docdir}'
- exec_prefix='${prefix}'
- host='x86_64-apple-darwin16.6.0'
- host_alias=''
- host_cpu='x86_64'
- host_os='darwin16.6.0'
- host_vendor='apple'
- htmldir='${docdir}'
- includedir='${prefix}/include'
- infodir='${datarootdir}/info'
- install_sh='${SHELL} /Users/dwasyluk/Development/bitcoin/build-aux/install-sh'
- libdir='${exec_prefix}/lib'
- libexecdir='${exec_prefix}/libexec'
- localedir='${datarootdir}/locale'
- localstatedir='${prefix}/var'
- mandir='${datarootdir}/man'
- mkdir_p='$(MKDIR_P)'
- oldincludedir='/usr/include'
- pdfdir='${docdir}'
- prefix='/usr/local'
- program_transform_name='s,x,x,'
- psdir='${docdir}'
- sbindir='${exec_prefix}/sbin'
- sharedstatedir='${prefix}/com'
- subdirs=' src/univalue src/secp256k1'
- sysconfdir='${prefix}/etc'
- target_alias=''
- ## ----------- ##
- ## confdefs.h. ##
- ## ----------- ##
- /* confdefs.h */
- #define PACKAGE_NAME "Bitcoin Core"
- #define PACKAGE_TARNAME "bitcoin"
- #define PACKAGE_VERSION "0.14.99"
- #define PACKAGE_STRING "Bitcoin Core 0.14.99"
- #define PACKAGE_BUGREPORT "https://github.com/bitcoin/bitcoin/issues"
- #define PACKAGE_URL "https://bitcoincore.org/"
- #define HAVE_CXX11 1
- #define STDC_HEADERS 1
- #define HAVE_SYS_TYPES_H 1
- #define HAVE_SYS_STAT_H 1
- #define HAVE_STDLIB_H 1
- #define HAVE_STRING_H 1
- #define HAVE_MEMORY_H 1
- #define HAVE_STRINGS_H 1
- #define HAVE_INTTYPES_H 1
- #define HAVE_STDINT_H 1
- #define HAVE_UNISTD_H 1
- #define HAVE_DLFCN_H 1
- #define LT_OBJDIR ".libs/"
- #define HAVE_PTHREAD_PRIO_INHERIT 1
- #define HAVE_PTHREAD 1
- #define HAVE_DECL_STRERROR_R 1
- #define HAVE_STRERROR_R 1
- #define HAVE_STDIO_H 1
- #define HAVE_STDLIB_H 1
- #define HAVE_UNISTD_H 1
- #define HAVE_STRINGS_H 1
- #define HAVE_SYS_TYPES_H 1
- #define HAVE_SYS_STAT_H 1
- #define HAVE_SYS_SELECT_H 1
- #define HAVE_DECL_STRNLEN 1
- #define HAVE_DECL_DAEMON 1
- #define HAVE_DECL_LE16TOH 0
- #define HAVE_DECL_LE32TOH 0
- #define HAVE_DECL_LE64TOH 0
- #define HAVE_DECL_HTOLE16 0
- #define HAVE_DECL_HTOLE32 0
- #define HAVE_DECL_HTOLE64 0
- #define HAVE_DECL_BE16TOH 0
- #define HAVE_DECL_BE32TOH 0
- #define HAVE_DECL_BE64TOH 0
- #define HAVE_DECL_HTOBE16 0
- #define HAVE_DECL_HTOBE32 0
- #define HAVE_DECL_HTOBE64 0
- #define HAVE_DECL_BSWAP_16 0
- #define HAVE_DECL_BSWAP_32 0
- #define HAVE_DECL_BSWAP_64 0
- #define HAVE_DECL___BUILTIN_CLZ 0
- #define HAVE_DECL___BUILTIN_CLZL 0
- #define HAVE_DECL___BUILTIN_CLZLL 0
- #define HAVE_MSG_DONTWAIT 1
- #define HAVE_VISIBILITY_ATTRIBUTE 1
- #define HAVE_MINIUPNPC_MINIWGET_H 1
- #define HAVE_MINIUPNPC_MINIUPNPC_H 1
- #define HAVE_MINIUPNPC_UPNPCOMMANDS_H 1
- #define HAVE_MINIUPNPC_UPNPERRORS_H 1
- #define HAVE_BOOST /**/
- #define HAVE_BOOST_SYSTEM /**/
- #define HAVE_BOOST_FILESYSTEM /**/
- #define HAVE_BOOST_PROGRAM_OPTIONS /**/
- #define HAVE_BOOST_THREAD /**/
- #define HAVE_BOOST_CHRONO /**/
- #define HAVE_BOOST_UNIT_TEST_FRAMEWORK /**/
- #define HAVE_WORKING_BOOST_SLEEP_FOR 1
- #define ENABLE_ZMQ 0
- #define HAVE_DECL_EVP_MD_CTX_NEW 0
- #define HAVE_CONSENSUS_LIB 1
- #define ENABLE_WALLET 1
- #define USE_UPNP 0
- #define CLIENT_VERSION_MAJOR 0
- #define CLIENT_VERSION_MINOR 14
- #define CLIENT_VERSION_REVISION 99
- #define CLIENT_VERSION_BUILD 0
- #define CLIENT_VERSION_IS_RELEASE false
- #define COPYRIGHT_YEAR 2017
- #define COPYRIGHT_HOLDERS "The %s developers"
- #define COPYRIGHT_HOLDERS_SUBSTITUTION "Bitcoin Core"
- #define COPYRIGHT_HOLDERS_FINAL "The Bitcoin Core developers"
- configure: exit 0
Advertisement
Add Comment
Please, Sign In to add comment