SHARE
TWEET

Untitled

a guest Sep 3rd, 2018 91 Never
Not a member of Pastebin yet? Sign Up, it unlocks many cool features!
  1. $ gem install qtbindings
  2. Building native extensions.  This could take a while...
  3. ERROR:  Error installing qtbindings:
  4.     ERROR: Failed to build gem native extension.
  5.  
  6.         /Users/padillac/.rvm/rubies/rbx-head/bin/rbx extconf.rb
  7.  
  8. make
  9. mkdir ext/build
  10. mkdir: ext/build: File exists
  11. make: [makedirs] Error 1 (ignored)
  12. mkdir bin/1.8
  13. mkdir: bin/1.8: File exists
  14. make: [makedirs] Error 1 (ignored)
  15. mkdir bin/1.9
  16. mkdir: bin/1.9: File exists
  17. make: [makedirs] Error 1 (ignored)
  18. mkdir bin/plugins
  19. mkdir: bin/plugins: File exists
  20. make: [makedirs] Error 1 (ignored)
  21. mkdir bin/plugins/accessible
  22. mkdir: bin/plugins/accessible: File exists
  23. make: [makedirs] Error 1 (ignored)
  24. mkdir bin/plugins/codecs
  25. mkdir: bin/plugins/codecs: File exists
  26. make: [makedirs] Error 1 (ignored)
  27. mkdir bin/plugins/designer
  28. mkdir: bin/plugins/designer: File exists
  29. make: [makedirs] Error 1 (ignored)
  30. mkdir bin/plugins/graphicssystems
  31. mkdir: bin/plugins/graphicssystems: File exists
  32. make: [makedirs] Error 1 (ignored)
  33. mkdir bin/plugins/iconengines
  34. mkdir: bin/plugins/iconengines: File exists
  35. make: [makedirs] Error 1 (ignored)
  36. mkdir bin/plugins/imageformats
  37. mkdir: bin/plugins/imageformats: File exists
  38. make: [makedirs] Error 1 (ignored)
  39. mkdir bin/plugins/phonon_backend
  40. mkdir: bin/plugins/phonon_backend: File exists
  41. make: [makedirs] Error 1 (ignored)
  42. mkdir bin/plugins/sqldrivers
  43. mkdir: bin/plugins/sqldrivers: File exists
  44. make: [makedirs] Error 1 (ignored)
  45. mkdir lib/1.8
  46. mkdir: lib/1.8: File exists
  47. make: [makedirs] Error 1 (ignored)
  48. mkdir lib/1.9
  49. mkdir: lib/1.9: File exists
  50. make: [makedirs] Error 1 (ignored)
  51. cd ext/build; rm -rf CMakeFiles
  52. cd ext/build; rm -rf generator
  53. cd ext/build; rm -rf smoke
  54. cd ext/build; rm -rf ruby
  55. cd ext/build; rm *
  56. rm: conftest.dSYM: is a directory
  57. make: [clean] Error 1 (ignored)
  58. cd ext/build; \
  59. cmake \
  60. -G "Unix Makefiles" \
  61. -Wno-dev \
  62. -DENABLE_SMOKE=on \
  63. -DENABLE_QTCORE_SMOKE=on \
  64. -DENABLE_QTNETWORK_SMOKE=on \
  65. -DENABLE_QTDBUS_SMOKE=on \
  66. -DENABLE_QTGUI_SMOKE=on \
  67. -DENABLE_QTSVG_SMOKE=on \
  68. -DENABLE_QTSQL_SMOKE=on \
  69. -DENABLE_QTXML_SMOKE=on \
  70. -DENABLE_QTXMLPATTERNS_SMOKE=on \
  71. -DENABLE_QTOPENGL_SMOKE=on \
  72. -DENABLE_QTWEBKIT_SMOKE=on \
  73. -DENABLE_QTSCRIPT_SMOKE=on \
  74. -DENABLE_QTUITOOLS_SMOKE=on \
  75. -DENABLE_QTTEST_SMOKE=on \
  76. -DENABLE_QTMULTIMEDIA_SMOKE=on \
  77. -DENABLE_QTRUBY=on \
  78. -DENABLE_QTWEBKIT_RUBY=on \
  79. -DENABLE_QTUITOOLS_RUBY=on \
  80. -DENABLE_QTSCRIPT=on \
  81. -DENABLE_QTTEST=on \
  82. ..
  83. -- The C compiler identification is GNU
  84. -- The CXX compiler identification is GNU
  85. -- Checking whether C compiler has -isysroot
  86. -- Checking whether C compiler has -isysroot - yes
  87. -- Checking whether C compiler supports OSX deployment target flag
  88. -- Checking whether C compiler supports OSX deployment target flag - yes
  89. -- Check for working C compiler: /usr/bin/gcc
  90. -- Check for working C compiler: /usr/bin/gcc -- works
  91. -- Detecting C compiler ABI info
  92. -- Detecting C compiler ABI info - done
  93. -- Checking whether CXX compiler has -isysroot
  94. -- Checking whether CXX compiler has -isysroot - yes
  95. -- Checking whether CXX compiler supports OSX deployment target flag
  96. -- Checking whether CXX compiler supports OSX deployment target flag - yes
  97. -- Check for working CXX compiler: /usr/bin/c++
  98. -- Check for working CXX compiler: /usr/bin/c++ -- works
  99. -- Detecting CXX compiler ABI info
  100. -- Detecting CXX compiler ABI info - done
  101. -- Looking for Q_WS_X11
  102. -- Looking for Q_WS_X11 - not found.
  103. -- Looking for Q_WS_WIN
  104. -- Looking for Q_WS_WIN - not found.
  105. -- Looking for Q_WS_QWS
  106. -- Looking for Q_WS_QWS - not found.
  107. -- Looking for Q_WS_MAC
  108. -- Looking for Q_WS_MAC - found
  109. -- Looking for QT_MAC_USE_COCOA
  110. -- Looking for QT_MAC_USE_COCOA - found
  111. -- Found Qt-Version 4.7.1 (using /usr/local/bin/qmake)
  112. -- Found Qt-Version 4.7.1 (using /usr/local/bin/qmake)
  113. -- Looking for include files CMAKE_HAVE_PTHREAD_H
  114. -- Looking for include files CMAKE_HAVE_PTHREAD_H - found
  115. -- Looking for pthread_create in pthreads
  116. -- Looking for pthread_create in pthreads - not found
  117. -- Looking for pthread_create in pthread
  118. -- Looking for pthread_create in pthread - found
  119. -- Found Threads: TRUE
  120. -- looking for config.h
  121. -- --------FindRuby.cmake debug------------
  122. -- _RUBY_POSSIBLE_EXECUTABLE_NAMES: ruby;ruby1.9;ruby19;ruby1.9.1;ruby191;ruby1.9.2;ruby192;ruby1.8;ruby18
  123. -- _RUBY_POSSIBLE_LIB_NAMES: ruby;ruby-static;ruby1.8;ruby-1.8.7
  124. -- RUBY_ARCH_DIR: /Users/padillac/.rvm/rubies/rbx-head/site/x86_64-darwin10.5.0
  125. -- RUBY_HDR_DIR: /Users/padillac/.rvm/rubies/rbx-head/include
  126. -- RUBY_POSSIBLE_LIB_DIR: /Users/padillac/.rvm/rubies/rbx-head/lib
  127. -- Found RUBY_VERSION: "1.8.7" , short: "1.8", nodot: "18"
  128. -- _RUBY_REQUIRED_VARS: RUBY_EXECUTABLE;RUBY_INCLUDE_DIR;RUBY_LIBRARY
  129. -- --------------------
  130. -- Found Ruby: /Users/padillac/.rvm/rubies/rbx-head/bin/ruby
  131. -- Checking how Qt was built...
  132. -- Threshold is set to 15
  133. -- QT_NO_DEBUG *Undefined*
  134. -- QT_NO_STYLE_PLASTIQUE *Undefined*
  135. -- QT_NO_STYLE_WINDOWSXP [Defined]
  136. -- QT_NO_STYLE_WINDOWS *Undefined*
  137. -- QT_NO_STYLE_MAC *Undefined*
  138. -- QT_NO_STYLE_CLEANLOOKS *Undefined*
  139. -- QT_NO_TABLEVIEW *Undefined*
  140. -- Found Qt-Version 4.7.1 (using /usr/local/bin/qmake)
  141. -- Found Qt-Version 4.7.1 (using /usr/local/bin/qmake)
  142. -- Build SMOKE bindings: QtDBus;QtDeclarative;QtGui;QtHelp;QtMultimedia;QtNetwork;QtOpenGL;QtScript;QtSql;QtSvg;QtTest;QtUiTools;QtWebKit;QtXml;QtXmlPatterns
  143. -- Skip SMOKE bindings:
  144. -- looking for config.h
  145. -- --------FindRuby.cmake debug------------
  146. -- _RUBY_POSSIBLE_EXECUTABLE_NAMES: ruby;ruby1.9;ruby19;ruby1.9.1;ruby191;ruby1.9.2;ruby192;ruby1.8;ruby18
  147. -- _RUBY_POSSIBLE_LIB_NAMES: ruby;ruby-static;ruby1.8;ruby-1.8.7
  148. -- RUBY_ARCH_DIR: /Users/padillac/.rvm/rubies/rbx-head/site/x86_64-darwin10.5.0
  149. -- RUBY_HDR_DIR: /Users/padillac/.rvm/rubies/rbx-head/include
  150. -- RUBY_POSSIBLE_LIB_DIR: /Users/padillac/.rvm/rubies/rbx-head/lib
  151. -- Found RUBY_VERSION: "1.8.7" , short: "1.8", nodot: "18"
  152. -- _RUBY_REQUIRED_VARS: RUBY_EXECUTABLE;RUBY_INCLUDE_DIR;RUBY_LIBRARY
  153. -- --------------------
  154. -- The detected Ruby is too old for kross. A Ruby which has rb_hash_foreach is required. Upgrade to 1.8.2 or later
  155. -- Ruby Executable: /Users/padillac/.rvm/rubies/rbx-head/bin/ruby
  156. -- Ruby Libraries: /usr/lib/libruby.dylib
  157. -- Ruby Include Directories: /Users/padillac/.rvm/rubies/rbx-head/include/Library/Frameworks/MacRuby.framework/Headers/ruby
  158. -- Build Ruby bindings: QtDeclarative;QtRuby;QtScript;QtTest;QtUiTools;QtWebKit
  159. -- Skip Ruby bindings:
  160. -- Configuring done
  161. -- Generating done
  162. -- Build files have been written to: /Users/padillac/.rvm/gems/rbx-head@piper/gems/qtbindings-4.6.3.2/ext/build
  163. cd ext/build; make
  164. Scanning dependencies of target cppparser
  165. [  0%] Building CXX object generator/parser/CMakeFiles/cppparser.dir/ast.o
  166. [  1%] Building CXX object generator/parser/CMakeFiles/cppparser.dir/default_visitor.o
  167. [  1%] Building CXX object generator/parser/CMakeFiles/cppparser.dir/memorypool.o
  168. [  2%] Building CXX object generator/parser/CMakeFiles/cppparser.dir/visitor.o
  169. [  3%] Building CXX object generator/parser/CMakeFiles/cppparser.dir/control.o
  170. [  3%] Building CXX object generator/parser/CMakeFiles/cppparser.dir/lexer.o
  171. [  4%] Building CXX object generator/parser/CMakeFiles/cppparser.dir/parser.o
  172. /Users/padillac/.rvm/gems/rbx-head@piper/gems/qtbindings-4.6.3.2/ext/generator/parser/parser.cpp:1035:2: warning: #warning "implement me"
  173. /Users/padillac/.rvm/gems/rbx-head@piper/gems/qtbindings-4.6.3.2/ext/generator/parser/parser.cpp:2603:2: warning: #warning "implemente me (AST)"
  174. /Users/padillac/.rvm/gems/rbx-head@piper/gems/qtbindings-4.6.3.2/ext/generator/parser/parser.cpp:3489:2: warning: #warning "mark the ast as constant"
  175. [  5%] Building CXX object generator/parser/CMakeFiles/cppparser.dir/listnode.o
  176. [  5%] Building CXX object generator/parser/CMakeFiles/cppparser.dir/tokens.o
  177. [  6%] Building CXX object generator/parser/CMakeFiles/cppparser.dir/dumptree.o
  178. [  6%] Building CXX object generator/parser/CMakeFiles/cppparser.dir/parsesession.o
  179. /Users/padillac/.rvm/gems/rbx-head@piper/gems/qtbindings-4.6.3.2/ext/generator/parser/parsesession.cpp: In destructor ‘ParseSession::~ParseSession()’:
  180. /Users/padillac/.rvm/gems/rbx-head@piper/gems/qtbindings-4.6.3.2/ext/generator/parser/parsesession.cpp:42: warning: possible problem detected in invocation of delete operator:
  181. /Users/padillac/.rvm/gems/rbx-head@piper/gems/qtbindings-4.6.3.2/ext/generator/parser/parsesession.cpp:42: warning: invalid use of incomplete type ‘struct rpp::MacroBlock’
  182. /Users/padillac/.rvm/gems/rbx-head@piper/gems/qtbindings-4.6.3.2/ext/generator/parser/parsesession.h:43: warning: forward declaration of ‘struct rpp::MacroBlock’
  183. /Users/padillac/.rvm/gems/rbx-head@piper/gems/qtbindings-4.6.3.2/ext/generator/parser/parsesession.cpp:42: note: neither the destructor nor the class-specific operator delete will be called, even if they are declared when the class is defined.
  184. [  7%] Building CXX object generator/parser/CMakeFiles/cppparser.dir/commentparser.o
  185. [  8%] Building CXX object generator/parser/CMakeFiles/cppparser.dir/commentformatter.o
  186. [  8%] Building CXX object generator/parser/CMakeFiles/cppparser.dir/codegenerator.o
  187. [  9%] Building CXX object generator/parser/CMakeFiles/cppparser.dir/indexedstring.o
  188. [ 10%] Building CXX object generator/parser/CMakeFiles/cppparser.dir/stringhelpers.o
  189. [ 10%] Building CXX object generator/parser/CMakeFiles/cppparser.dir/rpp/pp-stream.o
  190. [ 11%] Building CXX object generator/parser/CMakeFiles/cppparser.dir/rpp/pp-macro-expander.o
  191. [ 12%] Building CXX object generator/parser/CMakeFiles/cppparser.dir/rpp/pp-scanner.o
  192. [ 12%] Building CXX object generator/parser/CMakeFiles/cppparser.dir/rpp/pp-macro.o
  193. [ 13%] Building CXX object generator/parser/CMakeFiles/cppparser.dir/rpp/pp-engine.o
  194. [ 13%] Building CXX object generator/parser/CMakeFiles/cppparser.dir/rpp/pp-internal.o
  195. [ 14%] Building CXX object generator/parser/CMakeFiles/cppparser.dir/rpp/pp-environment.o
  196. [ 15%] Building CXX object generator/parser/CMakeFiles/cppparser.dir/rpp/pp-location.o
  197. [ 15%] Building CXX object generator/parser/CMakeFiles/cppparser.dir/rpp/preprocessor.o
  198. [ 16%] Building CXX object generator/parser/CMakeFiles/cppparser.dir/rpp/chartools.o
  199. Linking CXX shared library ../bin/libcppparser.dylib
  200. [ 16%] Built target cppparser
  201. Scanning dependencies of target smokegen
  202. [ 17%] Building CXX object generator/CMakeFiles/smokegen.dir/main.o
  203. [ 17%] Building CXX object generator/CMakeFiles/smokegen.dir/generatorenvironment.o
  204. [ 18%] Building CXX object generator/CMakeFiles/smokegen.dir/generatorvisitor.o
  205. [ 19%] Building CXX object generator/CMakeFiles/smokegen.dir/generatorpreprocessor.o
  206. [ 19%] Building CXX object generator/CMakeFiles/smokegen.dir/options.o
  207. [ 20%] Building CXX object generator/CMakeFiles/smokegen.dir/type_compiler.o
  208. [ 20%] Building CXX object generator/CMakeFiles/smokegen.dir/name_compiler.o
  209. /Users/padillac/.rvm/gems/rbx-head@piper/gems/qtbindings-4.6.3.2/ext/generator/name_compiler.cpp:139:2: warning: #warning "NameCompiler::visitUnqualifiedName() -- implement me"
  210. [ 21%] Building CXX object generator/CMakeFiles/smokegen.dir/type.o
  211. Linking CXX executable bin/smokegen
  212. [ 21%] Built target smokegen
  213. Scanning dependencies of target generator_smoke
  214. [ 21%] Building CXX object generator/generators/smoke/CMakeFiles/generator_smoke.dir/generator_smoke.o
  215. [ 22%] Building CXX object generator/generators/smoke/CMakeFiles/generator_smoke.dir/writeClasses.o
  216. [ 22%] Building CXX object generator/generators/smoke/CMakeFiles/generator_smoke.dir/writeSmokeDataFile.o
  217. [ 23%] Building CXX object generator/generators/smoke/CMakeFiles/generator_smoke.dir/helpers.o
  218. Linking CXX shared module ../../bin/generator_smoke.so
  219. [ 23%] Built target generator_smoke
  220. Scanning dependencies of target generator_dump
  221. [ 24%] Building CXX object generator/generators/dump/CMakeFiles/generator_dump.dir/generator_dump.o
  222. Linking CXX shared module ../../bin/generator_dump.so
  223. [ 24%] Built target generator_dump
  224. Scanning dependencies of target smokebase
  225. [ 24%] Building CXX object smoke/smokebase/CMakeFiles/smokebase.dir/smokebase.o
  226. Linking CXX shared library libsmokebase.dylib
  227. [ 24%] Built target smokebase
  228. [ 25%] Generating smokedata.cpp, x_1.cpp, x_2.cpp, x_3.cpp, x_4.cpp, x_5.cpp, x_6.cpp, x_7.cpp, x_8.cpp, x_9.cpp, x_10.cpp, x_11.cpp, x_12.cpp, x_13.cpp, x_14.cpp, x_15.cpp, x_16.cpp, x_17.cpp, x_18.cpp, x_19.cpp, x_20.cpp
  229. using generator "/Users/padillac/.rvm/gems/rbx-head@piper/gems/qtbindings-4.6.3.2/ext/build/generator/bin/generator_smoke.so"
  230. parsing "/Users/padillac/.rvm/gems/rbx-head@piper/gems/qtbindings-4.6.3.2/ext/smoke/qtcore/qtcore_includes.h"
  231. Couldn't find file for #include<stddef.h>
  232. Couldn't find file for #include<AvailabilityMacros.h>
  233. Couldn't find file for #include<string.h>
  234. Couldn't find file for #include<stdarg.h>
  235. Couldn't find file for #include<string>
  236. Couldn't find file for #include<stdarg.h>
  237. Couldn't find file for #include<iterator>
  238. Couldn't find file for #include<list>
  239. Couldn't find file for #include<new>
  240. Couldn't find file for #include<limits.h>
  241. Couldn't find file for #include<string.h>
  242. Couldn't find file for #include<iterator>
  243. Couldn't find file for #include<vector>
  244. Couldn't find file for #include<stdlib.h>
  245. Couldn't find file for #include<string.h>
  246. Couldn't find file for #include<map>
  247. Couldn't find file for #include<new>
  248. Couldn't find file for #include<new>
  249. Not parsing stdio.h because it is not handled correctly by smokegen on FreeBSD based systems
  250. Couldn't find file for #include<limits.h>
  251. Couldn't find file for #include<new>
  252. Couldn't find file for #include<limits.h>
  253. Couldn't find file for #include<limits.h>
  254. Couldn't find file for #include<iterator>
  255. Couldn't find file for #include<new>
  256. Not parsing stdio.h because it is not handled correctly by smokegen on FreeBSD based systems
  257. Couldn't find file for #include<ctype.h>
  258. Couldn't find file for #include<limits.h>
  259. Couldn't find file for #include<iterator>
  260. Couldn't find file for #include<list>
  261. Couldn't find file for #include<string.h>
  262. Couldn't find file for #include<new>
  263. Couldn't find file for #include<math.h>
  264. Generating SMOKE sources...
  265. preparing SMOKE data [qtcore]
  266. writing out smokedata.cpp [qtcore]
  267. writing out x_*.cpp [qtcore]
  268. Done.
  269. Scanning dependencies of target smokeqtcore
  270. [ 26%] Building CXX object smoke/qtcore/CMakeFiles/smokeqtcore.dir/smokedata.o
  271. [ 26%] Building CXX object smoke/qtcore/CMakeFiles/smokeqtcore.dir/x_1.o
  272. [ 27%] Building CXX object smoke/qtcore/CMakeFiles/smokeqtcore.dir/x_2.o
  273. [ 28%] Building CXX object smoke/qtcore/CMakeFiles/smokeqtcore.dir/x_3.o
  274. [ 28%] Building CXX object smoke/qtcore/CMakeFiles/smokeqtcore.dir/x_4.o
  275. [ 29%] Building CXX object smoke/qtcore/CMakeFiles/smokeqtcore.dir/x_5.o
  276. [ 30%] Building CXX object smoke/qtcore/CMakeFiles/smokeqtcore.dir/x_6.o
  277. [ 30%] Building CXX object smoke/qtcore/CMakeFiles/smokeqtcore.dir/x_7.o
  278. [ 31%] Building CXX object smoke/qtcore/CMakeFiles/smokeqtcore.dir/x_8.o
  279. [ 31%] Building CXX object smoke/qtcore/CMakeFiles/smokeqtcore.dir/x_9.o
  280. [ 32%] Building CXX object smoke/qtcore/CMakeFiles/smokeqtcore.dir/x_10.o
  281. [ 33%] Building CXX object smoke/qtcore/CMakeFiles/smokeqtcore.dir/x_11.o
  282. [ 33%] Building CXX object smoke/qtcore/CMakeFiles/smokeqtcore.dir/x_12.o
  283. [ 34%] Building CXX object smoke/qtcore/CMakeFiles/smokeqtcore.dir/x_13.o
  284. [ 35%] Building CXX object smoke/qtcore/CMakeFiles/smokeqtcore.dir/x_14.o
  285. [ 35%] Building CXX object smoke/qtcore/CMakeFiles/smokeqtcore.dir/x_15.o
  286. [ 36%] Building CXX object smoke/qtcore/CMakeFiles/smokeqtcore.dir/x_16.o
  287. [ 36%] Building CXX object smoke/qtcore/CMakeFiles/smokeqtcore.dir/x_17.o
  288. [ 37%] Building CXX object smoke/qtcore/CMakeFiles/smokeqtcore.dir/x_18.o
  289. [ 38%] Building CXX object smoke/qtcore/CMakeFiles/smokeqtcore.dir/x_19.o
  290. [ 38%] Building CXX object smoke/qtcore/CMakeFiles/smokeqtcore.dir/x_20.o
  291. Linking CXX shared library libsmokeqtcore.dylib
  292. [ 38%] Built target smokeqtcore
  293. Scanning dependencies of target smokedeptool
  294. [ 39%] Building CXX object smoke/deptool/CMakeFiles/smokedeptool.dir/main.o
  295. Linking CXX executable smokedeptool
  296. [ 39%] Built target smokedeptool
  297. Scanning dependencies of target smokeapi
  298. [ 40%] Building CXX object smoke/smokeapi/CMakeFiles/smokeapi.dir/main.o
  299. Linking CXX executable smokeapi
  300. [ 40%] Built target smokeapi
  301. [ 40%] Generating smokedata.cpp, x_1.cpp
  302. using generator "/Users/padillac/.rvm/gems/rbx-head@piper/gems/qtbindings-4.6.3.2/ext/build/generator/bin/generator_smoke.so"
  303. parsing "/Users/padillac/.rvm/gems/rbx-head@piper/gems/qtbindings-4.6.3.2/ext/smoke/qtnetwork/qtnetwork_includes.h"
  304. Couldn't find file for #include<stddef.h>
  305. Couldn't find file for #include<AvailabilityMacros.h>
  306. Couldn't find file for #include<string.h>
  307. Couldn't find file for #include<stdarg.h>
  308. Couldn't find file for #include<string>
  309. Couldn't find file for #include<stdarg.h>
  310. Couldn't find file for #include<iterator>
  311. Couldn't find file for #include<list>
  312. Couldn't find file for #include<new>
  313. Couldn't find file for #include<limits.h>
  314. Couldn't find file for #include<string.h>
  315. Couldn't find file for #include<iterator>
  316. Couldn't find file for #include<vector>
  317. Couldn't find file for #include<stdlib.h>
  318. Couldn't find file for #include<string.h>
  319. Couldn't find file for #include<map>
  320. Couldn't find file for #include<new>
  321. Couldn't find file for #include<new>
  322. Not parsing stdio.h because it is not handled correctly by smokegen on FreeBSD based systems
  323. Couldn't find file for #include<limits.h>
  324. Couldn't find file for #include<new>
  325. Couldn't find file for #include<limits.h>
  326. Couldn't find file for #include<limits.h>
  327. Couldn't find file for #include<iterator>
  328. Couldn't find file for #include<new>
  329. Not parsing stdio.h because it is not handled correctly by smokegen on FreeBSD based systems
  330. Couldn't find file for #include<ctype.h>
  331. Couldn't find file for #include<limits.h>
  332. Couldn't find file for #include<iterator>
  333. Couldn't find file for #include<list>
  334. Couldn't find file for #include<string.h>
  335. Couldn't find file for #include<new>
  336. Couldn't find file for #include<math.h>
  337. Generating SMOKE sources...
  338. preparing SMOKE data [qtnetwork]
  339. writing out smokedata.cpp [qtnetwork]
  340. writing out x_*.cpp [qtnetwork]
  341. Done.
  342. Scanning dependencies of target smokeqtnetwork
  343. [ 40%] Building CXX object smoke/qtnetwork/CMakeFiles/smokeqtnetwork.dir/smokedata.o
  344. [ 41%] Building CXX object smoke/qtnetwork/CMakeFiles/smokeqtnetwork.dir/x_1.o
  345. Linking CXX shared library libsmokeqtnetwork.dylib
  346. [ 41%] Built target smokeqtnetwork
  347. [ 42%] Generating smokedata.cpp, x_1.cpp
  348. using generator "/Users/padillac/.rvm/gems/rbx-head@piper/gems/qtbindings-4.6.3.2/ext/build/generator/bin/generator_smoke.so"
  349. parsing "/Users/padillac/.rvm/gems/rbx-head@piper/gems/qtbindings-4.6.3.2/ext/smoke/qtdbus/qtdbus_includes.h"
  350. Couldn't find file for #include<stddef.h>
  351. Couldn't find file for #include<AvailabilityMacros.h>
  352. Couldn't find file for #include<string.h>
  353. Couldn't find file for #include<stdarg.h>
  354. Couldn't find file for #include<string>
  355. Couldn't find file for #include<stdarg.h>
  356. Couldn't find file for #include<iterator>
  357. Couldn't find file for #include<list>
  358. Couldn't find file for #include<new>
  359. Couldn't find file for #include<limits.h>
  360. Couldn't find file for #include<string.h>
  361. Couldn't find file for #include<iterator>
  362. Couldn't find file for #include<vector>
  363. Couldn't find file for #include<stdlib.h>
  364. Couldn't find file for #include<string.h>
  365. Couldn't find file for #include<map>
  366. Couldn't find file for #include<new>
  367. Couldn't find file for #include<new>
  368. Not parsing stdio.h because it is not handled correctly by smokegen on FreeBSD based systems
  369. Couldn't find file for #include<limits.h>
  370. Couldn't find file for #include<new>
  371. Couldn't find file for #include<limits.h>
  372. Couldn't find file for #include<limits.h>
  373. Couldn't find file for #include<iterator>
  374. Couldn't find file for #include<new>
  375. Not parsing stdio.h because it is not handled correctly by smokegen on FreeBSD based systems
  376. Couldn't find file for #include<ctype.h>
  377. Couldn't find file for #include<limits.h>
  378. Couldn't find file for #include<iterator>
  379. Couldn't find file for #include<list>
  380. Couldn't find file for #include<string.h>
  381. Couldn't find file for #include<new>
  382. Couldn't find file for #include<math.h>
  383. Generating SMOKE sources...
  384. preparing SMOKE data [qtdbus]
  385. writing out smokedata.cpp [qtdbus]
  386. writing out x_*.cpp [qtdbus]
  387. Done.
  388. Scanning dependencies of target smokeqtdbus
  389. [ 43%] Building CXX object smoke/qtdbus/CMakeFiles/smokeqtdbus.dir/smokedata.o
  390. [ 43%] Building CXX object smoke/qtdbus/CMakeFiles/smokeqtdbus.dir/x_1.o
  391. Linking CXX shared library libsmokeqtdbus.dylib
  392. [ 43%] Built target smokeqtdbus
  393. [ 44%] Generating smokedata.cpp, x_1.cpp, x_2.cpp, x_3.cpp, x_4.cpp, x_5.cpp, x_6.cpp, x_7.cpp, x_8.cpp, x_9.cpp, x_10.cpp, x_11.cpp, x_12.cpp, x_13.cpp, x_14.cpp, x_15.cpp, x_16.cpp, x_17.cpp, x_18.cpp, x_19.cpp, x_20.cpp
  394. using generator "/Users/padillac/.rvm/gems/rbx-head@piper/gems/qtbindings-4.6.3.2/ext/build/generator/bin/generator_smoke.so"
  395. parsing "/Users/padillac/.rvm/gems/rbx-head@piper/gems/qtbindings-4.6.3.2/ext/smoke/qtgui/qtgui_includes.h"
  396. Couldn't find file for #include<stddef.h>
  397. Couldn't find file for #include<AvailabilityMacros.h>
  398. Couldn't find file for #include<string.h>
  399. Couldn't find file for #include<stdarg.h>
  400. Couldn't find file for #include<string>
  401. Couldn't find file for #include<stdarg.h>
  402. Couldn't find file for #include<iterator>
  403. Couldn't find file for #include<list>
  404. Couldn't find file for #include<new>
  405. Couldn't find file for #include<limits.h>
  406. Couldn't find file for #include<string.h>
  407. Couldn't find file for #include<iterator>
  408. Couldn't find file for #include<vector>
  409. Couldn't find file for #include<stdlib.h>
  410. Couldn't find file for #include<string.h>
  411. Couldn't find file for #include<map>
  412. Couldn't find file for #include<new>
  413. Couldn't find file for #include<new>
  414. Not parsing stdio.h because it is not handled correctly by smokegen on FreeBSD based systems
  415. Couldn't find file for #include<limits.h>
  416. Couldn't find file for #include<new>
  417. Couldn't find file for #include<limits.h>
  418. Couldn't find file for #include<limits.h>
  419. Couldn't find file for #include<iterator>
  420. Couldn't find file for #include<new>
  421. Not parsing stdio.h because it is not handled correctly by smokegen on FreeBSD based systems
  422. Couldn't find file for #include<ctype.h>
  423. Couldn't find file for #include<limits.h>
  424. Couldn't find file for #include<iterator>
  425. Couldn't find file for #include<list>
  426. Couldn't find file for #include<string.h>
  427. Couldn't find file for #include<new>
  428. Couldn't find file for #include<math.h>
  429. Couldn't find file for #include<limits.h>
  430. Couldn't find file for #include<limits.h>
  431. Couldn't find file for #include<limits.h>
  432. Couldn't find file for #include<limits.h>
  433. Generating SMOKE sources...
  434. preparing SMOKE data [qtgui]
  435. writing out smokedata.cpp [qtgui]
  436. writing out x_*.cpp [qtgui]
  437. Done.
  438. Scanning dependencies of target smokeqtgui
  439. [ 44%] Building CXX object smoke/qtgui/CMakeFiles/smokeqtgui.dir/smokedata.o
  440. [ 45%] Building CXX object smoke/qtgui/CMakeFiles/smokeqtgui.dir/x_1.o
  441. [ 46%] Building CXX object smoke/qtgui/CMakeFiles/smokeqtgui.dir/x_2.o
  442. [ 46%] Building CXX object smoke/qtgui/CMakeFiles/smokeqtgui.dir/x_3.o
  443. [ 47%] Building CXX object smoke/qtgui/CMakeFiles/smokeqtgui.dir/x_4.o
  444. [ 48%] Building CXX object smoke/qtgui/CMakeFiles/smokeqtgui.dir/x_5.o
  445. [ 48%] Building CXX object smoke/qtgui/CMakeFiles/smokeqtgui.dir/x_6.o
  446. [ 49%] Building CXX object smoke/qtgui/CMakeFiles/smokeqtgui.dir/x_7.o
  447. [ 49%] Building CXX object smoke/qtgui/CMakeFiles/smokeqtgui.dir/x_8.o
  448. [ 50%] Building CXX object smoke/qtgui/CMakeFiles/smokeqtgui.dir/x_9.o
  449. [ 51%] Building CXX object smoke/qtgui/CMakeFiles/smokeqtgui.dir/x_10.o
  450. [ 51%] Building CXX object smoke/qtgui/CMakeFiles/smokeqtgui.dir/x_11.o
  451. [ 52%] Building CXX object smoke/qtgui/CMakeFiles/smokeqtgui.dir/x_12.o
  452. [ 53%] Building CXX object smoke/qtgui/CMakeFiles/smokeqtgui.dir/x_13.o
  453. [ 53%] Building CXX object smoke/qtgui/CMakeFiles/smokeqtgui.dir/x_14.o
  454. [ 54%] Building CXX object smoke/qtgui/CMakeFiles/smokeqtgui.dir/x_15.o
  455. [ 55%] Building CXX object smoke/qtgui/CMakeFiles/smokeqtgui.dir/x_16.o
  456. [ 55%] Building CXX object smoke/qtgui/CMakeFiles/smokeqtgui.dir/x_17.o
  457. [ 56%] Building CXX object smoke/qtgui/CMakeFiles/smokeqtgui.dir/x_18.o
  458. [ 56%] Building CXX object smoke/qtgui/CMakeFiles/smokeqtgui.dir/x_19.o
  459. [ 57%] Building CXX object smoke/qtgui/CMakeFiles/smokeqtgui.dir/x_20.o
  460. Linking CXX shared library libsmokeqtgui.dylib
  461. [ 57%] Built target smokeqtgui
  462. [ 58%] Generating smokedata.cpp, x_1.cpp
  463. using generator "/Users/padillac/.rvm/gems/rbx-head@piper/gems/qtbindings-4.6.3.2/ext/build/generator/bin/generator_smoke.so"
  464. parsing "/Users/padillac/.rvm/gems/rbx-head@piper/gems/qtbindings-4.6.3.2/ext/smoke/qtdeclarative/qtdeclarative_includes.h"
  465. Couldn't find file for #include<stddef.h>
  466. Couldn't find file for #include<AvailabilityMacros.h>
  467. Couldn't find file for #include<string.h>
  468. Couldn't find file for #include<stdarg.h>
  469. Couldn't find file for #include<string>
  470. Couldn't find file for #include<stdarg.h>
  471. Couldn't find file for #include<iterator>
  472. Couldn't find file for #include<list>
  473. Couldn't find file for #include<new>
  474. Couldn't find file for #include<limits.h>
  475. Couldn't find file for #include<string.h>
  476. Couldn't find file for #include<iterator>
  477. Couldn't find file for #include<vector>
  478. Couldn't find file for #include<stdlib.h>
  479. Couldn't find file for #include<string.h>
  480. Couldn't find file for #include<map>
  481. Couldn't find file for #include<new>
  482. Couldn't find file for #include<new>
  483. Not parsing stdio.h because it is not handled correctly by smokegen on FreeBSD based systems
  484. Couldn't find file for #include<limits.h>
  485. Couldn't find file for #include<new>
  486. Couldn't find file for #include<limits.h>
  487. Couldn't find file for #include<limits.h>
  488. Couldn't find file for #include<iterator>
  489. Couldn't find file for #include<new>
  490. Not parsing stdio.h because it is not handled correctly by smokegen on FreeBSD based systems
  491. Couldn't find file for #include<ctype.h>
  492. Couldn't find file for #include<limits.h>
  493. Couldn't find file for #include<iterator>
  494. Couldn't find file for #include<list>
  495. Couldn't find file for #include<string.h>
  496. Couldn't find file for #include<new>
  497. Couldn't find file for #include<math.h>
  498. Couldn't find file for #include<limits.h>
  499. Couldn't find file for #include<limits.h>
  500. Couldn't find file for #include<limits.h>
  501. Couldn't find file for #include<limits.h>
  502. Couldn't find file for #include<stdint.h>
  503. Generating SMOKE sources...
  504. preparing SMOKE data [qtdeclarative]
  505. writing out smokedata.cpp [qtdeclarative]
  506. writing out x_*.cpp [qtdeclarative]
  507. Done.
  508. Scanning dependencies of target smokeqtdeclarative
  509. [ 59%] Building CXX object smoke/qtdeclarative/CMakeFiles/smokeqtdeclarative.dir/smokedata.o
  510. [ 59%] Building CXX object smoke/qtdeclarative/CMakeFiles/smokeqtdeclarative.dir/x_1.o
  511. Linking CXX shared library libsmokeqtdeclarative.dylib
  512. [ 59%] Built target smokeqtdeclarative
  513. [ 60%] Generating smokedata.cpp, x_1.cpp
  514. using generator "/Users/padillac/.rvm/gems/rbx-head@piper/gems/qtbindings-4.6.3.2/ext/build/generator/bin/generator_smoke.so"
  515. parsing "/Users/padillac/.rvm/gems/rbx-head@piper/gems/qtbindings-4.6.3.2/ext/smoke/qtsvg/qtsvg_includes.h"
  516. Couldn't find file for #include<stddef.h>
  517. Couldn't find file for #include<AvailabilityMacros.h>
  518. Couldn't find file for #include<string.h>
  519. Couldn't find file for #include<stdarg.h>
  520. Couldn't find file for #include<string>
  521. Couldn't find file for #include<stdarg.h>
  522. Couldn't find file for #include<iterator>
  523. Couldn't find file for #include<list>
  524. Couldn't find file for #include<new>
  525. Couldn't find file for #include<limits.h>
  526. Couldn't find file for #include<string.h>
  527. Couldn't find file for #include<iterator>
  528. Couldn't find file for #include<vector>
  529. Couldn't find file for #include<stdlib.h>
  530. Couldn't find file for #include<string.h>
  531. Couldn't find file for #include<map>
  532. Couldn't find file for #include<new>
  533. Couldn't find file for #include<new>
  534. Not parsing stdio.h because it is not handled correctly by smokegen on FreeBSD based systems
  535. Couldn't find file for #include<limits.h>
  536. Couldn't find file for #include<new>
  537. Couldn't find file for #include<limits.h>
  538. Couldn't find file for #include<limits.h>
  539. Couldn't find file for #include<iterator>
  540. Couldn't find file for #include<new>
  541. Not parsing stdio.h because it is not handled correctly by smokegen on FreeBSD based systems
  542. Couldn't find file for #include<ctype.h>
  543. Couldn't find file for #include<limits.h>
  544. Couldn't find file for #include<iterator>
  545. Couldn't find file for #include<list>
  546. Couldn't find file for #include<string.h>
  547. Couldn't find file for #include<new>
  548. Couldn't find file for #include<math.h>
  549. Couldn't find file for #include<limits.h>
  550. Couldn't find file for #include<limits.h>
  551. Couldn't find file for #include<limits.h>
  552. Couldn't find file for #include<limits.h>
  553. Generating SMOKE sources...
  554. preparing SMOKE data [qtsvg]
  555. writing out smokedata.cpp [qtsvg]
  556. writing out x_*.cpp [qtsvg]
  557. Done.
  558. Scanning dependencies of target smokeqtsvg
  559. [ 61%] Building CXX object smoke/qtsvg/CMakeFiles/smokeqtsvg.dir/smokedata.o
  560. [ 61%] Building CXX object smoke/qtsvg/CMakeFiles/smokeqtsvg.dir/x_1.o
  561. Linking CXX shared library libsmokeqtsvg.dylib
  562. [ 61%] Built target smokeqtsvg
  563. [ 62%] Generating smokedata.cpp, x_1.cpp
  564. using generator "/Users/padillac/.rvm/gems/rbx-head@piper/gems/qtbindings-4.6.3.2/ext/build/generator/bin/generator_smoke.so"
  565. parsing "/Users/padillac/.rvm/gems/rbx-head@piper/gems/qtbindings-4.6.3.2/ext/smoke/qtsql/qtsql_includes.h"
  566. Couldn't find file for #include<stddef.h>
  567. Couldn't find file for #include<AvailabilityMacros.h>
  568. Couldn't find file for #include<string.h>
  569. Couldn't find file for #include<stdarg.h>
  570. Couldn't find file for #include<string>
  571. Couldn't find file for #include<stdarg.h>
  572. Couldn't find file for #include<iterator>
  573. Couldn't find file for #include<list>
  574. Couldn't find file for #include<new>
  575. Couldn't find file for #include<limits.h>
  576. Couldn't find file for #include<string.h>
  577. Couldn't find file for #include<iterator>
  578. Couldn't find file for #include<vector>
  579. Couldn't find file for #include<stdlib.h>
  580. Couldn't find file for #include<string.h>
  581. Couldn't find file for #include<map>
  582. Couldn't find file for #include<new>
  583. Couldn't find file for #include<new>
  584. Not parsing stdio.h because it is not handled correctly by smokegen on FreeBSD based systems
  585. Couldn't find file for #include<limits.h>
  586. Couldn't find file for #include<new>
  587. Couldn't find file for #include<limits.h>
  588. Couldn't find file for #include<limits.h>
  589. Couldn't find file for #include<iterator>
  590. Couldn't find file for #include<new>
  591. Not parsing stdio.h because it is not handled correctly by smokegen on FreeBSD based systems
  592. Couldn't find file for #include<ctype.h>
  593. Couldn't find file for #include<limits.h>
  594. Couldn't find file for #include<iterator>
  595. Couldn't find file for #include<list>
  596. Couldn't find file for #include<string.h>
  597. Couldn't find file for #include<new>
  598. Couldn't find file for #include<math.h>
  599. Couldn't find file for #include<QtGui>
  600. Generating SMOKE sources...
  601. preparing SMOKE data [qtsql]
  602. writing out smokedata.cpp [qtsql]
  603. writing out x_*.cpp [qtsql]
  604. Done.
  605. Scanning dependencies of target smokeqtsql
  606. [ 63%] Building CXX object smoke/qtsql/CMakeFiles/smokeqtsql.dir/smokedata.o
  607. [ 63%] Building CXX object smoke/qtsql/CMakeFiles/smokeqtsql.dir/x_1.o
  608. Linking CXX shared library libsmokeqtsql.dylib
  609. [ 63%] Built target smokeqtsql
  610. [ 64%] Generating smokedata.cpp, x_1.cpp
  611. using generator "/Users/padillac/.rvm/gems/rbx-head@piper/gems/qtbindings-4.6.3.2/ext/build/generator/bin/generator_smoke.so"
  612. parsing "/Users/padillac/.rvm/gems/rbx-head@piper/gems/qtbindings-4.6.3.2/ext/smoke/qtxml/qtxml_includes.h"
  613. Couldn't find file for #include<stddef.h>
  614. Couldn't find file for #include<AvailabilityMacros.h>
  615. Couldn't find file for #include<string.h>
  616. Couldn't find file for #include<stdarg.h>
  617. Couldn't find file for #include<string>
  618. Couldn't find file for #include<stdarg.h>
  619. Couldn't find file for #include<iterator>
  620. Couldn't find file for #include<list>
  621. Couldn't find file for #include<new>
  622. Couldn't find file for #include<limits.h>
  623. Couldn't find file for #include<string.h>
  624. Couldn't find file for #include<iterator>
  625. Couldn't find file for #include<vector>
  626. Couldn't find file for #include<stdlib.h>
  627. Couldn't find file for #include<string.h>
  628. Couldn't find file for #include<map>
  629. Couldn't find file for #include<new>
  630. Couldn't find file for #include<new>
  631. Not parsing stdio.h because it is not handled correctly by smokegen on FreeBSD based systems
  632. Couldn't find file for #include<limits.h>
  633. Couldn't find file for #include<new>
  634. Couldn't find file for #include<limits.h>
  635. Couldn't find file for #include<limits.h>
  636. Couldn't find file for #include<iterator>
  637. Couldn't find file for #include<new>
  638. Not parsing stdio.h because it is not handled correctly by smokegen on FreeBSD based systems
  639. Couldn't find file for #include<ctype.h>
  640. Couldn't find file for #include<limits.h>
  641. Couldn't find file for #include<iterator>
  642. Couldn't find file for #include<list>
  643. Couldn't find file for #include<string.h>
  644. Couldn't find file for #include<new>
  645. Couldn't find file for #include<math.h>
  646. Generating SMOKE sources...
  647. preparing SMOKE data [qtxml]
  648. writing out smokedata.cpp [qtxml]
  649. writing out x_*.cpp [qtxml]
  650. Done.
  651. Scanning dependencies of target smokeqtxml
  652. [ 64%] Building CXX object smoke/qtxml/CMakeFiles/smokeqtxml.dir/smokedata.o
  653. [ 65%] Building CXX object smoke/qtxml/CMakeFiles/smokeqtxml.dir/x_1.o
  654. Linking CXX shared library libsmokeqtxml.dylib
  655. [ 65%] Built target smokeqtxml
  656. [ 66%] Generating smokedata.cpp, x_1.cpp
  657. using generator "/Users/padillac/.rvm/gems/rbx-head@piper/gems/qtbindings-4.6.3.2/ext/build/generator/bin/generator_smoke.so"
  658. parsing "/Users/padillac/.rvm/gems/rbx-head@piper/gems/qtbindings-4.6.3.2/ext/smoke/qtxmlpatterns/qtxmlpatterns_includes.h"
  659. Couldn't find file for #include<stddef.h>
  660. Couldn't find file for #include<AvailabilityMacros.h>
  661. Couldn't find file for #include<string.h>
  662. Couldn't find file for #include<stdarg.h>
  663. Couldn't find file for #include<string>
  664. Couldn't find file for #include<stdarg.h>
  665. Couldn't find file for #include<iterator>
  666. Couldn't find file for #include<list>
  667. Couldn't find file for #include<new>
  668. Couldn't find file for #include<limits.h>
  669. Couldn't find file for #include<string.h>
  670. Couldn't find file for #include<iterator>
  671. Couldn't find file for #include<vector>
  672. Couldn't find file for #include<stdlib.h>
  673. Couldn't find file for #include<string.h>
  674. Couldn't find file for #include<map>
  675. Couldn't find file for #include<new>
  676. Couldn't find file for #include<new>
  677. Not parsing stdio.h because it is not handled correctly by smokegen on FreeBSD based systems
  678. Couldn't find file for #include<limits.h>
  679. Couldn't find file for #include<new>
  680. Couldn't find file for #include<limits.h>
  681. Couldn't find file for #include<limits.h>
  682. Couldn't find file for #include<iterator>
  683. Couldn't find file for #include<new>
  684. Not parsing stdio.h because it is not handled correctly by smokegen on FreeBSD based systems
  685. Couldn't find file for #include<ctype.h>
  686. Couldn't find file for #include<limits.h>
  687. Couldn't find file for #include<iterator>
  688. Couldn't find file for #include<list>
  689. Couldn't find file for #include<string.h>
  690. Couldn't find file for #include<new>
  691. Couldn't find file for #include<math.h>
  692. Generating SMOKE sources...
  693. preparing SMOKE data [qtxmlpatterns]
  694. writing out smokedata.cpp [qtxmlpatterns]
  695. writing out x_*.cpp [qtxmlpatterns]
  696. Done.
  697. Scanning dependencies of target smokeqtxmlpatterns
  698. [ 66%] Building CXX object smoke/qtxmlpatterns/CMakeFiles/smokeqtxmlpatterns.dir/smokedata.o
  699. [ 67%] Building CXX object smoke/qtxmlpatterns/CMakeFiles/smokeqtxmlpatterns.dir/x_1.o
  700. Linking CXX shared library libsmokeqtxmlpatterns.dylib
  701. [ 67%] Built target smokeqtxmlpatterns
  702. [ 67%] Generating smokedata.cpp, x_1.cpp
  703. using generator "/Users/padillac/.rvm/gems/rbx-head@piper/gems/qtbindings-4.6.3.2/ext/build/generator/bin/generator_smoke.so"
  704. parsing "/Users/padillac/.rvm/gems/rbx-head@piper/gems/qtbindings-4.6.3.2/ext/smoke/qtopengl/qtopengl_includes.h"
  705. Couldn't find file for #include<stddef.h>
  706. Couldn't find file for #include<AvailabilityMacros.h>
  707. Couldn't find file for #include<string.h>
  708. Couldn't find file for #include<stdarg.h>
  709. Couldn't find file for #include<string>
  710. Couldn't find file for #include<stdarg.h>
  711. Couldn't find file for #include<iterator>
  712. Couldn't find file for #include<list>
  713. Couldn't find file for #include<new>
  714. Couldn't find file for #include<limits.h>
  715. Couldn't find file for #include<string.h>
  716. Couldn't find file for #include<iterator>
  717. Couldn't find file for #include<vector>
  718. Couldn't find file for #include<stdlib.h>
  719. Couldn't find file for #include<string.h>
  720. Couldn't find file for #include<map>
  721. Couldn't find file for #include<new>
  722. Couldn't find file for #include<new>
  723. Not parsing stdio.h because it is not handled correctly by smokegen on FreeBSD based systems
  724. Couldn't find file for #include<limits.h>
  725. Couldn't find file for #include<new>
  726. Couldn't find file for #include<limits.h>
  727. Couldn't find file for #include<limits.h>
  728. Couldn't find file for #include<iterator>
  729. Couldn't find file for #include<new>
  730. Not parsing stdio.h because it is not handled correctly by smokegen on FreeBSD based systems
  731. Couldn't find file for #include<ctype.h>
  732. Couldn't find file for #include<limits.h>
  733. Couldn't find file for #include<iterator>
  734. Couldn't find file for #include<list>
  735. Couldn't find file for #include<string.h>
  736. Couldn't find file for #include<new>
  737. Couldn't find file for #include<math.h>
  738. Couldn't find file for #include<limits.h>
  739. Couldn't find file for #include<limits.h>
  740. Couldn't find file for #include<limits.h>
  741. Couldn't find file for #include<limits.h>
  742. Generating SMOKE sources...
  743. preparing SMOKE data [qtopengl]
  744. writing out smokedata.cpp [qtopengl]
  745. writing out x_*.cpp [qtopengl]
  746. Done.
  747. Scanning dependencies of target smokeqtopengl
  748. [ 68%] Building CXX object smoke/qtopengl/CMakeFiles/smokeqtopengl.dir/smokedata.o
  749. [ 69%] Building CXX object smoke/qtopengl/CMakeFiles/smokeqtopengl.dir/x_1.o
  750. Linking CXX shared library libsmokeqtopengl.dylib
  751. [ 69%] Built target smokeqtopengl
  752. [ 70%] Generating smokedata.cpp, x_1.cpp
  753. using generator "/Users/padillac/.rvm/gems/rbx-head@piper/gems/qtbindings-4.6.3.2/ext/build/generator/bin/generator_smoke.so"
  754. parsing "/Users/padillac/.rvm/gems/rbx-head@piper/gems/qtbindings-4.6.3.2/ext/smoke/qtwebkit/qtwebkit_includes.h"
  755. Couldn't find file for #include<stddef.h>
  756. Couldn't find file for #include<AvailabilityMacros.h>
  757. Couldn't find file for #include<string.h>
  758. Couldn't find file for #include<stdarg.h>
  759. Couldn't find file for #include<string>
  760. Couldn't find file for #include<stdarg.h>
  761. Couldn't find file for #include<iterator>
  762. Couldn't find file for #include<list>
  763. Couldn't find file for #include<new>
  764. Couldn't find file for #include<limits.h>
  765. Couldn't find file for #include<string.h>
  766. Couldn't find file for #include<iterator>
  767. Couldn't find file for #include<vector>
  768. Couldn't find file for #include<stdlib.h>
  769. Couldn't find file for #include<string.h>
  770. Couldn't find file for #include<map>
  771. Couldn't find file for #include<new>
  772. Couldn't find file for #include<new>
  773. Not parsing stdio.h because it is not handled correctly by smokegen on FreeBSD based systems
  774. Couldn't find file for #include<limits.h>
  775. Couldn't find file for #include<new>
  776. Couldn't find file for #include<limits.h>
  777. Couldn't find file for #include<limits.h>
  778. Couldn't find file for #include<iterator>
  779. Couldn't find file for #include<new>
  780. Not parsing stdio.h because it is not handled correctly by smokegen on FreeBSD based systems
  781. Couldn't find file for #include<ctype.h>
  782. Couldn't find file for #include<limits.h>
  783. Couldn't find file for #include<iterator>
  784. Couldn't find file for #include<list>
  785. Couldn't find file for #include<string.h>
  786. Couldn't find file for #include<new>
  787. Couldn't find file for #include<math.h>
  788. Generating SMOKE sources...
  789. preparing SMOKE data [qtwebkit]
  790. writing out smokedata.cpp [qtwebkit]
  791. writing out x_*.cpp [qtwebkit]
  792. Done.
  793. Scanning dependencies of target smokeqtwebkit
  794. [ 70%] Building CXX object smoke/qtwebkit/CMakeFiles/smokeqtwebkit.dir/smokedata.o
  795. [ 71%] Building CXX object smoke/qtwebkit/CMakeFiles/smokeqtwebkit.dir/x_1.o
  796. Linking CXX shared library libsmokeqtwebkit.dylib
  797. [ 71%] Built target smokeqtwebkit
  798. [ 71%] Generating smokedata.cpp, x_1.cpp
  799. using generator "/Users/padillac/.rvm/gems/rbx-head@piper/gems/qtbindings-4.6.3.2/ext/build/generator/bin/generator_smoke.so"
  800. parsing "/Users/padillac/.rvm/gems/rbx-head@piper/gems/qtbindings-4.6.3.2/ext/smoke/qtscript/qtscript_includes.h"
  801. Couldn't find file for #include<stddef.h>
  802. Couldn't find file for #include<AvailabilityMacros.h>
  803. Couldn't find file for #include<string.h>
  804. Couldn't find file for #include<stdarg.h>
  805. Couldn't find file for #include<string>
  806. Couldn't find file for #include<stdarg.h>
  807. Couldn't find file for #include<iterator>
  808. Couldn't find file for #include<list>
  809. Couldn't find file for #include<new>
  810. Couldn't find file for #include<limits.h>
  811. Couldn't find file for #include<string.h>
  812. Couldn't find file for #include<map>
  813. Couldn't find file for #include<new>
  814. Couldn't find file for #include<new>
  815. Generating SMOKE sources...
  816. preparing SMOKE data [qtscript]
  817. writing out smokedata.cpp [qtscript]
  818. writing out x_*.cpp [qtscript]
  819. Done.
  820. Scanning dependencies of target smokeqtscript
  821. [ 72%] Building CXX object smoke/qtscript/CMakeFiles/smokeqtscript.dir/smokedata.o
  822. [ 73%] Building CXX object smoke/qtscript/CMakeFiles/smokeqtscript.dir/x_1.o
  823. Linking CXX shared library libsmokeqtscript.dylib
  824. [ 73%] Built target smokeqtscript
  825. [ 74%] Generating smokedata.cpp, x_1.cpp
  826. using generator "/Users/padillac/.rvm/gems/rbx-head@piper/gems/qtbindings-4.6.3.2/ext/build/generator/bin/generator_smoke.so"
  827. parsing "/Users/padillac/.rvm/gems/rbx-head@piper/gems/qtbindings-4.6.3.2/ext/smoke/qtuitools/qtuitools_includes.h"
  828. Couldn't find file for #include<stddef.h>
  829. Couldn't find file for #include<AvailabilityMacros.h>
  830. Couldn't find file for #include<string.h>
  831. Couldn't find file for #include<stdarg.h>
  832. Couldn't find file for #include<string>
  833. Couldn't find file for #include<stdarg.h>
  834. Couldn't find file for #include<iterator>
  835. Couldn't find file for #include<list>
  836. Couldn't find file for #include<new>
  837. Couldn't find file for #include<limits.h>
  838. Couldn't find file for #include<string.h>
  839. Couldn't find file for #include<iterator>
  840. Couldn't find file for #include<vector>
  841. Couldn't find file for #include<stdlib.h>
  842. Couldn't find file for #include<string.h>
  843. Couldn't find file for #include<map>
  844. Couldn't find file for #include<new>
  845. Couldn't find file for #include<new>
  846. Not parsing stdio.h because it is not handled correctly by smokegen on FreeBSD based systems
  847. Couldn't find file for #include<limits.h>
  848. Couldn't find file for #include<new>
  849. Couldn't find file for #include<limits.h>
  850. Couldn't find file for #include<limits.h>
  851. Couldn't find file for #include<iterator>
  852. Couldn't find file for #include<new>
  853. Not parsing stdio.h because it is not handled correctly by smokegen on FreeBSD based systems
  854. Couldn't find file for #include<ctype.h>
  855. Couldn't find file for #include<limits.h>
  856. Couldn't find file for #include<iterator>
  857. Couldn't find file for #include<list>
  858. Couldn't find file for #include<string.h>
  859. Couldn't find file for #include<new>
  860. Couldn't find file for #include<math.h>
  861. Generating SMOKE sources...
  862. preparing SMOKE data [qtuitools]
  863. writing out smokedata.cpp [qtuitools]
  864. writing out x_*.cpp [qtuitools]
  865. Done.
  866. Scanning dependencies of target smokeqtuitools
  867. [ 75%] Building CXX object smoke/qtuitools/CMakeFiles/smokeqtuitools.dir/smokedata.o
  868. [ 75%] Building CXX object smoke/qtuitools/CMakeFiles/smokeqtuitools.dir/x_1.o
  869. Linking CXX shared library libsmokeqtuitools.dylib
  870. ld: warning: QList<QString>::free(QListData::Data*)       has different visibility (hidden) in /usr/local/Cellar/qt/4.7.1/lib/libQtUiTools.a(quiloader.o) and (default) in CMakeFiles/smokeqtuitools.dir/x_1.o
  871. ld: warning: QList<QString>::detach_helper(int)    has different visibility (hidden) in /usr/local/Cellar/qt/4.7.1/lib/libQtUiTools.a(quiloader.o) and (default) in CMakeFiles/smokeqtuitools.dir/x_1.o
  872. ld: warning: QList<QString>::detach_helper()       has different visibility (hidden) in /usr/local/Cellar/qt/4.7.1/lib/libQtUiTools.a(quiloader.o) and (default) in CMakeFiles/smokeqtuitools.dir/x_1.o
  873. ld: warning: QList<QString>::~QList() has different visibility (hidden) in /usr/local/Cellar/qt/4.7.1/lib/libQtUiTools.a(quiloader.o) and (default) in CMakeFiles/smokeqtuitools.dir/x_1.o
  874. [ 75%] Built target smokeqtuitools
  875. [ 76%] Generating smokedata.cpp, x_1.cpp
  876. using generator "/Users/padillac/.rvm/gems/rbx-head@piper/gems/qtbindings-4.6.3.2/ext/build/generator/bin/generator_smoke.so"
  877. parsing "/Users/padillac/.rvm/gems/rbx-head@piper/gems/qtbindings-4.6.3.2/ext/smoke/qttest/qttest_includes.h"
  878. Couldn't find file for #include<stddef.h>
  879. Couldn't find file for #include<AvailabilityMacros.h>
  880. Couldn't find file for #include<string.h>
  881. Couldn't find file for #include<stdarg.h>
  882. Couldn't find file for #include<iterator>
  883. Couldn't find file for #include<list>
  884. Couldn't find file for #include<new>
  885. Couldn't find file for #include<limits.h>
  886. Couldn't find file for #include<string.h>
  887. Couldn't find file for #include<string>
  888. Couldn't find file for #include<stdarg.h>
  889. Couldn't find file for #include<map>
  890. Couldn't find file for #include<new>
  891. Couldn't find file for #include<new>
  892. Couldn't find file for #include<iterator>
  893. Couldn't find file for #include<vector>
  894. Couldn't find file for #include<stdlib.h>
  895. Couldn't find file for #include<string.h>
  896. Couldn't find file for #include<stdlib.h>
  897. Generating SMOKE sources...
  898. preparing SMOKE data [qttest]
  899. writing out smokedata.cpp [qttest]
  900. writing out x_*.cpp [qttest]
  901. Done.
  902. Scanning dependencies of target smokeqttest
  903. [ 77%] Building CXX object smoke/qttest/CMakeFiles/smokeqttest.dir/smokedata.o
  904. [ 77%] Building CXX object smoke/qttest/CMakeFiles/smokeqttest.dir/x_1.o
  905. Linking CXX shared library libsmokeqttest.dylib
  906. [ 77%] Built target smokeqttest
  907. [ 78%] Generating smokedata.cpp, x_1.cpp
  908. using generator "/Users/padillac/.rvm/gems/rbx-head@piper/gems/qtbindings-4.6.3.2/ext/build/generator/bin/generator_smoke.so"
  909. parsing "/Users/padillac/.rvm/gems/rbx-head@piper/gems/qtbindings-4.6.3.2/ext/smoke/qtmultimedia/qtmultimedia_includes.h"
  910. Couldn't find file for #include<stddef.h>
  911. Couldn't find file for #include<AvailabilityMacros.h>
  912. Couldn't find file for #include<string.h>
  913. Couldn't find file for #include<stdarg.h>
  914. Couldn't find file for #include<string>
  915. Couldn't find file for #include<stdarg.h>
  916. Couldn't find file for #include<iterator>
  917. Couldn't find file for #include<list>
  918. Couldn't find file for #include<new>
  919. Couldn't find file for #include<limits.h>
  920. Couldn't find file for #include<string.h>
  921. Couldn't find file for #include<iterator>
  922. Couldn't find file for #include<vector>
  923. Couldn't find file for #include<stdlib.h>
  924. Couldn't find file for #include<string.h>
  925. Couldn't find file for #include<map>
  926. Couldn't find file for #include<new>
  927. Couldn't find file for #include<new>
  928. Not parsing stdio.h because it is not handled correctly by smokegen on FreeBSD based systems
  929. Couldn't find file for #include<limits.h>
  930. Couldn't find file for #include<new>
  931. Couldn't find file for #include<limits.h>
  932. Couldn't find file for #include<limits.h>
  933. Couldn't find file for #include<iterator>
  934. Couldn't find file for #include<new>
  935. Not parsing stdio.h because it is not handled correctly by smokegen on FreeBSD based systems
  936. Couldn't find file for #include<ctype.h>
  937. Couldn't find file for #include<limits.h>
  938. Couldn't find file for #include<iterator>
  939. Couldn't find file for #include<list>
  940. Couldn't find file for #include<string.h>
  941. Couldn't find file for #include<new>
  942. Couldn't find file for #include<math.h>
  943. Couldn't find file for #include<limits.h>
  944. Couldn't find file for #include<limits.h>
  945. Couldn't find file for #include<limits.h>
  946. Couldn't find file for #include<limits.h>
  947. Generating SMOKE sources...
  948. preparing SMOKE data [qtmultimedia]
  949. writing out smokedata.cpp [qtmultimedia]
  950. writing out x_*.cpp [qtmultimedia]
  951. Done.
  952. Scanning dependencies of target smokeqtmultimedia
  953. [ 78%] Building CXX object smoke/qtmultimedia/CMakeFiles/smokeqtmultimedia.dir/smokedata.o
  954. [ 79%] Building CXX object smoke/qtmultimedia/CMakeFiles/smokeqtmultimedia.dir/x_1.o
  955. Linking CXX shared library libsmokeqtmultimedia.dylib
  956. [ 79%] Built target smokeqtmultimedia
  957. [ 80%] Generating smokedata.cpp, x_1.cpp
  958. using generator "/Users/padillac/.rvm/gems/rbx-head@piper/gems/qtbindings-4.6.3.2/ext/build/generator/bin/generator_smoke.so"
  959. parsing "/Users/padillac/.rvm/gems/rbx-head@piper/gems/qtbindings-4.6.3.2/ext/smoke/qthelp/qthelp_includes.h"
  960. Couldn't find file for #include<stddef.h>
  961. Couldn't find file for #include<AvailabilityMacros.h>
  962. Couldn't find file for #include<string.h>
  963. Couldn't find file for #include<stdarg.h>
  964. Couldn't find file for #include<string>
  965. Couldn't find file for #include<stdarg.h>
  966. Couldn't find file for #include<iterator>
  967. Couldn't find file for #include<list>
  968. Couldn't find file for #include<new>
  969. Couldn't find file for #include<limits.h>
  970. Couldn't find file for #include<string.h>
  971. Couldn't find file for #include<iterator>
  972. Couldn't find file for #include<vector>
  973. Couldn't find file for #include<stdlib.h>
  974. Couldn't find file for #include<string.h>
  975. Couldn't find file for #include<map>
  976. Couldn't find file for #include<new>
  977. Couldn't find file for #include<new>
  978. Not parsing stdio.h because it is not handled correctly by smokegen on FreeBSD based systems
  979. Couldn't find file for #include<limits.h>
  980. Couldn't find file for #include<new>
  981. Couldn't find file for #include<limits.h>
  982. Couldn't find file for #include<limits.h>
  983. Couldn't find file for #include<iterator>
  984. Couldn't find file for #include<new>
  985. Not parsing stdio.h because it is not handled correctly by smokegen on FreeBSD based systems
  986. Couldn't find file for #include<ctype.h>
  987. Couldn't find file for #include<limits.h>
  988. Couldn't find file for #include<iterator>
  989. Couldn't find file for #include<list>
  990. Couldn't find file for #include<string.h>
  991. Couldn't find file for #include<new>
  992. Couldn't find file for #include<math.h>
  993. Generating SMOKE sources...
  994. preparing SMOKE data [qthelp]
  995. writing out smokedata.cpp [qthelp]
  996. writing out x_*.cpp [qthelp]
  997. Done.
  998. Scanning dependencies of target smokeqthelp
  999. [ 80%] Building CXX object smoke/qthelp/CMakeFiles/smokeqthelp.dir/smokedata.o
  1000. [ 81%] Building CXX object smoke/qthelp/CMakeFiles/smokeqthelp.dir/x_1.o
  1001. Linking CXX shared library libsmokeqthelp.dylib
  1002. [ 81%] Built target smokeqthelp
  1003. Scanning dependencies of target qtruby4shared
  1004. [ 81%] Building CXX object ruby/qtruby/src/CMakeFiles/qtruby4shared.dir/Qt.o
  1005. /Users/padillac/.rvm/gems/rbx-head@piper/gems/qtbindings-4.6.3.2/ext/ruby/qtruby/src/Qt.cpp: In member function ‘virtual bool QtRuby::Binding::callMethod(short int, void*, Smoke::StackItem*, bool)’:
  1006. /Users/padillac/.rvm/gems/rbx-head@piper/gems/qtbindings-4.6.3.2/ext/ruby/qtruby/src/Qt.cpp:303: error: ‘rb_during_gc’ was not declared in this scope
  1007. make[3]: *** [ruby/qtruby/src/CMakeFiles/qtruby4shared.dir/Qt.o] Error 1
  1008. make[2]: *** [ruby/qtruby/src/CMakeFiles/qtruby4shared.dir/all] Error 2
  1009. make[1]: *** [all] Error 2
  1010. make: *** [build] Error 2
  1011.  
  1012.  
  1013. Gem files will remain installed in /Users/padillac/.rvm/gems/rbx-head@piper/gems/qtbindings-4.6.3.2 for inspection.
  1014. Results logged to /Users/padillac/.rvm/gems/rbx-head@piper/gems/qtbindings-4.6.3.2/./gem_make.out
  1015. [padillac@luckbox piper:master]
RAW Paste Data
We use cookies for various purposes including analytics. By continuing to use Pastebin, you agree to our use of cookies as described in the Cookies Policy. OK, I Understand
 
Top