daily pastebin goal
17%
SHARE
TWEET

Untitled

a guest Dec 14th, 2017 45 Never
Not a member of Pastebin yet? Sign Up, it unlocks many cool features!
  1. checking for pkg-config... /usr/bin/pkg-config
  2. checking for roff2html... no
  3. checking for distro... redhat
  4. checking pkg-config is at least version 0.9.0... yes
  5. checking for LIBNETCONF... yes
  6. checking for uname... yes
  7. checking for host architecture... x86_64
  8. checking for lnctool... yes
  9. checking python module: os... yes
  10. checking python module: copy... yes
  11. checking python module: curses... yes
  12. checking python module: libxml2... yes
  13. checking python module: subprocess... yes
  14. checking python module: re... yes
  15. checking python module: string... yes
  16. checking python module: argparse... yes
  17. checking python module: xml... yes
  18. checking for rpmbuild... rpmbuild
  19. checking for clang... no
  20. checking for llvm-gcc... no
  21. checking for gcc... gcc
  22. checking whether the C compiler works... no
  23. configure: error: in `/root/NetConf/netopeer-master/server':
  24. configure: error: C compiler cannot create executables
  25. See `config.log' for more details
  26.  
  27.  
  28. **config.log :**
  29. This file contains any messages produced by compilers while
  30. running configure, to aid debugging if configure makes a mistake.
  31.  
  32. It was created by netopeer-server configure 0.8.0, which was
  33. generated by GNU Autoconf 2.69.  Invocation command line was
  34.  
  35.   $ ./configure
  36.  
  37. ## --------- ##
  38. ## Platform. ##
  39. ## --------- ##
  40.  
  41. hostname = sys-214-08
  42. uname -m = x86_64
  43. uname -r = 3.10.1
  44. uname -s = Linux
  45. uname -v = #2 SMP Sat Jun 28 09:52:42 IST 2014
  46.  
  47. /usr/bin/uname -p = x86_64
  48. /bin/uname -X     = unknown
  49.  
  50. /bin/arch              = x86_64
  51. /usr/bin/arch -k       = unknown
  52. /usr/convex/getsysinfo = unknown
  53. /usr/bin/hostinfo      = unknown
  54. /bin/machine           = unknown
  55. /usr/bin/oslevel       = unknown
  56. /bin/universe          = unknown
  57.  
  58. PATH: /usr/bin
  59. PATH: /opt/Qt5.1.1/5.1.1/gcc_64/bin
  60. PATH: /usr/local/sbin
  61. PATH: /usr/local/bin
  62. PATH: /usr/sbin
  63. PATH: /usr/bin
  64. PATH: /root/bin
  65.  
  66.  
  67. ## ----------- ##
  68. ## Core tests. ##
  69. ## ----------- ##
  70.  
  71. configure:2478: checking for pkg-config
  72. configure:2496: found /usr/bin/pkg-config
  73. configure:2509: result: /usr/bin/pkg-config
  74. configure:2524: checking for roff2html
  75. configure:2555: result: no
  76. configure:2592: checking for distro
  77. configure:2594: result: redhat
  78. configure:2791: checking pkg-config is at least version 0.9.0
  79. configure:2794: result: yes
  80. configure:2815: checking for LIBNETCONF
  81. configure:2900: result: yes
  82. configure:2937: checking for uname
  83. configure:2953: found /usr/bin/uname
  84. configure:2965: result: yes
  85. configure:2978: checking for host architecture
  86. configure:2987: result: x86_64
  87. configure:3007: checking for lnctool
  88. configure:3023: found /usr/local/bin/lnctool
  89. configure:3035: result: yes
  90. configure:3055: checking python module: os
  91. configure:3060: result: yes
  92. configure:3081: checking python module: copy
  93. configure:3086: result: yes
  94. configure:3107: checking python module: curses
  95. configure:3112: result: yes
  96. configure:3133: checking python module: libxml2
  97. configure:3138: result: yes
  98. configure:3159: checking python module: subprocess
  99. configure:3164: result: yes
  100. configure:3185: checking python module: re
  101. configure:3190: result: yes
  102. configure:3211: checking python module: string
  103. configure:3216: result: yes
  104. configure:3237: checking python module: argparse
  105. configure:3242: result: yes
  106. configure:3263: checking python module: xml
  107. configure:3268: result: yes
  108. configure:3289: checking for rpmbuild
  109. configure:3305: found /usr/bin/rpmbuild
  110. configure:3316: result: rpmbuild
  111. configure:3380: checking for clang
  112. configure:3410: result: no
  113. configure:3380: checking for llvm-gcc
  114. configure:3410: result: no
  115. configure:3380: checking for gcc
  116. configure:3396: found /usr/bin/gcc
  117. configure:3407: result: gcc
  118. configure:3438: checking for C compiler version
  119. configure:3447: gcc --version >&5
  120. gcc (GCC) 4.8.2 20140120 (Red Hat 4.8.2-16)
  121. Copyright (C) 2013 Free Software Foundation, Inc.
  122. This is free software; see the source for copying conditions.  There is NO
  123. warranty; not even for MERCHANTABILITY or FITNESS FOR A PARTICULAR PURPOSE.
  124.  
  125. configure:3458: $? = 0
  126. configure:3447: gcc -v >&5
  127. Using built-in specs.
  128. COLLECT_GCC=gcc
  129. COLLECT_LTO_WRAPPER=/usr/libexec/gcc/x86_64-redhat-linux/4.8.2/lto-wrapper
  130. Target: x86_64-redhat-linux
  131. Configured with: ../configure --prefix=/usr --mandir=/usr/share/man --infodir=/usr/share/info --with-bugurl=http://bugzilla.redhat.com/bugzilla --enable-bootstrap --enable-shared --enable-threads=posix --enable-checking=release --with-system-zlib --enable-__cxa_atexit --disable-libunwind-exceptions --enable-gnu-unique-object --enable-linker-build-id --with-linker-hash-style=gnu --enable-languages=c,c++,objc,obj-c++,java,fortran,ada,go,lto --enable-plugin --enable-initfini-array --disable-libgcj --with-isl=/builddir/build/BUILD/gcc-4.8.2-20140120/obj-x86_64-redhat-linux/isl-install --with-cloog=/builddir/build/BUILD/gcc-4.8.2-20140120/obj-x86_64-redhat-linux/cloog-install --enable-gnu-indirect-function --with-tune=generic --with-arch_32=x86-64 --build=x86_64-redhat-linux
  132. Thread model: posix
  133. gcc version 4.8.2 20140120 (Red Hat 4.8.2-16) (GCC)
  134. configure:3458: $? = 0
  135. configure:3447: gcc -V >&5
  136. gcc: error: unrecognized command line option '-V'
  137. gcc: fatal error: no input files
  138. compilation terminated.
  139. configure:3458: $? = 4
  140. configure:3447: gcc -qversion >&5
  141. gcc: error: unrecognized command line option '-qversion'
  142. gcc: fatal error: no input files
  143. compilation terminated.
  144. configure:3458: $? = 4
  145. configure:3478: checking whether the C compiler works
  146. configure:3500: gcc -Wall -Wextra -O3 /usr/local/lib  -DRCSID="$(IDNOGIT)"  conftest.c /usr/local/lib  >&5
  147. <command-line>:0:8: warning: missing terminating " character [enabled by default]
  148. /usr/local/lib: file not recognized: Is a directory
  149. collect2: error: ld returned 1 exit status
  150. configure:3504: $? = 1
  151. configure:3542: result: no
  152. configure: failed program was:
  153. | /* confdefs.h */
  154. | #define PACKAGE_NAME "netopeer-server"
  155. | #define PACKAGE_TARNAME "netopeer-server"
  156. | #define PACKAGE_VERSION "0.8.0"
  157. | #define PACKAGE_STRING "netopeer-server 0.8.0"
  158. | #define PACKAGE_BUGREPORT ""
  159. | #define PACKAGE_URL ""
  160. | /* end confdefs.h.  */
  161. |
  162. | int
  163. | main ()
  164. | {
  165. |
  166. |   ;
  167. |   return 0;
  168. | }
  169. configure:3547: error: in `/root/NetConf/netopeer-master/server':
  170. configure:3549: error: C compiler cannot create executables
  171. See `config.log' for more details
  172.  
  173. ## ---------------- ##
  174. ## Cache variables. ##
  175. ## ---------------- ##
  176.  
  177. ac_cv_env_CC_set=
  178. ac_cv_env_CC_value=
  179. ac_cv_env_CFLAGS_set=
  180. ac_cv_env_CFLAGS_value=
  181. ac_cv_env_CPPFLAGS_set=
  182. ac_cv_env_CPPFLAGS_value=
  183. ac_cv_env_CPP_set=
  184. ac_cv_env_CPP_value=
  185. ac_cv_env_LDFLAGS_set=
  186. ac_cv_env_LDFLAGS_value=
  187. ac_cv_env_LIBNETCONF_CFLAGS_set=set
  188. ac_cv_env_LIBNETCONF_CFLAGS_value=/usr/local/lib
  189. ac_cv_env_LIBNETCONF_LIBS_set=set
  190. ac_cv_env_LIBNETCONF_LIBS_value=/usr/local/lib
  191. ac_cv_env_LIBS_set=
  192. ac_cv_env_LIBS_value=
  193. ac_cv_env_PKG_CONFIG_LIBDIR_set=
  194. ac_cv_env_PKG_CONFIG_LIBDIR_value=
  195. ac_cv_env_PKG_CONFIG_PATH_set=set
  196. ac_cv_env_PKG_CONFIG_PATH_value=/usr/bin/pkg-config
  197. ac_cv_env_PKG_CONFIG_set=
  198. ac_cv_env_PKG_CONFIG_value=
  199. ac_cv_env_build_alias_set=
  200. ac_cv_env_build_alias_value=
  201. ac_cv_env_host_alias_set=
  202. ac_cv_env_host_alias_value=
  203. ac_cv_env_target_alias_set=
  204. ac_cv_env_target_alias_value=
  205. ac_cv_path_PKG_CONFIG=/usr/bin/pkg-config
  206. ac_cv_path_ROFF2HTML=no
  207. ac_cv_prog_LNCTOOL_EXISTS=yes
  208. ac_cv_prog_RPMBUILD=rpmbuild
  209. ac_cv_prog_UNAME=yes
  210. ac_cv_prog_ac_ct_CC=gcc
  211. pkg_cv_LIBNETCONF_CFLAGS=/usr/local/lib
  212. pkg_cv_LIBNETCONF_LIBS=/usr/local/lib
  213.  
  214. ## ----------------- ##
  215. ## Output variables. ##
  216. ## ----------------- ##
  217.  
  218. BUILDREQS=' libnetconf-devel python'
  219. CC='gcc'
  220. CFLAGS='-Wall -Wextra -O3'
  221. CLIENT_STRUCT_SIZE=''
  222. CONFIGURE_PARAMS=''
  223. CONFIGURE_PWD='/root/NetConf/netopeer-master/server'
  224. CPP=''
  225. CPPFLAGS='/usr/local/lib  -DRCSID="$(IDNOGIT)"'
  226. DEFS=''
  227. DISTRO='redhat'
  228. ECHO_C=''
  229. ECHO_N='-n'
  230. ECHO_T=''
  231. EGREP=''
  232. EXEEXT=''
  233. GREP=''
  234. INSTALL_DATA=''
  235. INSTALL_PROGRAM=''
  236. INSTALL_SCRIPT=''
  237. LDFLAGS=''
  238. LIBNETCONF_CFLAGS='/usr/local/lib'
  239. LIBNETCONF_DATADIR='/usr/local/share'
  240. LIBNETCONF_LIBS='/usr/local/lib'
  241. LIBOBJS=''
  242. LIBS='/usr/local/lib '
  243. LNCTOOL_EXISTS='yes'
  244. LTLIBOBJS=''
  245. MODULESDIR=''
  246. NCSERVER_FEATURES=''
  247. NETOPEER_FEATURES=''
  248. NPCONF='yes'
  249. OBJEXT=''
  250. PACKAGE_BUGREPORT=''
  251. PACKAGE_NAME='netopeer-server'
  252. PACKAGE_STRING='netopeer-server 0.8.0'
  253. PACKAGE_TARNAME='netopeer-server'
  254. PACKAGE_URL=''
  255. PACKAGE_VERSION='0.8.0'
  256. PATH_SEPARATOR=':'
  257. PKG_CONFIG='/usr/bin/pkg-config'
  258. PKG_CONFIG_LIBDIR=''
  259. PKG_CONFIG_PATH='/usr/bin/pkg-config:/usr/local/lib/pkgconfig'
  260. PTHREAD_CC=''
  261. PTHREAD_CFLAGS=''
  262. PTHREAD_LIBS=''
  263. RELEASE='1'
  264. REQS=' libnetconf python'
  265. ROFF2HTML='no'
  266. RPMBUILD='rpmbuild'
  267. SERVER_LIBS=''
  268. SERVER_TLS_CFGS=''
  269. SERVER_TRANSPORT_HDRS=''
  270. SERVER_TRANSPORT_SRCS=''
  271. SHELL='/bin/sh'
  272. SSH='yes'
  273. TLS='no'
  274. UNAME='yes'
  275. USERMAIL=''
  276. USERNAME=''
  277. XML2_CONFIG=''
  278. ac_ct_CC='gcc'
  279. ax_pthread_config=''
  280. bindir='${exec_prefix}/bin'
  281. build=''
  282. build_alias=''
  283. build_cpu=''
  284. build_os=''
  285. build_vendor=''
  286. datadir='${datarootdir}'
  287. datarootdir='${prefix}/share'
  288. docdir='${datarootdir}/doc/${PACKAGE_TARNAME}'
  289. dvidir='${docdir}'
  290. exec_prefix='NONE'
  291. host=''
  292. host_alias=''
  293. host_cpu=''
  294. host_os=''
  295. host_vendor=''
  296. htmldir='${docdir}'
  297. includedir='${prefix}/include'
  298. infodir='${datarootdir}/info'
  299. libdir='${prefix}/lib64'
  300. libexecdir='${exec_prefix}/libexec'
  301. localedir='${datarootdir}/locale'
  302. localstatedir='${prefix}/var'
  303. mandir='${datarootdir}/man'
  304. oldincludedir='/usr/include'
  305. pdfdir='${docdir}'
  306. prefix='NONE'
  307. program_transform_name='s,x,x,'
  308. psdir='${docdir}'
  309. sbindir='${exec_prefix}/sbin'
  310. sharedstatedir='${prefix}/com'
  311. sysconfdir='${prefix}/etc'
  312. target_alias=''
  313.  
  314. ## ----------- ##
  315. ## confdefs.h. ##
  316. ## ----------- ##
  317.  
  318. /* confdefs.h */
  319. #define PACKAGE_NAME "netopeer-server"
  320. #define PACKAGE_TARNAME "netopeer-server"
  321. #define PACKAGE_VERSION "0.8.0"
  322. #define PACKAGE_STRING "netopeer-server 0.8.0"
  323. #define PACKAGE_BUGREPORT ""
  324. #define PACKAGE_URL ""
  325.  
  326. configure: exit 77
  327.    
  328. configure:2592: checking for distro
  329. configure:2594: result: redhat
  330.    
  331. configure:3447: gcc -v >&5
  332. Using built-in specs.
  333. COLLECT_GCC=gcc
  334. COLLECT_LTO_WRAPPER=/usr/libexec/gcc/x86_64-redhat-linux/4.8.2/lto-wrapper
  335. Target: x86_64-redhat-linux
  336. Configured with: ../configure --prefix=/usr --mandir=/usr/share/man --infodir=/usr/share/info --with-bugurl=http://bugzilla.redhat.com/bugzilla --enable-bootstrap --enable-shared --enable-threads=posix --enable-checking=release --with-system-zlib --enable-__cxa_atexit --disable-libunwind-exceptions --enable-gnu-unique-object --enable-linker-build-id --with-linker-hash-style=gnu --enable-languages=c,c++,objc,obj-c++,java,fortran,ada,go,lto --enable-plugin --enable-initfini-array --disable-libgcj --with-isl=/builddir/build/BUILD/gcc-4.8.2-20140120/obj-x86_64-redhat-linux/isl-install --with-cloog=/builddir/build/BUILD/gcc-4.8.2-20140120/obj-x86_64-redhat-linux/cloog-install --enable-gnu-indirect-function --with-tune=generic --with-arch_32=x86-64 --build=x86_64-redhat-linux
  337. Thread model: posix
  338. gcc version 4.8.2 20140120 (Red Hat 4.8.2-16) (GCC)
  339.    
  340. configure:3478: checking whether the C compiler works
  341. configure:3500: gcc -Wall -Wextra -O3 /usr/local/lib  -DRCSID="$(IDNOGIT)"  conftest.c /usr/local/lib  >&5
  342. <command-line>:0:8: warning: missing terminating " character [enabled by default]
  343. /usr/local/lib: file not recognized: Is a directory
RAW Paste Data
Top