Guest User

Untitled

a guest
Mar 20th, 2021
42
Never
Not a member of Pastebin yet? Sign Up, it unlocks many cool features!
  1. 12:07:26: Starting: "C:\Qt\Tools\QtCreator\bin\jom.exe" -f C:/Users/etien/Documents/build-project4-Desktop_Qt_6_0_2_MSVC2019_64bit-Debug/Makefile qmake_all
  2.  
  3. jom 1.1.3 - empower your cores
  4.  
  5. 12:07:26: The process "C:\Qt\Tools\QtCreator\bin\jom.exe" exited normally.
  6. 12:07:26: Starting: "C:\Qt\Tools\QtCreator\bin\jom.exe"
  7. C:\Qt\Tools\QtCreator\bin\jom.exe -f Makefile.Debug
  8. C:\Qt\6.0.2\msvc2019_64\bin\uic.exe ..\project4\loginwindow.ui -o ui_loginwindow.h
  9. C:\Qt\6.0.2\msvc2019_64\bin\uic.exe ..\project4\mainwindow.ui -o ui_mainwindow.h
  10. ..\project4\mainwindow.ui: Warning: The name 'horizontalLayout' (QHBoxLayout) is already in use, defaulting to 'horizontalLayout1'.
  11. ..\project4\mainwindow.ui: Warning: The name 'horizontalLayout' (QHBoxLayout) is already in use, defaulting to 'horizontalLayout2'.
  12. cl -c -nologo -Zc:wchar_t -FS -Zc:rvalueCast -Zc:inline -Zc:strictStrings -Zc:throwingNew -permissive- -Zc:__cplusplus -Zc:externConstexpr -Zi -MDd -std:c++17 -utf-8 -W3 -w34100 -w34189 -w44996 -w44456 -w44457 -w44458 -wd4577 -wd4467 -EHsc /Fddebug\project4.vc.pdb -DUNICODE -D_UNICODE -DWIN32 -D_ENABLE_EXTENDED_ALIGNED_STORAGE -DWIN64 -DQT_WIDGETS_LIB -DQT_GUI_LIB -DQT_NETWORK_LIB -DQT_CORE_LIB -I..\project4 -I. -I..\..\..\..\Qt\6.0.2\msvc2019_64\include -I..\..\..\..\Qt\6.0.2\msvc2019_64\include\QtWidgets -I..\..\..\..\Qt\6.0.2\msvc2019_64\include\QtGui -I..\..\..\..\Qt\6.0.2\msvc2019_64\include\QtNetwork -I..\..\..\..\Qt\6.0.2\msvc2019_64\include\QtCore -Idebug -I. -I/include -I..\..\..\..\Qt\6.0.2\msvc2019_64\mkspecs\win32-msvc -Fodebug\ @C:\Users\etien\AppData\Local\Temp\main.obj.3324.78.jom
  13. cl -c -nologo -Zc:wchar_t -FS -Zc:rvalueCast -Zc:inline -Zc:strictStrings -Zc:throwingNew -permissive- -Zc:__cplusplus -Zc:externConstexpr -Zi -MDd -std:c++17 -utf-8 -W3 -w34100 -w34189 -w44996 -w44456 -w44457 -w44458 -wd4577 -wd4467 -EHsc /Fddebug\project4.vc.pdb -DUNICODE -D_UNICODE -DWIN32 -D_ENABLE_EXTENDED_ALIGNED_STORAGE -DWIN64 -DQT_WIDGETS_LIB -DQT_GUI_LIB -DQT_NETWORK_LIB -DQT_CORE_LIB -I..\project4 -I. -I..\..\..\..\Qt\6.0.2\msvc2019_64\include -I..\..\..\..\Qt\6.0.2\msvc2019_64\include\QtWidgets -I..\..\..\..\Qt\6.0.2\msvc2019_64\include\QtGui -I..\..\..\..\Qt\6.0.2\msvc2019_64\include\QtNetwork -I..\..\..\..\Qt\6.0.2\msvc2019_64\include\QtCore -Idebug -I. -I/include -I..\..\..\..\Qt\6.0.2\msvc2019_64\mkspecs\win32-msvc -Fodebug\ @C:\Users\etien\AppData\Local\Temp\ashaitoolbar.obj.3324.16.jom
  14. ashaitoolbar.cpp
  15. cl -c -nologo -Zc:wchar_t -FS -Zc:rvalueCast -Zc:inline -Zc:strictStrings -Zc:throwingNew -permissive- -Zc:__cplusplus -Zc:externConstexpr -Zi -MDd -std:c++17 -utf-8 -W3 -w34100 -w34189 -w44996 -w44456 -w44457 -w44458 -wd4577 -wd4467 -EHsc /Fddebug\project4.vc.pdb -DUNICODE -D_UNICODE -DWIN32 -D_ENABLE_EXTENDED_ALIGNED_STORAGE -DWIN64 -DQT_WIDGETS_LIB -DQT_GUI_LIB -DQT_NETWORK_LIB -DQT_CORE_LIB -I..\project4 -I. -I..\..\..\..\Qt\6.0.2\msvc2019_64\include -I..\..\..\..\Qt\6.0.2\msvc2019_64\include\QtWidgets -I..\..\..\..\Qt\6.0.2\msvc2019_64\include\QtGui -I..\..\..\..\Qt\6.0.2\msvc2019_64\include\QtNetwork -I..\..\..\..\Qt\6.0.2\msvc2019_64\include\QtCore -Idebug -I. -I/include -I..\..\..\..\Qt\6.0.2\msvc2019_64\mkspecs\win32-msvc -Fodebug\ @C:\Users\etien\AppData\Local\Temp\helper.obj.3324.16.jom
  16. helper.cpp
  17. main.cpp
  18. C:\Qt\6.0.2\msvc2019_64\bin\rcc.exe -name resources ..\project4\resources.qrc -o debug\qrc_resources.cpp
  19. cl -BxC:\Qt\6.0.2\msvc2019_64\bin\qmake.exe -nologo -Zc:wchar_t -FS -Zc:rvalueCast -Zc:inline -Zc:strictStrings -Zc:throwingNew -permissive- -Zc:__cplusplus -Zc:externConstexpr -Zi -MDd -std:c++17 -utf-8 -W3 -w34100 -w34189 -w44996 -w44456 -w44457 -w44458 -wd4577 -wd4467 -E ..\..\..\..\Qt\6.0.2\msvc2019_64\mkspecs\features\data\dummy.cpp 2>NUL >debug\moc_predefs.h
  20. C:\Users\etien\Documents\project4\loginwindow.h(22): error C2061: syntax error: identifier 'MainWindow'
  21. C:\Users\etien\Documents\project4\loginwindow.h(26): error C2143: syntax error: missing ';' before '*'
  22. C:\Users\etien\Documents\project4\loginwindow.h(26): error C4430: missing type specifier - int assumed. Note: C++ does not support default-int
  23. C:\Users\etien\Documents\project4\loginwindow.h(26): error C2238: unexpected token(s) preceding ';'
  24. C:\Users\etien\Documents\project4\loginwindow.h(28): error C2143: syntax error: missing ';' before '*'
  25. C:\Users\etien\Documents\project4\loginwindow.h(28): error C4430: missing type specifier - int assumed. Note: C++ does not support default-int
  26. C:\Users\etien\Documents\project4\loginwindow.h(28): error C2238: unexpected token(s) preceding ';'
  27. C:\Users\etien\Documents\project4\loginwindow.h(22): error C2061: syntax error: identifier 'MainWindow'
  28. C:\Users\etien\Documents\project4\loginwindow.h(28): error C2143: syntax error: missing ';' before '*'
  29. C:\Users\etien\Documents\project4\loginwindow.h(28): error C4430: missing type specifier - int assumed. Note: C++ does not support default-int
  30. C:\Users\etien\Documents\project4\loginwindow.h(28): error C2238: unexpected token(s) preceding ';'
  31. jom: C:\Users\etien\Documents\build-project4-Desktop_Qt_6_0_2_MSVC2019_64bit-Debug\Makefile.Debug [debug\helper.obj] Error 2
  32. cl -c -nologo -Zc:wchar_t -FS -Zc:rvalueCast -Zc:inline -Zc:strictStrings -Zc:throwingNew -permissive- -Zc:__cplusplus -Zc:externConstexpr -Zi -MDd -std:c++17 -utf-8 -W3 -w34100 -w34189 -w44996 -w44456 -w44457 -w44458 -wd4577 -wd4467 -EHsc /Fddebug\project4.vc.pdb -DUNICODE -D_UNICODE -DWIN32 -D_ENABLE_EXTENDED_ALIGNED_STORAGE -DWIN64 -DQT_WIDGETS_LIB -DQT_GUI_LIB -DQT_NETWORK_LIB -DQT_CORE_LIB -I..\project4 -I. -I..\..\..\..\Qt\6.0.2\msvc2019_64\include -I..\..\..\..\Qt\6.0.2\msvc2019_64\include\QtWidgets -I..\..\..\..\Qt\6.0.2\msvc2019_64\include\QtGui -I..\..\..\..\Qt\6.0.2\msvc2019_64\include\QtNetwork -I..\..\..\..\Qt\6.0.2\msvc2019_64\include\QtCore -Idebug -I. -I/include -I..\..\..\..\Qt\6.0.2\msvc2019_64\mkspecs\win32-msvc -Fodebug\ @C:\Users\etien\AppData\Local\Temp\mainwindow.obj.3324.453.jom
  33. mainwindow.cpp
  34. jom: C:\Users\etien\Documents\build-project4-Desktop_Qt_6_0_2_MSVC2019_64bit-Debug\Makefile.Debug [debug\ashaitoolbar.obj] Error 2
  35. C:\Users\etien\Documents\project4\loginwindow.h(22): error C2061: syntax error: identifier 'MainWindow'
  36. C:\Users\etien\Documents\project4\loginwindow.h(28): error C2143: syntax error: missing ';' before '*'
  37. C:\Users\etien\Documents\project4\loginwindow.h(28): error C4430: missing type specifier - int assumed. Note: C++ does not support default-int
  38. C:\Users\etien\Documents\project4\loginwindow.h(28): error C2238: unexpected token(s) preceding ';'
  39. jom: C:\Users\etien\Documents\build-project4-Desktop_Qt_6_0_2_MSVC2019_64bit-Debug\Makefile.Debug [debug\mainwindow.obj] Error 2
  40. jom: C:\Users\etien\Documents\build-project4-Desktop_Qt_6_0_2_MSVC2019_64bit-Debug\Makefile [debug] Error 2
  41. 12:07:31: The process "C:\Qt\Tools\QtCreator\bin\jom.exe" exited with code 2.
  42. Error while building/deploying project project4 (kit: Desktop Qt 6.0.2 MSVC2019 64bit)
  43. When executing step "Make"
  44. 12:07:31: Elapsed time: 00:06.
RAW Paste Data