Guest User

Untitled

a guest
Apr 24th, 2018
278
0
Never
Not a member of Pastebin yet? Sign Up, it unlocks many cool features!
text 48.29 KB | None | 0 0
  1. C:\Users\Hugo\Desktop\app>mvn openmrs-sdk:run -DserverId=openmrs
  2. Java HotSpot(TM) 64-Bit Server VM warning: ignoring option MaxPermSize=512m; support was removed in 8.0
  3. [INFO] Scanning for projects...
  4. [INFO]
  5. [INFO] ------------------------------------------------------------------------
  6. [INFO] Building Maven Stub Project (No POM) 1
  7. [INFO] ------------------------------------------------------------------------
  8. [INFO]
  9. [INFO] --- openmrs-sdk-maven-plugin:3.13.0:run (default-cli) @ standalone-pom ---
  10.  
  11. Checking if port 8080 is in use... [free]
  12. Apache Maven 3.5.2 (138edd61fd100ec658bfa2d307c43b76940a5d7d; 2017-10-18T08:58:13+01:00)
  13. Maven home: C:\Program Files\apache-maven-3.5.2-bin\apache-maven-3.5.2\bin\..
  14. Java version: 1.8.0_161, vendor: Oracle Corporation
  15. Java home: C:\Program Files\Java\jdk1.8.0_161\jre
  16. Default locale: pt_PT, platform encoding: Cp1252
  17. OS name: "windows 10", version: "10.0", arch: "amd64", family: "windows"
  18. [INFO] Scanning for projects...
  19. [WARNING]
  20. [WARNING] Some problems were encountered while building the effective model for org.openmrs.module:basicexample:pom:1.0.0-SNAPSHOT
  21. [WARNING] 'parent.relativePath' of POM org.openmrs.module:basicexample:1.0.0-SNAPSHOT (C:\Users\Hugo\openmrs\openmrs\watched-projects\basicexample\pom.xml) points at o
  22. g.openmrs.maven.plugins:openmrs-sdk-watched-projects-openmrs instead of org.openmrs.maven.parents:maven-parent-openmrs-module, please verify your project structure @ l
  23. ne 5, column 13
  24. [WARNING]
  25. [WARNING] Some problems were encountered while building the effective model for org.openmrs.module:coreapps-omod:jar:1.20.0-SNAPSHOT
  26. [WARNING] 'build.plugins.plugin.(groupId:artifactId)' must be unique but found duplicate declaration of plugin org.apache.maven.plugins:maven-dependency-plugin @ org.o
  27. enmrs.module:coreapps-omod:[unknown-version], C:\Users\Hugo\openmrs\openmrs\watched-projects\coreapps\omod\pom.xml, line 435, column 21
  28. [WARNING] 'build.plugins.plugin.version' for de.saumya.mojo:gem-maven-plugin is missing. @ org.openmrs.module:coreapps-omod:[unknown-version], C:\Users\Hugo\openmrs\op
  29. nmrs\watched-projects\coreapps\omod\pom.xml, line 461, column 21
  30. [WARNING]
  31. [WARNING] It is highly recommended to fix these problems because they threaten the stability of your build.
  32. [WARNING]
  33. [WARNING] For this reason, future Maven versions might no longer support building such malformed projects.
  34. [WARNING]
  35. [INFO] ------------------------------------------------------------------------
  36. [INFO] Reactor Build Order:
  37. [INFO]
  38. [INFO] Basicexample
  39. [INFO] Basicexample API
  40. [INFO] Basicexample OMOD
  41. [INFO] Dermatology
  42. [INFO] Dermatology API
  43. [INFO] Core Apps Module
  44. [INFO] Core Apps Module API-pre2.2
  45. [INFO] Core Apps Module API
  46. [INFO] Dermatology OMOD
  47. [INFO] coreapps Module web 1.9
  48. [INFO] coreapps Module web 2.0
  49. [INFO] Core Apps Module API 2.2
  50. [INFO] Core Apps Module OMOD
  51. [INFO] openmrs-sdk-watched-projects-openmrs
  52. [INFO]
  53. [INFO] ------------------------------------------------------------------------
  54. [INFO] Building Basicexample 1.0.0-SNAPSHOT
  55. [INFO] ------------------------------------------------------------------------
  56. [INFO]
  57. [INFO] --- maven-clean-plugin:2.5:clean (default-clean) @ basicexample ---
  58. [INFO]
  59. [INFO] --- buildnumber-maven-plugin:1.1:create (default) @ basicexample ---
  60. [INFO] Checking for local modifications: skipped.
  61. [INFO] Updating project files from SCM: skipped.
  62. [INFO] ShortRevision tag detected. The value is '6'.
  63. [INFO] Executing: cmd.exe /X /C "git rev-parse --verify --short=6 HEAD"
  64. [INFO] Working directory: C:\Users\Hugo\openmrs\openmrs\watched-projects\basicexample
  65. [INFO] Storing buildNumber: 0 at timestamp: 1524574666579
  66. [INFO] ShortRevision tag detected. The value is '6'.
  67. [INFO] Executing: cmd.exe /X /C "git rev-parse --verify --short=6 HEAD"
  68. [INFO] Working directory: C:\Users\Hugo\openmrs\openmrs\watched-projects\basicexample
  69. [INFO] Storing buildScmBranch: UNKNOWN_BRANCH
  70. [INFO]
  71. [INFO] --- maven-java-formatter-plugin:0.4:format (default) @ basicexample ---
  72. [INFO] Using 'UTF-8' encoding to format source files.
  73. [INFO] Number of files to be formatted: 0
  74. [INFO]
  75. [INFO] --- maven-install-plugin:2.4:install (default-install) @ basicexample ---
  76. [INFO] Installing C:\Users\Hugo\openmrs\openmrs\watched-projects\basicexample\pom.xml to C:\Users\Hugo\.m2\repository\org\openmrs\module\basicexample\1.0.0-SNAPSHOT\ba
  77. icexample-1.0.0-SNAPSHOT.pom
  78. [INFO]
  79. [INFO] ------------------------------------------------------------------------
  80. [INFO] Building Basicexample API 1.0.0-SNAPSHOT
  81. [INFO] ------------------------------------------------------------------------
  82. [INFO]
  83. [INFO] --- maven-clean-plugin:2.5:clean (default-clean) @ basicexample-api ---
  84. [INFO] Deleting C:\Users\Hugo\openmrs\openmrs\watched-projects\basicexample\api\target
  85. [INFO]
  86. [INFO] --- buildnumber-maven-plugin:1.1:create (default) @ basicexample-api ---
  87. [INFO]
  88. [INFO] --- maven-java-formatter-plugin:0.4:format (default) @ basicexample-api ---
  89. [INFO] Using 'UTF-8' encoding to format source files.
  90. [INFO] Number of files to be formatted: 8
  91. [INFO] Successfully formatted: 0 file(s)
  92. [INFO] Fail to format : 0 file(s)
  93. [INFO] Skipped : 8 file(s)
  94. [INFO] Approximate time taken: 1s
  95. [INFO]
  96. [INFO] --- maven-resources-plugin:2.6:resources (default-resources) @ basicexample-api ---
  97. [INFO] Using 'UTF-8' encoding to copy filtered resources.
  98. [INFO] Copying 5 resources
  99. [INFO] Copying 0 resource
  100. [INFO] skip non existing resourceDirectory C:\Users\Hugo\openmrs\openmrs\watched-projects\basicexample\api\src\main\webapp
  101. [INFO] skip non existing resourceDirectory C:\Users\Hugo\openmrs\openmrs\watched-projects\basicexample\api\src\main\webapp
  102. [INFO]
  103. [INFO] --- maven-compiler-plugin:3.1:compile (default-compile) @ basicexample-api ---
  104. [INFO] Changes detected - recompiling the module!
  105. [INFO] Compiling 6 source files to C:\Users\Hugo\openmrs\openmrs\watched-projects\basicexample\api\target\classes
  106. [INFO]
  107. [INFO] --- maven-resources-plugin:2.6:testResources (default-testResources) @ basicexample-api ---
  108. [INFO] Using 'UTF-8' encoding to copy filtered resources.
  109. [INFO] skip non existing resourceDirectory C:\Users\Hugo\openmrs\openmrs\watched-projects\basicexample\api\src\test\resources
  110. [INFO] skip non existing resourceDirectory C:\Users\Hugo\openmrs\openmrs\watched-projects\basicexample\api\src\test\resources
  111. [INFO]
  112. [INFO] --- maven-compiler-plugin:3.1:testCompile (default-testCompile) @ basicexample-api ---
  113. [INFO] Changes detected - recompiling the module!
  114. [INFO] Compiling 2 source files to C:\Users\Hugo\openmrs\openmrs\watched-projects\basicexample\api\target\test-classes
  115. [INFO]
  116. [INFO] --- maven-surefire-plugin:2.12.4:test (default-test) @ basicexample-api ---
  117. [INFO] Tests are skipped.
  118. [INFO]
  119. [INFO] --- maven-jar-plugin:2.5:jar (default-jar) @ basicexample-api ---
  120. [INFO] Building jar: C:\Users\Hugo\openmrs\openmrs\watched-projects\basicexample\api\target\basicexample-api-1.0.0-SNAPSHOT.jar
  121. [INFO]
  122. [INFO] --- maven-jar-plugin:2.5:test-jar (default) @ basicexample-api ---
  123. [INFO] Building jar: C:\Users\Hugo\openmrs\openmrs\watched-projects\basicexample\api\target\basicexample-api-1.0.0-SNAPSHOT-tests.jar
  124. [INFO]
  125. [INFO] --- maven-install-plugin:2.4:install (default-install) @ basicexample-api ---
  126. [INFO] Installing C:\Users\Hugo\openmrs\openmrs\watched-projects\basicexample\api\target\basicexample-api-1.0.0-SNAPSHOT.jar to C:\Users\Hugo\.m2\repository\org\openmr
  127. \module\basicexample-api\1.0.0-SNAPSHOT\basicexample-api-1.0.0-SNAPSHOT.jar
  128. [INFO] Installing C:\Users\Hugo\openmrs\openmrs\watched-projects\basicexample\api\pom.xml to C:\Users\Hugo\.m2\repository\org\openmrs\module\basicexample-api\1.0.0-SNA
  129. SHOT\basicexample-api-1.0.0-SNAPSHOT.pom
  130. [INFO] Installing C:\Users\Hugo\openmrs\openmrs\watched-projects\basicexample\api\target\basicexample-api-1.0.0-SNAPSHOT-tests.jar to C:\Users\Hugo\.m2\repository\org\
  131. penmrs\module\basicexample-api\1.0.0-SNAPSHOT\basicexample-api-1.0.0-SNAPSHOT-tests.jar
  132. [INFO]
  133. [INFO] ------------------------------------------------------------------------
  134. [INFO] Building Basicexample OMOD 1.0.0-SNAPSHOT
  135. [INFO] ------------------------------------------------------------------------
  136. [INFO]
  137. [INFO] --- maven-clean-plugin:2.5:clean (default-clean) @ basicexample-omod ---
  138. [INFO] Deleting C:\Users\Hugo\openmrs\openmrs\watched-projects\basicexample\omod\target
  139. [INFO]
  140. [INFO] --- buildnumber-maven-plugin:1.1:create (default) @ basicexample-omod ---
  141. [INFO]
  142. [INFO] --- maven-java-formatter-plugin:0.4:format (default) @ basicexample-omod ---
  143. [INFO] Using 'UTF-8' encoding to format source files.
  144. [INFO] Number of files to be formatted: 4
  145. [INFO] Successfully formatted: 0 file(s)
  146. [INFO] Fail to format : 0 file(s)
  147. [INFO] Skipped : 4 file(s)
  148. [INFO] Approximate time taken: 0s
  149. [INFO]
  150. [INFO] --- maven-dependency-plugin:2.8:unpack-dependencies (Expand resources) @ basicexample-omod ---
  151. [INFO] Unpacking C:\Users\Hugo\openmrs\openmrs\watched-projects\basicexample\api\target\basicexample-api-1.0.0-SNAPSHOT.jar to C:\Users\Hugo\openmrs\openmrs\watched-pr
  152. jects\basicexample\omod\target\classes with includes "*.xml,*.properties" and excludes ""
  153. [INFO]
  154. [INFO] --- maven-resources-plugin:2.6:resources (default-resources) @ basicexample-omod ---
  155. [INFO] Using 'UTF-8' encoding to copy filtered resources.
  156. [INFO] Copying 2 resources
  157. [INFO] Copying 0 resource
  158. [INFO] Copying 0 resource to web/module
  159. [INFO] Copying 3 resources to web/module
  160. [INFO]
  161. [INFO] --- maven-compiler-plugin:3.1:compile (default-compile) @ basicexample-omod ---
  162. [INFO] Changes detected - recompiling the module!
  163. [INFO] Compiling 3 source files to C:\Users\Hugo\openmrs\openmrs\watched-projects\basicexample\omod\target\classes
  164. [INFO]
  165. [INFO] --- maven-resources-plugin:2.6:testResources (default-testResources) @ basicexample-omod ---
  166. [INFO] Using 'UTF-8' encoding to copy filtered resources.
  167. [INFO] skip non existing resourceDirectory C:\Users\Hugo\openmrs\openmrs\watched-projects\basicexample\omod\src\test\resources
  168. [INFO] skip non existing resourceDirectory C:\Users\Hugo\openmrs\openmrs\watched-projects\basicexample\omod\src\test\resources
  169. [INFO]
  170. [INFO] --- maven-compiler-plugin:3.1:testCompile (default-testCompile) @ basicexample-omod ---
  171. [INFO] Changes detected - recompiling the module!
  172. [INFO] Compiling 1 source file to C:\Users\Hugo\openmrs\openmrs\watched-projects\basicexample\omod\target\test-classes
  173. [INFO]
  174. [INFO] --- maven-surefire-plugin:2.12.4:test (default-test) @ basicexample-omod ---
  175. [INFO] Tests are skipped.
  176. [INFO]
  177. [INFO] --- maven-jar-plugin:2.5:jar (default-jar) @ basicexample-omod ---
  178. [INFO] Building jar: C:\Users\Hugo\openmrs\openmrs\watched-projects\basicexample\omod\target\basicexample-1.0.0-SNAPSHOT.jar
  179. [INFO]
  180. [INFO] --- maven-openmrs-plugin:1.0.1:package-module (pack) @ basicexample-omod ---
  181. [INFO] Packaging OpenMRS module
  182. [INFO] Building jar: C:\Users\Hugo\openmrs\openmrs\watched-projects\basicexample\omod\target\basicexample-1.0.0-SNAPSHOT.omod
  183. [INFO]
  184. [INFO] --- maven-jar-plugin:2.5:test-jar (default) @ basicexample-omod ---
  185. [INFO] Building jar: C:\Users\Hugo\openmrs\openmrs\watched-projects\basicexample\omod\target\basicexample-1.0.0-SNAPSHOT-tests.jar
  186. [INFO]
  187. [INFO] --- maven-install-plugin:2.4:install (default-install) @ basicexample-omod ---
  188. [INFO] Installing C:\Users\Hugo\openmrs\openmrs\watched-projects\basicexample\omod\target\basicexample-1.0.0-SNAPSHOT.omod to C:\Users\Hugo\.m2\repository\org\openmrs\
  189. odule\basicexample-omod\1.0.0-SNAPSHOT\basicexample-omod-1.0.0-SNAPSHOT.jar
  190. [INFO] Installing C:\Users\Hugo\openmrs\openmrs\watched-projects\basicexample\omod\pom.xml to C:\Users\Hugo\.m2\repository\org\openmrs\module\basicexample-omod\1.0.0-S
  191. APSHOT\basicexample-omod-1.0.0-SNAPSHOT.pom
  192. [INFO] Installing C:\Users\Hugo\openmrs\openmrs\watched-projects\basicexample\omod\target\basicexample-1.0.0-SNAPSHOT-tests.jar to C:\Users\Hugo\.m2\repository\org\ope
  193. mrs\module\basicexample-omod\1.0.0-SNAPSHOT\basicexample-omod-1.0.0-SNAPSHOT-tests.jar
  194. [INFO]
  195. [INFO] ------------------------------------------------------------------------
  196. [INFO] Building Dermatology 1.0.0-SNAPSHOT
  197. [INFO] ------------------------------------------------------------------------
  198. [INFO]
  199. [INFO] --- maven-clean-plugin:2.5:clean (default-clean) @ dermatology ---
  200. [INFO]
  201. [INFO] --- buildnumber-maven-plugin:1.1:create (default) @ dermatology ---
  202. [INFO]
  203. [INFO] --- maven-java-formatter-plugin:0.4:format (default) @ dermatology ---
  204. [INFO] Using 'UTF-8' encoding to format source files.
  205. [INFO] Number of files to be formatted: 0
  206. [INFO]
  207. [INFO] --- maven-install-plugin:2.4:install (default-install) @ dermatology ---
  208. [INFO] Installing C:\Users\Hugo\openmrs\openmrs\watched-projects\dermatology\pom.xml to C:\Users\Hugo\.m2\repository\org\openmrs\module\dermatology\1.0.0-SNAPSHOT\derm
  209. tology-1.0.0-SNAPSHOT.pom
  210. [INFO]
  211. [INFO] ------------------------------------------------------------------------
  212. [INFO] Building Dermatology API 1.0.0-SNAPSHOT
  213. [INFO] ------------------------------------------------------------------------
  214. [INFO]
  215. [INFO] --- maven-clean-plugin:2.5:clean (default-clean) @ dermatology-api ---
  216. [INFO] Deleting C:\Users\Hugo\openmrs\openmrs\watched-projects\dermatology\api\target
  217. [INFO]
  218. [INFO] --- buildnumber-maven-plugin:1.1:create (default) @ dermatology-api ---
  219. [INFO]
  220. [INFO] --- maven-java-formatter-plugin:0.4:format (default) @ dermatology-api ---
  221. [INFO] Using 'UTF-8' encoding to format source files.
  222. [INFO] Number of files to be formatted: 12
  223. [INFO] Successfully formatted: 0 file(s)
  224. [INFO] Fail to format : 0 file(s)
  225. [INFO] Skipped : 12 file(s)
  226. [INFO] Approximate time taken: 0s
  227. [INFO]
  228. [INFO] --- maven-resources-plugin:2.6:resources (default-resources) @ dermatology-api ---
  229. [INFO] Using 'UTF-8' encoding to copy filtered resources.
  230. [INFO] Copying 5 resources
  231. [INFO] Copying 0 resource
  232. [INFO] skip non existing resourceDirectory C:\Users\Hugo\openmrs\openmrs\watched-projects\dermatology\api\src\main\webapp
  233. [INFO] skip non existing resourceDirectory C:\Users\Hugo\openmrs\openmrs\watched-projects\dermatology\api\src\main\webapp
  234. [INFO]
  235. [INFO] --- maven-compiler-plugin:3.1:compile (default-compile) @ dermatology-api ---
  236. [INFO] Changes detected - recompiling the module!
  237. [INFO] Compiling 10 source files to C:\Users\Hugo\openmrs\openmrs\watched-projects\dermatology\api\target\classes
  238. [INFO]
  239. [INFO] --- maven-resources-plugin:2.6:testResources (default-testResources) @ dermatology-api ---
  240. [INFO] Using 'UTF-8' encoding to copy filtered resources.
  241. [INFO] skip non existing resourceDirectory C:\Users\Hugo\openmrs\openmrs\watched-projects\dermatology\api\src\test\resources
  242. [INFO] skip non existing resourceDirectory C:\Users\Hugo\openmrs\openmrs\watched-projects\dermatology\api\src\test\resources
  243. [INFO]
  244. [INFO] --- maven-compiler-plugin:3.1:testCompile (default-testCompile) @ dermatology-api ---
  245. [INFO] Changes detected - recompiling the module!
  246. [INFO] Compiling 2 source files to C:\Users\Hugo\openmrs\openmrs\watched-projects\dermatology\api\target\test-classes
  247. [INFO]
  248. [INFO] --- maven-surefire-plugin:2.12.4:test (default-test) @ dermatology-api ---
  249. [INFO] Tests are skipped.
  250. [INFO]
  251. [INFO] --- maven-jar-plugin:2.5:jar (default-jar) @ dermatology-api ---
  252. [INFO] Building jar: C:\Users\Hugo\openmrs\openmrs\watched-projects\dermatology\api\target\dermatology-api-1.0.0-SNAPSHOT.jar
  253. [INFO]
  254. [INFO] --- maven-jar-plugin:2.5:test-jar (default) @ dermatology-api ---
  255. [INFO] Building jar: C:\Users\Hugo\openmrs\openmrs\watched-projects\dermatology\api\target\dermatology-api-1.0.0-SNAPSHOT-tests.jar
  256. [INFO]
  257. [INFO] --- maven-install-plugin:2.4:install (default-install) @ dermatology-api ---
  258. [INFO] Installing C:\Users\Hugo\openmrs\openmrs\watched-projects\dermatology\api\target\dermatology-api-1.0.0-SNAPSHOT.jar to C:\Users\Hugo\.m2\repository\org\openmrs\
  259. odule\dermatology-api\1.0.0-SNAPSHOT\dermatology-api-1.0.0-SNAPSHOT.jar
  260. [INFO] Installing C:\Users\Hugo\openmrs\openmrs\watched-projects\dermatology\api\pom.xml to C:\Users\Hugo\.m2\repository\org\openmrs\module\dermatology-api\1.0.0-SNAPS
  261. OT\dermatology-api-1.0.0-SNAPSHOT.pom
  262. [INFO] Installing C:\Users\Hugo\openmrs\openmrs\watched-projects\dermatology\api\target\dermatology-api-1.0.0-SNAPSHOT-tests.jar to C:\Users\Hugo\.m2\repository\org\op
  263. nmrs\module\dermatology-api\1.0.0-SNAPSHOT\dermatology-api-1.0.0-SNAPSHOT-tests.jar
  264. [INFO]
  265. [INFO] ------------------------------------------------------------------------
  266. [INFO] Building Core Apps Module 1.20.0-SNAPSHOT
  267. [INFO] ------------------------------------------------------------------------
  268. [INFO]
  269. [INFO] --- maven-clean-plugin:2.5:clean (default-clean) @ coreapps ---
  270. [INFO]
  271. [INFO] --- maven-install-plugin:2.4:install (default-install) @ coreapps ---
  272. [INFO] Installing C:\Users\Hugo\openmrs\openmrs\watched-projects\coreapps\pom.xml to C:\Users\Hugo\.m2\repository\org\openmrs\module\coreapps\1.20.0-SNAPSHOT\coreapps-
  273. .20.0-SNAPSHOT.pom
  274. [INFO]
  275. [INFO] ------------------------------------------------------------------------
  276. [INFO] Building Core Apps Module API-pre2.2 1.20.0-SNAPSHOT
  277. [INFO] ------------------------------------------------------------------------
  278. [INFO]
  279. [INFO] --- maven-clean-plugin:2.5:clean (default-clean) @ coreapps-api-pre2.2 ---
  280. [INFO] Deleting C:\Users\Hugo\openmrs\openmrs\watched-projects\coreapps\api-pre2.2\target
  281. [INFO]
  282. [INFO] --- maven-resources-plugin:2.6:resources (default-resources) @ coreapps-api-pre2.2 ---
  283. [INFO] Using 'UTF-8' encoding to copy filtered resources.
  284. [INFO] skip non existing resourceDirectory C:\Users\Hugo\openmrs\openmrs\watched-projects\coreapps\api-pre2.2\src\main\resources
  285. [INFO]
  286. [INFO] --- maven-compiler-plugin:3.1:compile (default-compile) @ coreapps-api-pre2.2 ---
  287. [INFO] Changes detected - recompiling the module!
  288. [INFO] Compiling 1 source file to C:\Users\Hugo\openmrs\openmrs\watched-projects\coreapps\api-pre2.2\target\classes
  289. [WARNING] /C:/Users/Hugo/openmrs/openmrs/watched-projects/coreapps/api-pre2.2/src/main/java/org/openmrs/module/coreapps/htmlformentry/EncounterDiagnosesElement.java: C
  290. \Users\Hugo\openmrs\openmrs\watched-projects\coreapps\api-pre2.2\src\main\java\org\openmrs\module\coreapps\htmlformentry\EncounterDiagnosesElement.java uses or overrid
  291. s a deprecated API.
  292. [WARNING] /C:/Users/Hugo/openmrs/openmrs/watched-projects/coreapps/api-pre2.2/src/main/java/org/openmrs/module/coreapps/htmlformentry/EncounterDiagnosesElement.java: R
  293. compile with -Xlint:deprecation for details.
  294. [WARNING] /C:/Users/Hugo/openmrs/openmrs/watched-projects/coreapps/api-pre2.2/src/main/java/org/openmrs/module/coreapps/htmlformentry/EncounterDiagnosesElement.java: C
  295. \Users\Hugo\openmrs\openmrs\watched-projects\coreapps\api-pre2.2\src\main\java\org\openmrs\module\coreapps\htmlformentry\EncounterDiagnosesElement.java uses unchecked
  296. r unsafe operations.
  297. [WARNING] /C:/Users/Hugo/openmrs/openmrs/watched-projects/coreapps/api-pre2.2/src/main/java/org/openmrs/module/coreapps/htmlformentry/EncounterDiagnosesElement.java: R
  298. compile with -Xlint:unchecked for details.
  299. [INFO]
  300. [INFO] --- maven-resources-plugin:2.6:testResources (default-testResources) @ coreapps-api-pre2.2 ---
  301. [INFO] Using 'UTF-8' encoding to copy filtered resources.
  302. [INFO] skip non existing resourceDirectory C:\Users\Hugo\openmrs\openmrs\watched-projects\coreapps\api-pre2.2\src\test\resources
  303. [INFO]
  304. [INFO] --- maven-compiler-plugin:3.1:testCompile (default-testCompile) @ coreapps-api-pre2.2 ---
  305. [INFO] No sources to compile
  306. [INFO]
  307. [INFO] --- maven-surefire-plugin:2.12.4:test (default-test) @ coreapps-api-pre2.2 ---
  308. [INFO] Tests are skipped.
  309. [INFO]
  310. [INFO] --- maven-jar-plugin:2.4:jar (default-jar) @ coreapps-api-pre2.2 ---
  311. [INFO] Building jar: C:\Users\Hugo\openmrs\openmrs\watched-projects\coreapps\api-pre2.2\target\coreapps-api-pre2.2-1.20.0-SNAPSHOT.jar
  312. [INFO]
  313. [INFO] --- maven-install-plugin:2.4:install (default-install) @ coreapps-api-pre2.2 ---
  314. [INFO] Installing C:\Users\Hugo\openmrs\openmrs\watched-projects\coreapps\api-pre2.2\target\coreapps-api-pre2.2-1.20.0-SNAPSHOT.jar to C:\Users\Hugo\.m2\repository\org
  315. openmrs\module\coreapps-api-pre2.2\1.20.0-SNAPSHOT\coreapps-api-pre2.2-1.20.0-SNAPSHOT.jar
  316. [INFO] Installing C:\Users\Hugo\openmrs\openmrs\watched-projects\coreapps\api-pre2.2\pom.xml to C:\Users\Hugo\.m2\repository\org\openmrs\module\coreapps-api-pre2.2\1.2
  317. .0-SNAPSHOT\coreapps-api-pre2.2-1.20.0-SNAPSHOT.pom
  318. [INFO]
  319. [INFO] ------------------------------------------------------------------------
  320. [INFO] Building Core Apps Module API 1.20.0-SNAPSHOT
  321. [INFO] ------------------------------------------------------------------------
  322. [INFO]
  323. [INFO] --- maven-clean-plugin:2.5:clean (default-clean) @ coreapps-api ---
  324. [INFO] Deleting C:\Users\Hugo\openmrs\openmrs\watched-projects\coreapps\api\target
  325. [INFO]
  326. [INFO] --- maven-resources-plugin:2.6:resources (default-resources) @ coreapps-api ---
  327. [INFO] Using 'UTF-8' encoding to copy filtered resources.
  328. [INFO] Copying 22 resources
  329. [INFO]
  330. [INFO] --- maven-compiler-plugin:3.1:compile (default-compile) @ coreapps-api ---
  331. [INFO] Changes detected - recompiling the module!
  332. [INFO] Compiling 18 source files to C:\Users\Hugo\openmrs\openmrs\watched-projects\coreapps\api\target\classes
  333. [WARNING] /C:/Users/Hugo/openmrs/openmrs/watched-projects/coreapps/api/src/main/java/org/openmrs/module/coreapps/CoreAppsProperties.java: Some input files use or overr
  334. de a deprecated API.
  335. [WARNING] /C:/Users/Hugo/openmrs/openmrs/watched-projects/coreapps/api/src/main/java/org/openmrs/module/coreapps/CoreAppsProperties.java: Recompile with -Xlint:depreca
  336. ion for details.
  337. [WARNING] /C:/Users/Hugo/openmrs/openmrs/watched-projects/coreapps/api/src/main/java/org/openmrs/module/coreapps/parser/ParseEncounterToJson.java: Some input files use
  338. unchecked or unsafe operations.
  339. [WARNING] /C:/Users/Hugo/openmrs/openmrs/watched-projects/coreapps/api/src/main/java/org/openmrs/module/coreapps/parser/ParseEncounterToJson.java: Recompile with -Xlin
  340. :unchecked for details.
  341. [INFO]
  342. [INFO] --- maven-resources-plugin:2.6:testResources (default-testResources) @ coreapps-api ---
  343. [INFO] Using 'UTF-8' encoding to copy filtered resources.
  344. [INFO] skip non existing resourceDirectory C:\Users\Hugo\openmrs\openmrs\watched-projects\coreapps\api\src\test\resources
  345. [INFO]
  346. [INFO] --- maven-compiler-plugin:3.1:testCompile (default-testCompile) @ coreapps-api ---
  347. [INFO] Changes detected - recompiling the module!
  348. [INFO] Compiling 4 source files to C:\Users\Hugo\openmrs\openmrs\watched-projects\coreapps\api\target\test-classes
  349. [INFO]
  350. [INFO] --- maven-surefire-plugin:2.12.4:test (default-test) @ coreapps-api ---
  351. [INFO] Tests are skipped.
  352. [INFO]
  353. [INFO] --- maven-jar-plugin:2.4:jar (default-jar) @ coreapps-api ---
  354. [INFO] Building jar: C:\Users\Hugo\openmrs\openmrs\watched-projects\coreapps\api\target\coreapps-api-1.20.0-SNAPSHOT.jar
  355. [INFO]
  356. [INFO] --- maven-install-plugin:2.4:install (default-install) @ coreapps-api ---
  357. [INFO] Installing C:\Users\Hugo\openmrs\openmrs\watched-projects\coreapps\api\target\coreapps-api-1.20.0-SNAPSHOT.jar to C:\Users\Hugo\.m2\repository\org\openmrs\modul
  358. \coreapps-api\1.20.0-SNAPSHOT\coreapps-api-1.20.0-SNAPSHOT.jar
  359. [INFO] Installing C:\Users\Hugo\openmrs\openmrs\watched-projects\coreapps\api\pom.xml to C:\Users\Hugo\.m2\repository\org\openmrs\module\coreapps-api\1.20.0-SNAPSHOT\c
  360. reapps-api-1.20.0-SNAPSHOT.pom
  361. [INFO]
  362. [INFO] ------------------------------------------------------------------------
  363. [INFO] Building Dermatology OMOD 1.0.0-SNAPSHOT
  364. [INFO] ------------------------------------------------------------------------
  365. [INFO]
  366. [INFO] --- maven-clean-plugin:2.5:clean (default-clean) @ dermatology-omod ---
  367. [INFO] Deleting C:\Users\Hugo\openmrs\openmrs\watched-projects\dermatology\omod\target
  368. [INFO]
  369. [INFO] --- buildnumber-maven-plugin:1.1:create (default) @ dermatology-omod ---
  370. [INFO]
  371. [INFO] --- maven-java-formatter-plugin:0.4:format (default) @ dermatology-omod ---
  372. [INFO] Using 'UTF-8' encoding to format source files.
  373. [INFO] Number of files to be formatted: 5
  374. [INFO] Successfully formatted: 0 file(s)
  375. [INFO] Fail to format : 0 file(s)
  376. [INFO] Skipped : 5 file(s)
  377. [INFO] Approximate time taken: 0s
  378. [INFO]
  379. [INFO] --- maven-dependency-plugin:2.8:unpack-dependencies (Expand resources) @ dermatology-omod ---
  380. [INFO] Unpacking C:\Users\Hugo\openmrs\openmrs\watched-projects\dermatology\api\target\dermatology-api-1.0.0-SNAPSHOT.jar to C:\Users\Hugo\openmrs\openmrs\watched-proj
  381. cts\dermatology\omod\target\classes with includes "*.xml,*.properties" and excludes ""
  382. [INFO]
  383. [INFO] --- maven-resources-plugin:2.6:resources (default-resources) @ dermatology-omod ---
  384. [INFO] Using 'UTF-8' encoding to copy filtered resources.
  385. [INFO] Copying 2 resources
  386. [INFO] Copying 0 resource
  387. [INFO] Copying 0 resource to web/module
  388. [INFO] Copying 3 resources to web/module
  389. [INFO]
  390. [INFO] --- maven-compiler-plugin:3.1:compile (default-compile) @ dermatology-omod ---
  391. [INFO] Changes detected - recompiling the module!
  392. [INFO] Compiling 4 source files to C:\Users\Hugo\openmrs\openmrs\watched-projects\dermatology\omod\target\classes
  393. [INFO]
  394. [INFO] --- maven-resources-plugin:2.6:testResources (default-testResources) @ dermatology-omod ---
  395. [INFO] Using 'UTF-8' encoding to copy filtered resources.
  396. [INFO] skip non existing resourceDirectory C:\Users\Hugo\openmrs\openmrs\watched-projects\dermatology\omod\src\test\resources
  397. [INFO] skip non existing resourceDirectory C:\Users\Hugo\openmrs\openmrs\watched-projects\dermatology\omod\src\test\resources
  398. [INFO]
  399. [INFO] --- maven-compiler-plugin:3.1:testCompile (default-testCompile) @ dermatology-omod ---
  400. [INFO] Changes detected - recompiling the module!
  401. [INFO] Compiling 1 source file to C:\Users\Hugo\openmrs\openmrs\watched-projects\dermatology\omod\target\test-classes
  402. [INFO]
  403. [INFO] --- maven-surefire-plugin:2.12.4:test (default-test) @ dermatology-omod ---
  404. [INFO] Tests are skipped.
  405. [INFO]
  406. [INFO] --- maven-jar-plugin:2.5:jar (default-jar) @ dermatology-omod ---
  407. [INFO] Building jar: C:\Users\Hugo\openmrs\openmrs\watched-projects\dermatology\omod\target\dermatology-1.0.0-SNAPSHOT.jar
  408. [INFO]
  409. [INFO] --- maven-openmrs-plugin:1.0.1:package-module (pack) @ dermatology-omod ---
  410. [INFO] Packaging OpenMRS module
  411. [INFO] Building jar: C:\Users\Hugo\openmrs\openmrs\watched-projects\dermatology\omod\target\dermatology-1.0.0-SNAPSHOT.omod
  412. [INFO]
  413. [INFO] --- maven-jar-plugin:2.5:test-jar (default) @ dermatology-omod ---
  414. [INFO] Building jar: C:\Users\Hugo\openmrs\openmrs\watched-projects\dermatology\omod\target\dermatology-1.0.0-SNAPSHOT-tests.jar
  415. [INFO]
  416. [INFO] --- maven-install-plugin:2.4:install (default-install) @ dermatology-omod ---
  417. [INFO] Installing C:\Users\Hugo\openmrs\openmrs\watched-projects\dermatology\omod\target\dermatology-1.0.0-SNAPSHOT.omod to C:\Users\Hugo\.m2\repository\org\openmrs\mo
  418. ule\dermatology-omod\1.0.0-SNAPSHOT\dermatology-omod-1.0.0-SNAPSHOT.jar
  419. [INFO] Installing C:\Users\Hugo\openmrs\openmrs\watched-projects\dermatology\omod\pom.xml to C:\Users\Hugo\.m2\repository\org\openmrs\module\dermatology-omod\1.0.0-SNA
  420. SHOT\dermatology-omod-1.0.0-SNAPSHOT.pom
  421. [INFO] Installing C:\Users\Hugo\openmrs\openmrs\watched-projects\dermatology\omod\target\dermatology-1.0.0-SNAPSHOT-tests.jar to C:\Users\Hugo\.m2\repository\org\openm
  422. s\module\dermatology-omod\1.0.0-SNAPSHOT\dermatology-omod-1.0.0-SNAPSHOT-tests.jar
  423. [INFO]
  424. [INFO] ------------------------------------------------------------------------
  425. [INFO] Building coreapps Module web 1.9 1.20.0-SNAPSHOT
  426. [INFO] ------------------------------------------------------------------------
  427. [INFO]
  428. [INFO] --- maven-clean-plugin:2.5:clean (default-clean) @ coreapps-web-1.9 ---
  429. [INFO] Deleting C:\Users\Hugo\openmrs\openmrs\watched-projects\coreapps\web-1.9\target
  430. [INFO]
  431. [INFO] --- maven-resources-plugin:2.6:resources (default-resources) @ coreapps-web-1.9 ---
  432. [INFO] Using 'UTF-8' encoding to copy filtered resources.
  433. [INFO] skip non existing resourceDirectory C:\Users\Hugo\openmrs\openmrs\watched-projects\coreapps\web-1.9\src\main\resources
  434. [INFO]
  435. [INFO] --- maven-compiler-plugin:3.1:compile (default-compile) @ coreapps-web-1.9 ---
  436. [INFO] Changes detected - recompiling the module!
  437. [INFO] Compiling 3 source files to C:\Users\Hugo\openmrs\openmrs\watched-projects\coreapps\web-1.9\target\classes
  438. [INFO]
  439. [INFO] --- maven-resources-plugin:2.6:testResources (default-testResources) @ coreapps-web-1.9 ---
  440. [INFO] Using 'UTF-8' encoding to copy filtered resources.
  441. [INFO] skip non existing resourceDirectory C:\Users\Hugo\openmrs\openmrs\watched-projects\coreapps\web-1.9\src\test\resources
  442. [INFO] skip non existing resourceDirectory C:\Users\Hugo\openmrs\openmrs\watched-projects\coreapps\web-1.9\src\test\resources
  443. [INFO]
  444. [INFO] --- maven-compiler-plugin:3.1:testCompile (default-testCompile) @ coreapps-web-1.9 ---
  445. [INFO] No sources to compile
  446. [INFO]
  447. [INFO] --- maven-surefire-plugin:2.12.4:test (default-test) @ coreapps-web-1.9 ---
  448. [INFO] Tests are skipped.
  449. [INFO]
  450. [INFO] --- maven-jar-plugin:2.4:jar (default-jar) @ coreapps-web-1.9 ---
  451. [INFO] Building jar: C:\Users\Hugo\openmrs\openmrs\watched-projects\coreapps\web-1.9\target\coreapps-web-1.9-1.20.0-SNAPSHOT.jar
  452. [INFO]
  453. [INFO] --- maven-install-plugin:2.4:install (default-install) @ coreapps-web-1.9 ---
  454. [INFO] Installing C:\Users\Hugo\openmrs\openmrs\watched-projects\coreapps\web-1.9\target\coreapps-web-1.9-1.20.0-SNAPSHOT.jar to C:\Users\Hugo\.m2\repository\org\openm
  455. s\module\coreapps-web-1.9\1.20.0-SNAPSHOT\coreapps-web-1.9-1.20.0-SNAPSHOT.jar
  456. [INFO] Installing C:\Users\Hugo\openmrs\openmrs\watched-projects\coreapps\web-1.9\pom.xml to C:\Users\Hugo\.m2\repository\org\openmrs\module\coreapps-web-1.9\1.20.0-SN
  457. PSHOT\coreapps-web-1.9-1.20.0-SNAPSHOT.pom
  458. [INFO]
  459. [INFO] ------------------------------------------------------------------------
  460. [INFO] Building coreapps Module web 2.0 1.20.0-SNAPSHOT
  461. [INFO] ------------------------------------------------------------------------
  462. [INFO]
  463. [INFO] --- maven-clean-plugin:2.5:clean (default-clean) @ coreapps-web-2.0 ---
  464. [INFO] Deleting C:\Users\Hugo\openmrs\openmrs\watched-projects\coreapps\web-2.0\target
  465. [INFO]
  466. [INFO] --- maven-resources-plugin:2.6:resources (default-resources) @ coreapps-web-2.0 ---
  467. [INFO] Using 'UTF-8' encoding to copy filtered resources.
  468. [INFO] skip non existing resourceDirectory C:\Users\Hugo\openmrs\openmrs\watched-projects\coreapps\web-2.0\src\main\resources
  469. [INFO]
  470. [INFO] --- maven-compiler-plugin:3.1:compile (default-compile) @ coreapps-web-2.0 ---
  471. [INFO] Changes detected - recompiling the module!
  472. [INFO] Compiling 3 source files to C:\Users\Hugo\openmrs\openmrs\watched-projects\coreapps\web-2.0\target\classes
  473. [INFO]
  474. [INFO] --- maven-resources-plugin:2.6:testResources (default-testResources) @ coreapps-web-2.0 ---
  475. [INFO] Using 'UTF-8' encoding to copy filtered resources.
  476. [INFO] skip non existing resourceDirectory C:\Users\Hugo\openmrs\openmrs\watched-projects\coreapps\web-2.0\src\test\resources
  477. [INFO] skip non existing resourceDirectory C:\Users\Hugo\openmrs\openmrs\watched-projects\coreapps\web-2.0\src\test\resources
  478. [INFO]
  479. [INFO] --- maven-compiler-plugin:3.1:testCompile (default-testCompile) @ coreapps-web-2.0 ---
  480. [INFO] No sources to compile
  481. [INFO]
  482. [INFO] --- maven-surefire-plugin:2.12.4:test (default-test) @ coreapps-web-2.0 ---
  483. [INFO] Tests are skipped.
  484. [INFO]
  485. [INFO] --- maven-jar-plugin:2.4:jar (default-jar) @ coreapps-web-2.0 ---
  486. [INFO] Building jar: C:\Users\Hugo\openmrs\openmrs\watched-projects\coreapps\web-2.0\target\coreapps-web-2.0-1.20.0-SNAPSHOT.jar
  487. [INFO]
  488. [INFO] --- maven-install-plugin:2.4:install (default-install) @ coreapps-web-2.0 ---
  489. [INFO] Installing C:\Users\Hugo\openmrs\openmrs\watched-projects\coreapps\web-2.0\target\coreapps-web-2.0-1.20.0-SNAPSHOT.jar to C:\Users\Hugo\.m2\repository\org\openm
  490. s\module\coreapps-web-2.0\1.20.0-SNAPSHOT\coreapps-web-2.0-1.20.0-SNAPSHOT.jar
  491. [INFO] Installing C:\Users\Hugo\openmrs\openmrs\watched-projects\coreapps\web-2.0\pom.xml to C:\Users\Hugo\.m2\repository\org\openmrs\module\coreapps-web-2.0\1.20.0-SN
  492. PSHOT\coreapps-web-2.0-1.20.0-SNAPSHOT.pom
  493. [INFO]
  494. [INFO] ------------------------------------------------------------------------
  495. [INFO] Building Core Apps Module API 2.2 1.20.0-SNAPSHOT
  496. [INFO] ------------------------------------------------------------------------
  497. [INFO]
  498. [INFO] --- maven-clean-plugin:2.5:clean (default-clean) @ coreapps-api-2.2 ---
  499. [INFO] Deleting C:\Users\Hugo\openmrs\openmrs\watched-projects\coreapps\api-2.2\target
  500. [INFO]
  501. [INFO] --- maven-resources-plugin:2.6:resources (default-resources) @ coreapps-api-2.2 ---
  502. [INFO] Using 'UTF-8' encoding to copy filtered resources.
  503. [INFO] skip non existing resourceDirectory C:\Users\Hugo\openmrs\openmrs\watched-projects\coreapps\api-2.2\src\main\resources
  504. [INFO]
  505. [INFO] --- maven-compiler-plugin:3.1:compile (default-compile) @ coreapps-api-2.2 ---
  506. [INFO] Changes detected - recompiling the module!
  507. [INFO] Compiling 1 source file to C:\Users\Hugo\openmrs\openmrs\watched-projects\coreapps\api-2.2\target\classes
  508. [WARNING] /C:/Users/Hugo/openmrs/openmrs/watched-projects/coreapps/api-2.2/src/main/java/org/openmrs/module/coreapps/htmlformentry/EncounterDiagnosesElement.java: C:\U
  509. ers\Hugo\openmrs\openmrs\watched-projects\coreapps\api-2.2\src\main\java\org\openmrs\module\coreapps\htmlformentry\EncounterDiagnosesElement.java uses or overrides a d
  510. precated API.
  511. [WARNING] /C:/Users/Hugo/openmrs/openmrs/watched-projects/coreapps/api-2.2/src/main/java/org/openmrs/module/coreapps/htmlformentry/EncounterDiagnosesElement.java: Reco
  512. pile with -Xlint:deprecation for details.
  513. [INFO]
  514. [INFO] --- maven-resources-plugin:2.6:testResources (default-testResources) @ coreapps-api-2.2 ---
  515. [INFO] Using 'UTF-8' encoding to copy filtered resources.
  516. [INFO] skip non existing resourceDirectory C:\Users\Hugo\openmrs\openmrs\watched-projects\coreapps\api-2.2\src\test\resources
  517. [INFO]
  518. [INFO] --- maven-compiler-plugin:3.1:testCompile (default-testCompile) @ coreapps-api-2.2 ---
  519. [INFO] No sources to compile
  520. [INFO]
  521. [INFO] --- maven-surefire-plugin:2.12.4:test (default-test) @ coreapps-api-2.2 ---
  522. [INFO] Tests are skipped.
  523. [INFO]
  524. [INFO] --- maven-jar-plugin:2.4:jar (default-jar) @ coreapps-api-2.2 ---
  525. [INFO] Building jar: C:\Users\Hugo\openmrs\openmrs\watched-projects\coreapps\api-2.2\target\coreapps-api-2.2-1.20.0-SNAPSHOT.jar
  526. [INFO]
  527. [INFO] --- maven-install-plugin:2.4:install (default-install) @ coreapps-api-2.2 ---
  528. [INFO] Installing C:\Users\Hugo\openmrs\openmrs\watched-projects\coreapps\api-2.2\target\coreapps-api-2.2-1.20.0-SNAPSHOT.jar to C:\Users\Hugo\.m2\repository\org\openm
  529. s\module\coreapps-api-2.2\1.20.0-SNAPSHOT\coreapps-api-2.2-1.20.0-SNAPSHOT.jar
  530. [INFO] Installing C:\Users\Hugo\openmrs\openmrs\watched-projects\coreapps\api-2.2\pom.xml to C:\Users\Hugo\.m2\repository\org\openmrs\module\coreapps-api-2.2\1.20.0-SN
  531. PSHOT\coreapps-api-2.2-1.20.0-SNAPSHOT.pom
  532. [INFO]
  533. [INFO] ------------------------------------------------------------------------
  534. [INFO] Building Core Apps Module OMOD 1.20.0-SNAPSHOT
  535. [INFO] ------------------------------------------------------------------------
  536. [INFO]
  537. [INFO] --- maven-clean-plugin:2.5:clean (default-clean) @ coreapps-omod ---
  538. [INFO]
  539. [INFO] --- maven-openmrs-plugin:1.0.1:initialize-module (init) @ coreapps-omod ---
  540. [INFO]
  541. [INFO] --- frontend-maven-plugin:1.4:install-node-and-npm (install node and npm) @ coreapps-omod ---
  542. [INFO] Node v6.10.0 is already installed.
  543. [INFO]
  544. [INFO] --- frontend-maven-plugin:1.4:npm (npm install) @ coreapps-omod ---
  545. [INFO] Running 'npm install --no-optional' in C:\Users\Hugo\openmrs\openmrs\watched-projects\coreapps
  546. [WARNING] npm WARN deprecated [email protected]: Ð??? Thanks for using Babel: we recommend using babel-preset-env now: please read babeljs.io/env to update!
  547. [WARNING] npm WARN deprecated [email protected]: Potential REDOS vulnerability removed in v1.1.0
  548. [WARNING] npm WARN deprecated [email protected]: Potential REDOS vulnerability fixed in v0.3.0
  549. [WARNING] npm WARN deprecated [email protected]: Please update to minimatch 3.0.2 or higher to avoid a RegExp DoS issue
  550. [WARNING] npm WARN deprecated [email protected]: this package has been reintegrated into npm and is now out of date with respect to npm
  551. [WARNING] npm WARN deprecated [email protected]: Please update to minimatch 3.0.2 or higher to avoid a RegExp DoS issue
  552. [WARNING] npm WARN deprecated [email protected]: please upgrade to graceful-fs 4 for compatibility with current and future versions of Node.js
  553. [WARNING] npm WARN deprecated [email protected]: Jade has been renamed to pug, please install the latest version of pug instead of jade
  554. [WARNING] npm WARN deprecated [email protected]: to-iso-string has been deprecated, use @segment/to-iso-string instead.
  555. [WARNING] npm WARN deprecated [email protected]: Please update to minimatch 3.0.2 or higher to avoid a RegExp DoS issue
  556. [WARNING] npm WARN deprecated [email protected]: no longer maintained
  557. [WARNING] npm WARN deprecated [email protected]: please upgrade to graceful-fs 4 for compatibility with current and future versions of Node.js
  558. [WARNING] npm WARN deprecated [email protected]: This module relies on Node.js's internals and will break at some point. Do not use it, and update to [email protected].
  559. [WARNING] npm WARN deprecated [email protected]: Use uuid module instead
  560. [WARNING] npm WARN deprecated [email protected]: gulp-util is deprecated - replace it, following the guidelines at https://medium.com/gulpjs/gulp-util-ca3b1f9f9ac5
  561. [INFO] - [email protected] node_modules\array-filter
  562. [INFO] - [email protected] node_modules\array-map
  563. [INFO] - [email protected] node_modules\array-reduce
  564. [INFO] - [email protected] node_modules\base\node_modules\isobject
  565. [INFO] - [email protected] node_modules\base\node_modules\kind-of
  566. [INFO] - [email protected] node_modules\bops\node_modules\base64-js
  567. [INFO] - [email protected] node_modules\cache-base\node_modules\isobject
  568. [INFO] - [email protected] node_modules\class-utils\node_modules\isobject
  569. [INFO] - [email protected] node_modules\clone-deep\node_modules\for-own
  570. [INFO] - [email protected] node_modules\clone-deep\node_modules\kind-of
  571. [INFO] - [email protected] node_modules\cwise-compiler\node_modules\uniq
  572. [INFO] - [email protected] node_modules\cwise-compiler
  573. [INFO] - [email protected] node_modules\cwise-parser\node_modules\esprima
  574. [INFO] - [email protected] node_modules\cwise-parser\node_modules\uniq
  575. [INFO] - [email protected] node_modules\cwise-parser
  576. [INFO] - [email protected] node_modules\cwise
  577. [INFO] - [email protected] node_modules\define-property\node_modules\isobject
  578. [INFO] - [email protected] node_modules\define-property\node_modules\kind-of
  579. [INFO] - [email protected] node_modules\escodegen\node_modules\source-map
  580. [INFO] - [email protected] node_modules\exec-buffer
  581. [INFO] - [email protected] node_modules\gifsicle
  582. [INFO] - [email protected] node_modules\has-value\node_modules\isobject
  583. [INFO] - [email protected] node_modules\imagemin-gifsicle\node_modules\isarray
  584. [INFO] - [email protected] node_modules\imagemin-gifsicle\node_modules\string_decoder
  585. [INFO] - [email protected] node_modules\imagemin-gifsicle\node_modules\readable-stream
  586. [INFO] - [email protected] node_modules\imagemin-gifsicle\node_modules\through2
  587. [INFO] - [email protected] node_modules\imagemin-optipng\node_modules\isarray
  588. [INFO] - [email protected] node_modules\imagemin-optipng\node_modules\string_decoder
  589. [INFO] - [email protected] node_modules\imagemin-optipng\node_modules\readable-stream
  590. [INFO] - [email protected] node_modules\imagemin-optipng\node_modules\through2
  591. [INFO] - [email protected] node_modules\imagemin-svgo\node_modules\csso
  592. [INFO] - [email protected] node_modules\imagemin-svgo\node_modules\is-svg
  593. [INFO] - [email protected] node_modules\imagemin-svgo\node_modules\js-yaml
  594. [INFO] - [email protected] node_modules\imagemin-svgo\node_modules\svgo
  595. [INFO] - [email protected] node_modules\imagemin-svgo
  596. [INFO] - [email protected] node_modules\iota-array
  597. [INFO] - [email protected] node_modules\is-gif
  598. [INFO] - [email protected] node_modules\imagemin-gifsicle
  599. [INFO] - [email protected] node_modules\is-jpg
  600. [INFO] - [email protected] node_modules\is-plain-object\node_modules\isobject
  601. [INFO] - [email protected] node_modules\jpegtran-bin
  602. [INFO] - [email protected] node_modules\imagemin-jpegtran
  603. [INFO] - [email protected] node_modules\jsbn
  604. [INFO] - [email protected] node_modules\ecc-jsbn
  605. [INFO] - [email protected] node_modules\jsonfile\node_modules\graceful-fs
  606. [INFO] - [email protected] node_modules\klaw\node_modules\graceful-fs
  607. [INFO] - [email protected] node_modules\nanomatch\node_modules\kind-of
  608. [INFO] - [email protected] node_modules\ndarray
  609. [INFO] - [email protected] node_modules\ndarray-pack
  610. [INFO] - [email protected] node_modules\obj-extend
  611. [INFO] - [email protected] node_modules\object-visit\node_modules\isobject
  612. [INFO] - [email protected] node_modules\object.pick\node_modules\isobject
  613. [INFO] - [email protected] node_modules\optipng-bin
  614. [INFO] - [email protected] node_modules\imagemin-optipng
  615. [INFO] - [email protected] node_modules\package
  616. [INFO] - [email protected] node_modules\phantomjssmith\node_modules\temporary
  617. [INFO] - [email protected] node_modules\pngjs
  618. [INFO] - [email protected] node_modules\pngparse
  619. [INFO] - [email protected] node_modules\ppm\node_modules\through
  620. [INFO] - [email protected] node_modules\ppm
  621. [INFO] - [email protected] node_modules\get-pixels
  622. [INFO] - [email protected] node_modules\save-pixels
  623. [INFO] - [email protected] node_modules\shell-quote
  624. [INFO] - [email protected] node_modules\phantomjssmith
  625. [INFO] - [email protected] node_modules\snapdragon-node\node_modules\isobject
  626. [INFO] - [email protected] node_modules\snapdragon-node\node_modules\kind-of
  627. [INFO] - [email protected] node_modules\to-utf8
  628. [INFO] - [email protected] node_modules\bops
  629. [INFO] - [email protected] node_modules\pngsmith\node_modules\concat-stream
  630. [INFO] - [email protected] node_modules\pngsmith
  631. [INFO] - [email protected] node_modules\tweetnacl
  632. [INFO] - [email protected] node_modules\bcrypt-pbkdf
  633. [INFO] - [email protected] node_modules\unset-value\node_modules\isobject
  634. [INFO] - [email protected] node_modules\use\node_modules\kind-of
  635. [INFO] - [email protected] node_modules\watchpack\node_modules\isobject
  636. [INFO] - [email protected] node_modules\watchpack\node_modules\kind-of
  637. [INFO] - [email protected] node_modules\temporary
  638. [INFO] [email protected] C:\Users\Hugo\openmrs\openmrs\watched-projects\coreapps
  639. [INFO] +-- [email protected]
  640. [INFO] | `-- [email protected]
  641. [INFO] | `-- [email protected]
  642. [INFO] | `-- [email protected]
  643. [INFO] | +-- [email protected]
  644. [INFO] | | `-- [email protected]
  645. [INFO] | | `-- [email protected]
  646. [INFO] | | +-- [email protected]
  647. [INFO] | | | `-- [email protected]
  648. [INFO] | | `-- [email protected]
  649. [INFO] | +-- [email protected]
  650. [INFO] | `-- [email protected]
  651. [INFO] | `-- [email protected]
  652. [INFO] +-- [email protected]
  653. [INFO] | `-- [email protected]
  654. [INFO] | +-- [email protected]
  655. [INFO] | +-- [email protected]
  656. [INFO] | | `-- [email protected]
  657. [INFO] | `-- [email protected]
  658. [INFO] `-- UNMET PEER DEPENDENCY [email protected]
  659. [INFO] +-- [email protected]
  660. [INFO] | `-- [email protected]
  661. [INFO] | `-- [email protected]
  662. [INFO] | `-- [email protected]
  663. [INFO] | `-- [email protected]
  664. [INFO] | `-- [email protected]
  665. [INFO] `-- [email protected]
  666. [INFO] `-- [email protected]
  667. [INFO] `-- [email protected]
  668. [INFO] +-- [email protected]
  669. [INFO] | `-- [email protected]
  670. [INFO] | `-- [email protected]
  671. [INFO] | `-- [email protected]
  672. [INFO] +-- [email protected]
  673. [INFO] | +-- [email protected]
  674. [INFO] | | +-- [email protected]
  675. [INFO] | | | `-- [email protected]
  676. [INFO] | | | `-- [email protected]
  677. [INFO] | | `-- [email protected]
  678. [INFO] | | `-- [email protected]
  679. [INFO] | | `-- [email protected]
  680. [INFO] | | `-- [email protected]
  681. [INFO] | `-- [email protected]
  682. [INFO] | `-- [email protected]
  683. [INFO] | +-- [email protected]
  684. [INFO] | | `-- [email protected]
  685. [INFO] | `-- [email protected]
  686. [INFO] | `-- [email protected]
  687. [INFO] `-- [email protected]
  688. [INFO] `-- [email protected]
  689. [INFO] `-- [email protected]
  690. [INFO]
  691. [WARNING] npm WARN [email protected] requires a peer of webpack@^3.0.0 || ^4.0.0 but none was installed.
  692. [INFO]
  693. [INFO] --- frontend-maven-plugin:1.4:npm (npm run build) @ coreapps-omod ---
  694. [INFO] Running 'npm run build' in C:\Users\Hugo\openmrs\openmrs\watched-projects\coreapps
  695. [INFO]
  696. [INFO] > [email protected] build C:\Users\Hugo\openmrs\openmrs\watched-projects\coreapps
  697. [INFO] > rimraf %npm_package_config_targetDir% && rimraf $npm_package_config_targetDir && karma start && webpack --progress --colors --env=prod
  698. [INFO]
  699. [INFO] webpack: wait until bundle finished:
  700. [ERROR]
  701. [ERROR] npm ERR! Windows_NT 10.0.16299
  702. [ERROR] npm ERR! argv "C:\\Users\\Hugo\\openmrs\\openmrs\\watched-projects\\coreapps\\node\\node.exe" "C:\\Users\\Hugo\\openmrs\\openmrs\\watched-projects\\coreapps\\n
  703. de\\node_modules\\npm\\bin\\npm-cli.js" "run" "build"
  704. [ERROR] npm ERR! node v6.10.0
  705. [ERROR] npm ERR! npm v3.10.10
  706. [ERROR] npm ERR! code ELIFECYCLE
  707. [ERROR] npm ERR! [email protected] build: `rimraf %npm_package_config_targetDir% && rimraf $npm_package_config_targetDir && karma start && webpack --progress --
  708. olors --env=prod`
  709. [ERROR] npm ERR! Exit status 1
  710. [ERROR] npm ERR!
  711. [ERROR] npm ERR! Failed at the [email protected] build script 'rimraf %npm_package_config_targetDir% && rimraf $npm_package_config_targetDir && karma start && w
  712. bpack --progress --colors --env=prod'.
  713. [ERROR] npm ERR! Make sure you have the latest version of node.js and npm installed.
  714. [ERROR] npm ERR! If you do, this is most likely a problem with the angularjs-coreapps package,
  715. [ERROR] npm ERR! not with npm itself.
  716. [ERROR] npm ERR! Tell the author that this fails on your system:
  717. [ERROR] npm ERR! rimraf %npm_package_config_targetDir% && rimraf $npm_package_config_targetDir && karma start && webpack --progress --colors --env=prod
  718. [ERROR] npm ERR! You can get information on how to open an issue for this project with:
  719. [ERROR] npm ERR! npm bugs angularjs-coreapps
  720. [ERROR] npm ERR! Or if that isn't available, you can get their info via:
  721. [ERROR] npm ERR! npm owner ls angularjs-coreapps
  722. [ERROR] npm ERR! There is likely additional logging output above.
  723. [ERROR]
  724. [ERROR] npm ERR! Please include the following file with any support request:
  725. [ERROR] npm ERR! C:\Users\Hugo\openmrs\openmrs\watched-projects\coreapps\npm-debug.log
  726. [INFO] ------------------------------------------------------------------------
  727. [INFO] Reactor Summary:
  728. [INFO]
  729. [INFO] Basicexample ....................................... SUCCESS [ 3.171 s]
  730. [INFO] Basicexample API ................................... SUCCESS [ 12.313 s]
  731. [INFO] Basicexample OMOD .................................. SUCCESS [ 8.026 s]
  732. [INFO] Dermatology ........................................ SUCCESS [ 0.062 s]
  733. [INFO] Dermatology API .................................... SUCCESS [ 1.719 s]
  734. [INFO] Core Apps Module ................................... SUCCESS [ 0.062 s]
  735. [INFO] Core Apps Module API-pre2.2 ........................ SUCCESS [ 2.735 s]
  736. [INFO] Core Apps Module API ............................... SUCCESS [ 5.750 s]
  737. [INFO] Dermatology OMOD ................................... SUCCESS [ 2.953 s]
  738. [INFO] coreapps Module web 1.9 ............................ SUCCESS [ 1.047 s]
  739. [INFO] coreapps Module web 2.0 ............................ SUCCESS [ 1.828 s]
  740. [INFO] Core Apps Module API 2.2 ........................... SUCCESS [ 1.938 s]
  741. [INFO] Core Apps Module OMOD .............................. FAILURE [05:14 min]
  742. [INFO] openmrs-sdk-watched-projects-openmrs ............... SKIPPED
  743. [INFO] ------------------------------------------------------------------------
  744. [INFO] BUILD FAILURE
  745. [INFO] ------------------------------------------------------------------------
  746. [INFO] Total time: 06:02 min
  747. [INFO] Finished at: 2018-04-24T14:03:40+01:00
  748. [INFO] Final Memory: 74M/316M
  749. [INFO] ------------------------------------------------------------------------
  750. [ERROR] Failed to execute goal com.github.eirslett:frontend-maven-plugin:1.4:npm (npm run build) on project coreapps-omod: Failed to run task: 'npm run build' failed.
  751. rg.apache.commons.exec.ExecuteException: Process exited with an error: 1 (Exit value: 1) -> [Help 1]
  752. [ERROR]
  753. [ERROR] To see the full stack trace of the errors, re-run Maven with the -e switch.
  754. [ERROR] Re-run Maven using the -X switch to enable full debug logging.
  755. [ERROR]
  756. [ERROR] For more information about the errors and possible solutions, please read the following articles:
  757. [ERROR] [Help 1] http://cwiki.apache.org/confluence/display/MAVEN/MojoFailureException
  758. [ERROR]
  759. [ERROR] After correcting the problems, you can resume the build with the command
  760. [ERROR] mvn <goals> -rf :coreapps-omod
Add Comment
Please, Sign In to add comment