Guest User

Not Working!

a guest
Jun 9th, 2020
58
Never
Not a member of Pastebin yet? Sign Up, it unlocks many cool features!
  1. Executing
  2. Gradle task: runClient
  3.  
  4. Build
  5. info: MCreator 2020.3.22116, forge-1.15.2, 64-bit, 12189 MB, Windows 10,
  6. JVM 1.8.0_252, JAVA_HOME: C:\Program Files\Pylo\MCreator\jdk
  7.  
  8. >
  9. Configure project :
  10.  
  11. New
  12. Dep: net.minecraftforge:forge:1.15.2-31.2.0_mapped_snapshot_20200514-1.15.1
  13.  
  14. >
  15. Task :compileJava FAILED
  16.  
  17. C:\Users\Strix�k\Desktop\testingmod\src\main\java\net\mcreator\jourenycraft\block\AethernalOreBlock.java:29:
  18. error: cannot find symbol
  19. import
  20. net.mcreator.jourenycraft.itemgroup.BlocksItemGroup;
  21.  
  22.  
  23. ^
  24.  
  25.  
  26. symbol: class BlocksItemGroup
  27.  
  28.  
  29. location: package net.mcreator.jourenycraft.itemgroup
  30.  
  31. C:\Users\Strix�k\Desktop\testingmod\src\main\java\net\mcreator\jourenycraft\block\AethernalOreBlockBlock.java:16:
  32. error: cannot find symbol
  33. import
  34. net.mcreator.jourenycraft.itemgroup.BlocksItemGroup;
  35.  
  36.  
  37. ^
  38.  
  39.  
  40. symbol: class BlocksItemGroup
  41.  
  42.  
  43. location: package net.mcreator.jourenycraft.itemgroup
  44.  
  45. C:\Users\Strix�k\Desktop\testingmod\src\main\java\net\mcreator\jourenycraft\block\BedrockiumOreBlock.java:29:
  46. error: cannot find symbol
  47. import
  48. net.mcreator.jourenycraft.itemgroup.BlocksItemGroup;
  49.  
  50.  
  51. ^
  52.  
  53.  
  54. symbol: class BlocksItemGroup
  55.  
  56.  
  57. location: package net.mcreator.jourenycraft.itemgroup
  58.  
  59. C:\Users\Strix�k\Desktop\testingmod\src\main\java\net\mcreator\jourenycraft\block\BedrockiumOreBlockBlock.java:16:
  60. error: cannot find symbol
  61. import
  62. net.mcreator.jourenycraft.itemgroup.BlocksItemGroup;
  63.  
  64.  
  65. ^
  66.  
  67.  
  68. symbol: class BlocksItemGroup
  69.  
  70.  
  71. location: package net.mcreator.jourenycraft.itemgroup
  72.  
  73. C:\Users\Strix�k\Desktop\testingmod\src\main\java\net\mcreator\jourenycraft\block\BlockOfDeadBlock.java:28:
  74. error: cannot find symbol
  75. import
  76. net.mcreator.jourenycraft.itemgroup.BlocksItemGroup;
  77.  
  78.  
  79. ^
  80.  
  81.  
  82. symbol: class BlocksItemGroup
  83.  
  84.  
  85. location: package net.mcreator.jourenycraft.itemgroup
  86.  
  87. C:\Users\Strix�k\Desktop\testingmod\src\main\java\net\mcreator\jourenycraft\block\CGNBlockBlock.java:29:
  88. error: cannot find symbol
  89. import
  90. net.mcreator.jourenycraft.itemgroup.BlocksItemGroup;
  91.  
  92.  
  93. ^
  94.  
  95.  
  96. symbol: class BlocksItemGroup
  97.  
  98.  
  99. location: package net.mcreator.jourenycraft.itemgroup
  100.  
  101. C:\Users\Strix�k\Desktop\testingmod\src\main\java\net\mcreator\jourenycraft\block\ClockBlock.java:29:
  102. error: cannot find symbol
  103. import
  104. net.mcreator.jourenycraft.itemgroup.BlocksItemGroup;
  105.  
  106.  
  107. ^
  108.  
  109.  
  110. symbol: class BlocksItemGroup
  111.  
  112.  
  113. location: package net.mcreator.jourenycraft.itemgroup
  114.  
  115. C:\Users\Strix�k\Desktop\testingmod\src\main\java\net\mcreator\jourenycraft\block\CloudOreBlock.java:34:
  116. error: cannot find symbol
  117. import
  118. net.mcreator.jourenycraft.itemgroup.BlocksItemGroup;
  119.  
  120.  
  121. ^
  122.  
  123.  
  124. symbol: class BlocksItemGroup
  125.  
  126.  
  127. location: package net.mcreator.jourenycraft.itemgroup
  128.  
  129. C:\Users\Strix�k\Desktop\testingmod\src\main\java\net\mcreator\jourenycraft\block\CloudOreBlockBlock.java:26:
  130. error: cannot find symbol
  131. import
  132. net.mcreator.jourenycraft.itemgroup.BlocksItemGroup;
  133.  
  134.  
  135. ^
  136.  
  137.  
  138. symbol: class BlocksItemGroup
  139.  
  140.  
  141. location: package net.mcreator.jourenycraft.itemgroup
  142.  
  143. C:\Users\Strix�k\Desktop\testingmod\src\main\java\net\mcreator\jourenycraft\block\DarknessiumChestBlock.java:48:
  144. error: cannot find symbol
  145. import
  146. net.mcreator.jourenycraft.itemgroup.BlocksItemGroup;
  147.  
  148.  
  149. ^
  150.  
  151.  
  152. symbol: class BlocksItemGroup
  153.  
  154.  
  155. location: package net.mcreator.jourenycraft.itemgroup
  156.  
  157. C:\Users\Strix�k\Desktop\testingmod\src\main\java\net\mcreator\jourenycraft\block\DarknessiumOreBlock.java:32:
  158. error: cannot find symbol
  159. import
  160. net.mcreator.jourenycraft.itemgroup.BlocksItemGroup;
  161.  
  162.  
  163. ^
  164.  
  165.  
  166. symbol: class BlocksItemGroup
  167.  
  168.  
  169. location: package net.mcreator.jourenycraft.itemgroup
  170.  
  171. C:\Users\Strix�k\Desktop\testingmod\src\main\java\net\mcreator\jourenycraft\block\DarknessiumOreBlockBlock.java:20:
  172. error: cannot find symbol
  173. import
  174. net.mcreator.jourenycraft.itemgroup.BlocksItemGroup;
  175.  
  176.  
  177. ^
  178.  
  179.  
  180. symbol: class BlocksItemGroup
  181.  
  182.  
  183. location: package net.mcreator.jourenycraft.itemgroup
  184.  
  185. C:\Users\Strix�k\Desktop\testingmod\src\main\java\net\mcreator\jourenycraft\block\DeadLightBlock.java:19:
  186. error: cannot find symbol
  187. import
  188. net.mcreator.jourenycraft.itemgroup.BlocksItemGroup;
  189.  
  190.  
  191. ^
  192.  
  193.  
  194. symbol: class BlocksItemGroup
  195.  
  196.  
  197. location: package net.mcreator.jourenycraft.itemgroup
  198.  
  199. C:\Users\Strix�k\Desktop\testingmod\src\main\java\net\mcreator\jourenycraft\block\DiamondwallBlock.java:30:
  200. error: cannot find symbol
  201. import
  202. net.mcreator.jourenycraft.itemgroup.ToolsItemGroup;
  203.  
  204.  
  205. ^
  206.  
  207.  
  208. symbol: class ToolsItemGroup
  209.  
  210.  
  211. location: package net.mcreator.jourenycraft.itemgroup
  212.  
  213. C:\Users\Strix�k\Desktop\testingmod\src\main\java\net\mcreator\jourenycraft\block\ElectriciumOreBlock.java:29:
  214. error: cannot find symbol
  215. import
  216. net.mcreator.jourenycraft.itemgroup.BlocksItemGroup;
  217.  
  218.  
  219. ^
  220.  
  221.  
  222. symbol: class BlocksItemGroup
  223.  
  224.  
  225. location: package net.mcreator.jourenycraft.itemgroup
  226.  
  227. C:\Users\Strix�k\Desktop\testingmod\src\main\java\net\mcreator\jourenycraft\block\ElectriciumOreBlockBlock.java:16:
  228. error: cannot find symbol
  229. import
  230. net.mcreator.jourenycraft.itemgroup.BlocksItemGroup;
  231.  
  232.  
  233. ^
  234.  
  235.  
  236. symbol: class BlocksItemGroup
  237.  
  238.  
  239. location: package net.mcreator.jourenycraft.itemgroup
  240.  
  241. C:\Users\Strix�k\Desktop\testingmod\src\main\java\net\mcreator\jourenycraft\block\HellstoneOreBlock.java:29:
  242. error: cannot find symbol
  243. import
  244. net.mcreator.jourenycraft.itemgroup.BlocksItemGroup;
  245.  
  246.  
  247. ^
  248.  
  249.  
  250. symbol: class BlocksItemGroup
  251.  
  252.  
  253. location: package net.mcreator.jourenycraft.itemgroup
  254.  
  255. C:\Users\Strix�k\Desktop\testingmod\src\main\java\net\mcreator\jourenycraft\block\HellstoneOreBlockBlock.java:16:
  256. error: cannot find symbol
  257. import
  258. net.mcreator.jourenycraft.itemgroup.BlocksItemGroup;
  259.  
  260.  
  261. ^
  262.  
  263.  
  264. symbol: class BlocksItemGroup
  265.  
  266.  
  267. location: package net.mcreator.jourenycraft.itemgroup
  268.  
  269. C:\Users\Strix�k\Desktop\testingmod\src\main\java\net\mcreator\jourenycraft\block\IronTableBlock.java:29:
  270. error: cannot find symbol
  271. import
  272. net.mcreator.jourenycraft.itemgroup.BlocksItemGroup;
  273.  
  274.  
  275. ^
  276.  
  277.  
  278. symbol: class BlocksItemGroup
  279.  
  280.  
  281. location: package net.mcreator.jourenycraft.itemgroup
  282.  
  283. C:\Users\Strix�k\Desktop\testingmod\src\main\java\net\mcreator\jourenycraft\block\LampOffBlock.java:35:
  284. error: cannot find symbol
  285. import
  286. net.mcreator.jourenycraft.itemgroup.BlocksItemGroup;
  287.  
  288.  
  289. ^
  290.  
  291.  
  292. symbol: class BlocksItemGroup
  293.  
  294.  
  295. location: package net.mcreator.jourenycraft.itemgroup
  296.  
  297. C:\Users\Strix�k\Desktop\testingmod\src\main\java\net\mcreator\jourenycraft\block\LampOnBlock.java:35:
  298. error: cannot find symbol
  299. import
  300. net.mcreator.jourenycraft.itemgroup.ToolsItemGroup;
  301.  
  302.  
  303. ^
  304.  
  305.  
  306. symbol: class ToolsItemGroup
  307.  
  308.  
  309. location: package net.mcreator.jourenycraft.itemgroup
  310.  
  311. C:\Users\Strix�k\Desktop\testingmod\src\main\java\net\mcreator\jourenycraft\block\MoltenDeadBlock.java:15:
  312. error: cannot find symbol
  313. import
  314. net.mcreator.jourenycraft.itemgroup.BlocksItemGroup;
  315.  
  316.  
  317. ^
  318.  
  319.  
  320. symbol: class BlocksItemGroup
  321.  
  322.  
  323. location: package net.mcreator.jourenycraft.itemgroup
  324.  
  325. C:\Users\Strix�k\Desktop\testingmod\src\main\java\net\mcreator\jourenycraft\block\MysticOreBlock.java:29:
  326. error: cannot find symbol
  327. import
  328. net.mcreator.jourenycraft.itemgroup.BlocksItemGroup;
  329.  
  330.  
  331. ^
  332.  
  333.  
  334. symbol: class BlocksItemGroup
  335.  
  336.  
  337. location: package net.mcreator.jourenycraft.itemgroup
  338.  
  339. C:\Users\Strix�k\Desktop\testingmod\src\main\java\net\mcreator\jourenycraft\block\MysticOreBlockBlock.java:16:
  340. error: cannot find symbol
  341. import
  342. net.mcreator.jourenycraft.itemgroup.BlocksItemGroup;
  343.  
  344.  
  345. ^
  346.  
  347.  
  348. symbol: class BlocksItemGroup
  349.  
  350.  
  351. location: package net.mcreator.jourenycraft.itemgroup
  352.  
  353. C:\Users\Strix�k\Desktop\testingmod\src\main\java\net\mcreator\jourenycraft\block\ParrotiumOreBlock.java:29:
  354. error: cannot find symbol
  355. import
  356. net.mcreator.jourenycraft.itemgroup.BlocksItemGroup;
  357.  
  358.  
  359. ^
  360.  
  361.  
  362. symbol: class BlocksItemGroup
  363.  
  364.  
  365. location: package net.mcreator.jourenycraft.itemgroup
  366.  
  367. C:\Users\Strix�k\Desktop\testingmod\src\main\java\net\mcreator\jourenycraft\block\ParrotiumOreBlockBlock.java:16:
  368. error: cannot find symbol
  369. import
  370. net.mcreator.jourenycraft.itemgroup.BlocksItemGroup;
  371.  
  372.  
  373. ^
  374.  
  375.  
  376. symbol: class BlocksItemGroup
  377.  
  378.  
  379. location: package net.mcreator.jourenycraft.itemgroup
  380.  
  381. C:\Users\Strix�k\Desktop\testingmod\src\main\java\net\mcreator\jourenycraft\block\PinkDiamondOreBlock.java:29:
  382. error: cannot find symbol
  383. import
  384. net.mcreator.jourenycraft.itemgroup.BlocksItemGroup;
  385.  
  386.  
  387. ^
  388.  
  389.  
  390. symbol: class BlocksItemGroup
  391.  
  392.  
  393. location: package net.mcreator.jourenycraft.itemgroup
  394.  
  395. C:\Users\Strix�k\Desktop\testingmod\src\main\java\net\mcreator\jourenycraft\block\PinkDiamondOreBlockBlock.java:16:
  396. error: cannot find symbol
  397. import
  398. net.mcreator.jourenycraft.itemgroup.BlocksItemGroup;
  399.  
  400.  
  401. ^
  402.  
  403.  
  404. symbol: class BlocksItemGroup
  405.  
  406.  
  407. location: package net.mcreator.jourenycraft.itemgroup
  408.  
  409. C:\Users\Strix�k\Desktop\testingmod\src\main\java\net\mcreator\jourenycraft\block\RainbowniteOreBlock.java:29:
  410. error: cannot find symbol
  411. import
  412. net.mcreator.jourenycraft.itemgroup.BlocksItemGroup;
  413.  
  414.  
  415. ^
  416.  
  417.  
  418. symbol: class BlocksItemGroup
  419.  
  420.  
  421. location: package net.mcreator.jourenycraft.itemgroup
  422.  
  423. C:\Users\Strix�k\Desktop\testingmod\src\main\java\net\mcreator\jourenycraft\block\RainbowniteOreBlockBlock.java:16:
  424. error: cannot find symbol
  425. import
  426. net.mcreator.jourenycraft.itemgroup.BlocksItemGroup;
  427.  
  428.  
  429. ^
  430.  
  431.  
  432. symbol: class BlocksItemGroup
  433.  
  434.  
  435. location: package net.mcreator.jourenycraft.itemgroup
  436.  
  437. C:\Users\Strix�k\Desktop\testingmod\src\main\java\net\mcreator\jourenycraft\block\RubyOreBlock.java:29:
  438. error: cannot find symbol
  439. import
  440. net.mcreator.jourenycraft.itemgroup.BlocksItemGroup;
  441.  
  442.  
  443. ^
  444.  
  445.  
  446. symbol: class BlocksItemGroup
  447.  
  448.  
  449. location: package net.mcreator.jourenycraft.itemgroup
  450.  
  451. C:\Users\Strix�k\Desktop\testingmod\src\main\java\net\mcreator\jourenycraft\block\RubyOreBlockBlock.java:16:
  452. error: cannot find symbol
  453. import
  454. net.mcreator.jourenycraft.itemgroup.BlocksItemGroup;
  455.  
  456.  
  457. ^
  458.  
  459.  
  460. symbol: class BlocksItemGroup
  461.  
  462.  
  463. location: package net.mcreator.jourenycraft.itemgroup
  464.  
  465. C:\Users\Strix�k\Desktop\testingmod\src\main\java\net\mcreator\jourenycraft\block\SASAGANGBlock.java:29:
  466. error: cannot find symbol
  467. import
  468. net.mcreator.jourenycraft.itemgroup.BlocksItemGroup;
  469.  
  470.  
  471. ^
  472.  
  473.  
  474. symbol: class BlocksItemGroup
  475.  
  476.  
  477. location: package net.mcreator.jourenycraft.itemgroup
  478.  
  479. C:\Users\Strix�k\Desktop\testingmod\src\main\java\net\mcreator\jourenycraft\block\SeaWeedBlock.java:39:
  480. error: cannot find symbol
  481. import
  482. net.mcreator.jourenycraft.itemgroup.ItemsItemGroup;
  483.  
  484.  
  485. ^
  486.  
  487.  
  488. symbol: class ItemsItemGroup
  489.  
  490.  
  491. location: package net.mcreator.jourenycraft.itemgroup
  492.  
  493. C:\Users\Strix�k\Desktop\testingmod\src\main\java\net\mcreator\jourenycraft\block\StrixiumOreBlock.java:32:
  494. error: cannot find symbol
  495. import
  496. net.mcreator.jourenycraft.itemgroup.BlocksItemGroup;
  497.  
  498.  
  499. ^
  500.  
  501.  
  502. symbol: class BlocksItemGroup
  503.  
  504.  
  505. location: package net.mcreator.jourenycraft.itemgroup
  506.  
  507. C:\Users\Strix�k\Desktop\testingmod\src\main\java\net\mcreator\jourenycraft\block\TSBBlock.java:32:
  508. error: cannot find symbol
  509. import
  510. net.mcreator.jourenycraft.itemgroup.BlocksItemGroup;
  511.  
  512.  
  513. ^
  514.  
  515.  
  516. symbol: class BlocksItemGroup
  517.  
  518.  
  519. location: package net.mcreator.jourenycraft.itemgroup
  520.  
  521. C:\Users\Strix�k\Desktop\testingmod\src\main\java\net\mcreator\jourenycraft\block\TVBlock.java:35:
  522. error: cannot find symbol
  523. import
  524. net.mcreator.jourenycraft.itemgroup.BlocksItemGroup;
  525.  
  526.  
  527. ^
  528.  
  529.  
  530. symbol: class BlocksItemGroup
  531.  
  532.  
  533. location: package net.mcreator.jourenycraft.itemgroup
  534.  
  535. C:\Users\Strix�k\Desktop\testingmod\src\main\java\net\mcreator\jourenycraft\block\UraniumOreBlock.java:29:
  536. error: cannot find symbol
  537. import
  538. net.mcreator.jourenycraft.itemgroup.BlocksItemGroup;
  539.  
  540.  
  541. ^
  542.  
  543.  
  544. symbol: class BlocksItemGroup
  545.  
  546.  
  547. location: package net.mcreator.jourenycraft.itemgroup
  548.  
  549. C:\Users\Strix�k\Desktop\testingmod\src\main\java\net\mcreator\jourenycraft\block\UraniumOreBlockBlock.java:16:
  550. error: cannot find symbol
  551. import
  552. net.mcreator.jourenycraft.itemgroup.BlocksItemGroup;
  553.  
  554.  
  555. ^
  556.  
  557.  
  558. symbol: class BlocksItemGroup
  559.  
  560.  
  561. location: package net.mcreator.jourenycraft.itemgroup
  562.  
  563. C:\Users\Strix�k\Desktop\testingmod\src\main\java\net\mcreator\jourenycraft\item\BurgerItem.java:11:
  564. error: cannot find symbol
  565. import
  566. net.mcreator.jourenycraft.itemgroup.FoodItemGroup;
  567.  
  568.  
  569. ^
  570.  
  571.  
  572. symbol: class FoodItemGroup
  573.  
  574.  
  575. location: package net.mcreator.jourenycraft.itemgroup
  576.  
  577. C:\Users\Strix�k\Desktop\testingmod\src\main\java\net\mcreator\jourenycraft\item\CrispsItem.java:11:
  578. error: cannot find symbol
  579. import
  580. net.mcreator.jourenycraft.itemgroup.FoodItemGroup;
  581.  
  582.  
  583. ^
  584.  
  585.  
  586. symbol: class FoodItemGroup
  587.  
  588.  
  589. location: package net.mcreator.jourenycraft.itemgroup
  590.  
  591. C:\Users\Strix�k\Desktop\testingmod\src\main\java\net\mcreator\jourenycraft\item\DarknessiumPickaxeItem.java:11:
  592. error: cannot find symbol
  593. import
  594. net.mcreator.jourenycraft.itemgroup.ToolsItemGroup;
  595.  
  596.  
  597. ^
  598.  
  599.  
  600. symbol: class ToolsItemGroup
  601.  
  602.  
  603. location: package net.mcreator.jourenycraft.itemgroup
  604.  
  605. C:\Users\Strix�k\Desktop\testingmod\src\main\java\net\mcreator\jourenycraft\item\MusicdiscItem.java:11:
  606. error: cannot find symbol
  607. import
  608. net.mcreator.jourenycraft.itemgroup.ItemsItemGroup;
  609.  
  610.  
  611. ^
  612.  
  613.  
  614. symbol: class ItemsItemGroup
  615.  
  616.  
  617. location: package net.mcreator.jourenycraft.itemgroup
  618.  
  619. C:\Users\Strix�k\Desktop\testingmod\src\main\java\net\mcreator\jourenycraft\item\MusicDiskItem.java:11:
  620. error: cannot find symbol
  621. import
  622. net.mcreator.jourenycraft.itemgroup.ItemsItemGroup;
  623.  
  624.  
  625. ^
  626.  
  627.  
  628. symbol: class ItemsItemGroup
  629.  
  630.  
  631. location: package net.mcreator.jourenycraft.itemgroup
  632.  
  633. C:\Users\Strix�k\Desktop\testingmod\src\main\java\net\mcreator\jourenycraft\item\MysticArmorItem.java:18:
  634. error: cannot find symbol
  635. import
  636. net.mcreator.jourenycraft.itemgroup.ArmorItemGroup;
  637.  
  638.  
  639. ^
  640.  
  641.  
  642. symbol: class ArmorItemGroup
  643.  
  644.  
  645. location: package net.mcreator.jourenycraft.itemgroup
  646.  
  647. C:\Users\Strix�k\Desktop\testingmod\src\main\java\net\mcreator\jourenycraft\item\SpeedBootsItem.java:21:
  648. error: cannot find symbol
  649. import
  650. net.mcreator.jourenycraft.itemgroup.ArmorItemGroup;
  651.  
  652.  
  653. ^
  654.  
  655.  
  656. symbol: class ArmorItemGroup
  657.  
  658.  
  659. location: package net.mcreator.jourenycraft.itemgroup
  660.  
  661. 46
  662. errors
  663.  
  664. FAILURE:
  665. Build failed with an exception.
  666.  
  667. *
  668. What went wrong:
  669.  
  670. Execution
  671. failed for task ':compileJava'.
  672.  
  673. >
  674. Compilation failed; see the compiler error output for details.
  675.  
  676. *
  677. Try:
  678.  
  679. Run
  680. with --stacktrace option to get the stack trace. Run with --info or
  681. --debug option to get more log output. Run with --scan to get full
  682. insights.
  683.  
  684. *
  685. Get more help at https://help.gradle.org
  686.  
  687. Deprecated
  688. Gradle features were used in this build, making it incompatible with
  689. Gradle 5.0.
  690.  
  691. Use
  692. '--warning-mode all' to show the individual deprecation warnings.
  693.  
  694. See
  695. https://docs.gradle.org/4.10.3/userguide/command_line_interface.html#sec:command_line_warnings
  696.  
  697. BUILD
  698. FAILED in 3s
  699.  
  700. 1
  701. actionable task: 1 executed
  702.  
  703. BUILD
  704. FAILED
  705.  
  706. Task
  707. completed in 4082 milliseconds
RAW Paste Data