ftab

AGL SDK app template build error

May 24th, 2017
220
0
Never
Not a member of Pastebin yet? Sign Up, it unlocks many cool features!
Make 3.14 KB | None | 0 0
  1. [02:44:06] devel@agl-worker-build-0-build:~/app-templates/templates/native(master)$ ./AGLbuild package
  2. -- The C compiler identification is GNU 6.2.0
  3. -- The CXX compiler identification is GNU 6.2.0
  4. -- Check for working C compiler: /xdt/sdk/sysroots/x86_64-aglsdk-linux/usr/bin/arm-agl-linux-gnueabi/arm-agl-linux-gnueabi-gcc
  5. -- Check for working C compiler: /xdt/sdk/sysroots/x86_64-aglsdk-linux/usr/bin/arm-agl-linux-gnueabi/arm-agl-linux-gnueabi-gcc -- works
  6. -- Detecting C compiler ABI info
  7. -- Detecting C compiler ABI info - done
  8. -- Detecting C compile features
  9. -- Detecting C compile features - done
  10. -- Check for working CXX compiler: /xdt/sdk/sysroots/x86_64-aglsdk-linux/usr/bin/arm-agl-linux-gnueabi/arm-agl-linux-gnueabi-g++
  11. -- Check for working CXX compiler: /xdt/sdk/sysroots/x86_64-aglsdk-linux/usr/bin/arm-agl-linux-gnueabi/arm-agl-linux-gnueabi-g++ -- works
  12. -- Detecting CXX compiler ABI info
  13. -- Detecting CXX compiler ABI info - done
  14. -- Detecting CXX compile features
  15. -- Detecting CXX compile features - done
  16. -- Check gcc_minimal_version (found gcc version 6.2.0)  (found g++ version 6.2.0)
  17. -- Found PkgConfig: /xdt/sdk/sysroots/x86_64-aglsdk-linux/usr/bin/pkg-config (found version "0.29.1")
  18. -- Checking for module 'json-c'
  19. --   Found json-c, version 0.12
  20. -- Checking for module 'afb-daemon'
  21. --   Found afb-daemon, version 1.0
  22. -- Looking for malloc in efence
  23. -- Looking for malloc in efence - not found
  24. -- Configuring done
  25. -- Generating done
  26. -- Build files have been written to: /home/devel/app-templates/templates/native/build
  27. make[1]: Entering directory '/home/devel/app-templates/templates/native/build'
  28. make[2]: Entering directory '/home/devel/app-templates/templates/native/build'
  29. make[3]: Entering directory '/home/devel/app-templates/templates/native/build'
  30. Scanning dependencies of target xxx-native-app
  31. make[3]: Leaving directory '/home/devel/app-templates/templates/native/build'
  32. make[3]: Entering directory '/home/devel/app-templates/templates/native/build'
  33. [ 50%] Building C object app/CMakeFiles/xxx-native-app.dir/xxx-native-app.c.o
  34. [100%] Linking C executable xxx-native-app
  35. /xdt/sdk/sysroots/x86_64-aglsdk-linux/usr/libexec/arm-agl-linux-gnueabi/gcc/arm-agl-linux-gnueabi/6.2.0/real-ld: CMakeFiles/xxx-native-app.dir/xxx-native-app.c.o: undefined reference to symbol 'sd_event_run@@LIBSYSTEMD_221'
  36. /xdt/sdk/sysroots/armv7vehf-neon-vfpv4-agl-linux-gnueabi/lib/libsystemd.so.0: error adding symbols: DSO missing from command line
  37. collect2: error: ld returned 1 exit status
  38. app/CMakeFiles/xxx-native-app.dir/build.make:94: recipe for target 'app/xxx-native-app' failed
  39. make[3]: *** [app/xxx-native-app] Error 1
  40. make[3]: Leaving directory '/home/devel/app-templates/templates/native/build'
  41. CMakeFiles/Makefile2:219: recipe for target 'app/CMakeFiles/xxx-native-app.dir/all' failed
  42. make[2]: *** [app/CMakeFiles/xxx-native-app.dir/all] Error 2
  43. make[2]: Leaving directory '/home/devel/app-templates/templates/native/build'
  44. Makefile:127: recipe for target 'all' failed
  45. make[1]: *** [all] Error 2
  46. make[1]: Leaving directory '/home/devel/app-templates/templates/native/build'
  47. AGLbuild:33: recipe for target 'build' failed
  48. make: *** [build] Error 2
Advertisement
Add Comment
Please, Sign In to add comment