SHARE
TWEET

Eye of Gnome (eog), fsanitize=memory, breakage report

a guest Aug 3rd, 2013 79 Never
Not a member of Pastebin yet? Sign Up, it unlocks many cool features!
  1. 2 warnings generated.
  2. 244 warnings generated.
  3.   CCLD     libeog.la
  4. copying selected object files to avoid basename conflicts...
  5.   CCLD     eog
  6.   GISCAN   Eog-3.0.gir
  7. eog-error-message-area.c:146: Warning: Eog: ignoring unrecognized GTK-Doc comment block, identifier not found:
  8.  * eog_image_load_error_message_area_new: (skip):
  9.    ^
  10. eog-error-message-area.c:188: Warning: Eog: ignoring unrecognized GTK-Doc comment block, identifier not found:
  11.  * eog_image_save_error_message_area_new: (skip):
  12.    ^
  13. eog-error-message-area.c:231: Warning: Eog: ignoring unrecognized GTK-Doc comment block, identifier not found:
  14.  * eog_no_images_error_message_area_new: (skip):
  15.    ^
  16. UMR in __interceptor_strlen at offset 3 inside [0x60200000f050, +4)
  17. ==7778== WARNING: Use of uninitialized value
  18.     #0 0x7f6438c04952 (/home/user/gnome/lib64/libglib-2.0.so.0+0x64952)
  19.     #1 0x7f6438c17af3 (/home/user/gnome/lib64/libglib-2.0.so.0+0x77af3)
  20.     #2 0x7f6438bf31f2 (/home/user/gnome/lib64/libglib-2.0.so.0+0x531f2)
  21.     #3 0x7f643cf39c52 (/home/user/checkout/gnome-memory/eog/src/eog+0x45c52)
  22.     #4 0x7f6437dadb74 (/lib64/libc.so.6+0x3c7b221b74)
  23.     #5 0x7f643cf3992c (/home/user/checkout/gnome-memory/eog/src/eog+0x4592c)
  24. Exiting
  25. Command '['./eog', '--introspect-dump=/tmp/tmp-introspectMbJy8I/functions.txt,/tmp/tmp-introspectMbJy8I/dump.xml']' returned non-zero exit status 77
  26. make[3]: *** [Eog-3.0.gir] Error 1
  27. make[3]: Leaving directory `/home/user/checkout/gnome-memory/eog/src'
  28. make[2]: *** [all] Error 2
  29. make[2]: Leaving directory `/home/user/checkout/gnome-memory/eog/src'
  30. make[1]: *** [all-recursive] Error 1
  31. make[1]: Leaving directory `/home/user/checkout/gnome-memory/eog'
  32. make: *** [all] Error 2
  33. *** Error during phase build of eog: ########## Error running make -j6 *** [1/1]
RAW Paste Data
Pastebin PRO Summer Special!
Get 40% OFF on Pastebin PRO accounts!
Top