Advertisement
Guest User

Untitled

a guest
Apr 15th, 2017
93
Never
Not a member of Pastebin yet? Sign Up, it unlocks many cool features!
  1. This file contains any messages produced by compilers while
  2. running configure, to aid debugging if configure makes a mistake.
  3.  
  4. It was created by GNU OpenMP Runtime Library configure 1.0, which was
  5. generated by GNU Autoconf 2.59. Invocation command line was
  6.  
  7. $ /home/seiza/buildroot/toolchain_build_mipsel/gcc-4.2.1/libgomp/configure --cache-file=./config.cache --build=x86_64-pc-linux-gnu --host=mipsel-linux-uclibc --target=mipsel-linux-uclibc --with-cross-host=x86_64-pc-linux-gnu --prefix=/usr --with-sysroot=/home/seiza/buildroot/build_mipsel/staging_dir --with-build-time-tools=/home/seiza/buildroot/build_mipsel/staging_dir/usr/mipsel-linux-uclibc/bin --disable-__cxa_atexit --enable-target-optspace --with-gnu-ld --enable-shared --with-gmp=/home/seiza/buildroot/toolchain_build_mipsel/gmp --with-mpfr=/home/seiza/buildroot/toolchain_build_mipsel/mpfr --disable-nls --enable-threads --disable-multilib --with-abi=32 --with-tune=mips32 --enable-languages=c,c++ --program-transform-name=s,^,mipsel-linux-uclibc-,; --with-target-subdir=mipsel-linux-uclibc --srcdir=/home/seiza/buildroot/toolchain_build_mipsel/gcc-4.2.1/libgomp
  8.  
  9. ## --------- ##
  10. ## Platform. ##
  11. ## --------- ##
  12.  
  13. hostname = seiza-desktop
  14. uname -m = x86_64
  15. uname -r = 2.6.31-14-generic
  16. uname -s = Linux
  17. uname -v = #48-Ubuntu SMP Fri Oct 16 14:05:01 UTC 2009
  18.  
  19. /usr/bin/uname -p = unknown
  20. /bin/uname -X = unknown
  21.  
  22. /bin/arch = unknown
  23. /usr/bin/arch -k = unknown
  24. /usr/convex/getsysinfo = unknown
  25. hostinfo = unknown
  26. /bin/machine = unknown
  27. /usr/bin/oslevel = unknown
  28. /bin/universe = unknown
  29.  
  30. PATH: /usr/local/sbin
  31. PATH: /usr/local/bin
  32. PATH: /usr/sbin
  33. PATH: /usr/bin
  34. PATH: /sbin
  35. PATH: /bin
  36. PATH: /usr/games
  37.  
  38.  
  39. ## ----------- ##
  40. ## Core tests. ##
  41. ## ----------- ##
  42.  
  43. configure:1253: creating cache ./config.cache
  44. configure:1348: checking for --enable-version-specific-runtime-libs
  45. configure:1365: result: no
  46. configure:1368: checking for --enable-linux-futex
  47. configure:1385: result: default
  48. configure:1393: checking for --enable-generated-files-in-srcdir
  49. configure:1410: result: no
  50. configure:1473: checking build system type
  51. configure:1491: result: x86_64-pc-linux-gnu
  52. configure:1499: checking host system type
  53. configure:1513: result: mipsel-unknown-linux-uclibc
  54. configure:1521: checking target system type
  55. configure:1535: result: mipsel-unknown-linux-uclibc
  56. configure:1577: checking for a BSD-compatible install
  57. configure:1632: result: /usr/bin/install -c
  58. configure:1643: checking whether build environment is sane
  59. configure:1686: result: yes
  60. configure:1751: checking for gawk
  61. configure:1780: result: no
  62. configure:1751: checking for mawk
  63. configure:1767: found /usr/bin/mawk
  64. configure:1777: result: mawk
  65. configure:1787: checking whether /usr/bin/make sets $(MAKE)
  66. configure:1807: result: yes
  67. configure:1883: checking for mipsel-linux-uclibc-strip
  68. configure:1909: result: /home/seiza/buildroot/build_mipsel/staging_dir/usr/mipsel-linux-uclibc/bin/strip
  69. configure:2061: checking for mipsel-linux-uclibc-gcc
  70. configure:2087: result: /home/seiza/buildroot/toolchain_build_mipsel/gcc-4.2.1-final/./gcc/xgcc -B/home/seiza/buildroot/toolchain_build_mipsel/gcc-4.2.1-final/./gcc/ -B/usr/mipsel-linux-uclibc/bin/ -B/usr/mipsel-linux-uclibc/lib/ -isystem /usr/mipsel-linux-uclibc/include -isystem /usr/mipsel-linux-uclibc/sys-include
  71. configure:2369: checking for C compiler version
  72. configure:2372: /home/seiza/buildroot/toolchain_build_mipsel/gcc-4.2.1-final/./gcc/xgcc -B/home/seiza/buildroot/toolchain_build_mipsel/gcc-4.2.1-final/./gcc/ -B/usr/mipsel-linux-uclibc/bin/ -B/usr/mipsel-linux-uclibc/lib/ -isystem /usr/mipsel-linux-uclibc/include -isystem /usr/mipsel-linux-uclibc/sys-include --version </dev/null >&5
  73. xgcc (GCC) 4.2.1
  74. Copyright (C) 2007 Free Software Foundation, Inc.
  75. This is free software; see the source for copying conditions. There is NO
  76. warranty; not even for MERCHANTABILITY or FITNESS FOR A PARTICULAR PURPOSE.
  77.  
  78. configure:2375: $? = 0
  79. configure:2377: /home/seiza/buildroot/toolchain_build_mipsel/gcc-4.2.1-final/./gcc/xgcc -B/home/seiza/buildroot/toolchain_build_mipsel/gcc-4.2.1-final/./gcc/ -B/usr/mipsel-linux-uclibc/bin/ -B/usr/mipsel-linux-uclibc/lib/ -isystem /usr/mipsel-linux-uclibc/include -isystem /usr/mipsel-linux-uclibc/sys-include -v </dev/null >&5
  80. Reading specs from /home/seiza/buildroot/toolchain_build_mipsel/gcc-4.2.1-final/./gcc/specs
  81. Target: mipsel-linux-uclibc
  82. Configured with: /home/seiza/buildroot/toolchain_build_mipsel/gcc-4.2.1/configure --prefix=/usr --build=x86_64-pc-linux-gnu --host=x86_64-pc-linux-gnu --target=mipsel-linux-uclibc --enable-languages=c,c++ --with-sysroot=/home/seiza/buildroot/build_mipsel/staging_dir --with-build-time-tools=/home/seiza/buildroot/build_mipsel/staging_dir/usr/mipsel-linux-uclibc/bin --disable-__cxa_atexit --enable-target-optspace --with-gnu-ld --enable-shared --with-gmp=/home/seiza/buildroot/toolchain_build_mipsel/gmp --with-mpfr=/home/seiza/buildroot/toolchain_build_mipsel/mpfr --disable-nls --enable-threads --disable-multilib --with-abi=32 --with-tune=mips32
  83. Thread model: posix
  84. gcc version 4.2.1
  85. configure:2380: $? = 0
  86. configure:2382: /home/seiza/buildroot/toolchain_build_mipsel/gcc-4.2.1-final/./gcc/xgcc -B/home/seiza/buildroot/toolchain_build_mipsel/gcc-4.2.1-final/./gcc/ -B/usr/mipsel-linux-uclibc/bin/ -B/usr/mipsel-linux-uclibc/lib/ -isystem /usr/mipsel-linux-uclibc/include -isystem /usr/mipsel-linux-uclibc/sys-include -V </dev/null >&5
  87. xgcc: '-V' must come at the start of the command line
  88. configure:2385: $? = 1
  89. configure:2408: checking for C compiler default output file name
  90. configure:2411: /home/seiza/buildroot/toolchain_build_mipsel/gcc-4.2.1-final/./gcc/xgcc -B/home/seiza/buildroot/toolchain_build_mipsel/gcc-4.2.1-final/./gcc/ -B/usr/mipsel-linux-uclibc/bin/ -B/usr/mipsel-linux-uclibc/lib/ -isystem /usr/mipsel-linux-uclibc/include -isystem /usr/mipsel-linux-uclibc/sys-include -g -Os -fno-jump-tables conftest.c >&5
  91. configure:2414: $? = 0
  92. configure:2460: result: a.out
  93. configure:2465: checking whether the C compiler works
  94. configure:2491: result: yes
  95. configure:2498: checking whether we are cross compiling
  96. configure:2500: result: yes
  97. configure:2503: checking for suffix of executables
  98. configure:2505: /home/seiza/buildroot/toolchain_build_mipsel/gcc-4.2.1-final/./gcc/xgcc -B/home/seiza/buildroot/toolchain_build_mipsel/gcc-4.2.1-final/./gcc/ -B/usr/mipsel-linux-uclibc/bin/ -B/usr/mipsel-linux-uclibc/lib/ -isystem /usr/mipsel-linux-uclibc/include -isystem /usr/mipsel-linux-uclibc/sys-include -o conftest -g -Os -fno-jump-tables conftest.c >&5
  99. configure:2508: $? = 0
  100. configure:2533: result:
  101. configure:2539: checking for suffix of object files
  102. configure:2560: /home/seiza/buildroot/toolchain_build_mipsel/gcc-4.2.1-final/./gcc/xgcc -B/home/seiza/buildroot/toolchain_build_mipsel/gcc-4.2.1-final/./gcc/ -B/usr/mipsel-linux-uclibc/bin/ -B/usr/mipsel-linux-uclibc/lib/ -isystem /usr/mipsel-linux-uclibc/include -isystem /usr/mipsel-linux-uclibc/sys-include -c -g -Os -fno-jump-tables conftest.c >&5
  103. configure:2563: $? = 0
  104. configure:2585: result: o
  105. configure:2589: checking whether we are using the GNU C compiler
  106. configure:2613: /home/seiza/buildroot/toolchain_build_mipsel/gcc-4.2.1-final/./gcc/xgcc -B/home/seiza/buildroot/toolchain_build_mipsel/gcc-4.2.1-final/./gcc/ -B/usr/mipsel-linux-uclibc/bin/ -B/usr/mipsel-linux-uclibc/lib/ -isystem /usr/mipsel-linux-uclibc/include -isystem /usr/mipsel-linux-uclibc/sys-include -c -g -Os -fno-jump-tables conftest.c >&5
  107. configure:2619: $? = 0
  108. configure:2623: test -z
  109. || test ! -s conftest.err
  110. configure:2626: $? = 0
  111. configure:2629: test -s conftest.o
  112. configure:2632: $? = 0
  113. configure:2645: result: yes
  114. configure:2651: checking whether /home/seiza/buildroot/toolchain_build_mipsel/gcc-4.2.1-final/./gcc/xgcc -B/home/seiza/buildroot/toolchain_build_mipsel/gcc-4.2.1-final/./gcc/ -B/usr/mipsel-linux-uclibc/bin/ -B/usr/mipsel-linux-uclibc/lib/ -isystem /usr/mipsel-linux-uclibc/include -isystem /usr/mipsel-linux-uclibc/sys-include accepts -g
  115. configure:2672: /home/seiza/buildroot/toolchain_build_mipsel/gcc-4.2.1-final/./gcc/xgcc -B/home/seiza/buildroot/toolchain_build_mipsel/gcc-4.2.1-final/./gcc/ -B/usr/mipsel-linux-uclibc/bin/ -B/usr/mipsel-linux-uclibc/lib/ -isystem /usr/mipsel-linux-uclibc/include -isystem /usr/mipsel-linux-uclibc/sys-include -c -g conftest.c >&5
  116. configure:2678: $? = 0
  117. configure:2682: test -z
  118. || test ! -s conftest.err
  119. configure:2685: $? = 0
  120. configure:2688: test -s conftest.o
  121. configure:2691: $? = 0
  122. configure:2702: result: yes
  123. configure:2719: checking for /home/seiza/buildroot/toolchain_build_mipsel/gcc-4.2.1-final/./gcc/xgcc -B/home/seiza/buildroot/toolchain_build_mipsel/gcc-4.2.1-final/./gcc/ -B/usr/mipsel-linux-uclibc/bin/ -B/usr/mipsel-linux-uclibc/lib/ -isystem /usr/mipsel-linux-uclibc/include -isystem /usr/mipsel-linux-uclibc/sys-include option to accept ANSI C
  124. configure:2789: /home/seiza/buildroot/toolchain_build_mipsel/gcc-4.2.1-final/./gcc/xgcc -B/home/seiza/buildroot/toolchain_build_mipsel/gcc-4.2.1-final/./gcc/ -B/usr/mipsel-linux-uclibc/bin/ -B/usr/mipsel-linux-uclibc/lib/ -isystem /usr/mipsel-linux-uclibc/include -isystem /usr/mipsel-linux-uclibc/sys-include -c -g -Os -fno-jump-tables conftest.c >&5
  125. configure:2795: $? = 0
  126. configure:2799: test -z
  127. || test ! -s conftest.err
  128. configure:2802: $? = 0
  129. configure:2805: test -s conftest.o
  130. configure:2808: $? = 0
  131. configure:2826: result: none needed
  132. configure:2844: /home/seiza/buildroot/toolchain_build_mipsel/gcc-4.2.1-final/./gcc/xgcc -B/home/seiza/buildroot/toolchain_build_mipsel/gcc-4.2.1-final/./gcc/ -B/usr/mipsel-linux-uclibc/bin/ -B/usr/mipsel-linux-uclibc/lib/ -isystem /usr/mipsel-linux-uclibc/include -isystem /usr/mipsel-linux-uclibc/sys-include -c -g -Os -fno-jump-tables conftest.c >&5
  133. conftest.c:2: error: expected '=', ',', ';', 'asm' or '__attribute__' before 'me'
  134. configure:2850: $? = 1
  135. configure: failed program was:
  136. | #ifndef __cplusplus
  137. | choke me
  138. | #endif
  139. configure:2994: checking for style of include used by /usr/bin/make
  140. configure:3022: result: GNU
  141. configure:3050: checking dependency style of /home/seiza/buildroot/toolchain_build_mipsel/gcc-4.2.1-final/./gcc/xgcc -B/home/seiza/buildroot/toolchain_build_mipsel/gcc-4.2.1-final/./gcc/ -B/usr/mipsel-linux-uclibc/bin/ -B/usr/mipsel-linux-uclibc/lib/ -isystem /usr/mipsel-linux-uclibc/include -isystem /usr/mipsel-linux-uclibc/sys-include
  142. configure:3140: result: gcc3
  143. configure:3175: checking for mipsel-linux-uclibc-ar
  144. configure:3201: result: /home/seiza/buildroot/build_mipsel/staging_dir/usr/mipsel-linux-uclibc/bin/ar
  145. configure:3254: checking for mipsel-linux-uclibc-ranlib
  146. configure:3280: result: /home/seiza/buildroot/build_mipsel/staging_dir/usr/mipsel-linux-uclibc/bin/ranlib
  147. configure:3333: checking for perl
  148. configure:3351: found /usr/bin/perl
  149. configure:3364: result: /usr/bin/perl
  150. configure:3371: checking whether /usr/bin/make sets $(MAKE)
  151. configure:3391: result: yes
  152. configure:3413: checking for a BSD-compatible install
  153. configure:3468: result: /usr/bin/install -c
  154. configure:3485: checking for makeinfo
  155. configure:3511: result: true --split-size=5000000
  156. configure:3520: checking for modern makeinfo
  157. configure:3538: result: no
  158. configure:3634: checking for ld used by GCC
  159. configure:3697: result: /home/seiza/buildroot/toolchain_build_mipsel/gcc-4.2.1-final/./gcc/collect-ld
  160. configure:3706: checking if the linker (/home/seiza/buildroot/toolchain_build_mipsel/gcc-4.2.1-final/./gcc/collect-ld) is GNU ld
  161. GNU ld (GNU Binutils) 2.18
  162. configure:3718: result: yes
  163. configure:3723: checking for /home/seiza/buildroot/toolchain_build_mipsel/gcc-4.2.1-final/./gcc/collect-ld option to reload object files
  164. configure:3730: result: -r
  165. configure:3735: checking for BSD-compatible nm
  166. configure:3771: result: /home/seiza/buildroot/toolchain_build_mipsel/gcc-4.2.1-final/./gcc/nm
  167. configure:3774: checking whether ln -s works
  168. configure:3778: result: yes
  169. configure:3785: checking how to recognise dependant libraries
  170. configure:3948: result: pass_all
  171. configure:3960: checking the maximum length of command line arguments
  172. configure:4015: result: none
  173. configure:4162: checking for mipsel-linux-uclibc-ranlib
  174. configure:4188: result: /home/seiza/buildroot/build_mipsel/staging_dir/usr/mipsel-linux-uclibc/bin/ranlib
  175. configure:4242: checking for mipsel-linux-uclibc-strip
  176. configure:4268: result: /home/seiza/buildroot/build_mipsel/staging_dir/usr/mipsel-linux-uclibc/bin/strip
  177. configure:4610: loading cache ./config.cache
  178. chain_build_mipsel/gcc-4.2.1-final/./gcc/xgcc -B/home/seiza/buildroot/toolchain_build_mipsel/gcc-4.2.1-final/./gcc/ -B/usr/mipsel-linux-uclibc/bin/ -B/usr/mipsel-linux-uclibc/lib/ -isystem /usr/mipsel-linux-uclibc/include -isystem /usr/mipsel-linux-uclibc/sys-include -c -g -Os -fno-jump-tables conftest.c 1>&5
  179. ltcf-c.sh:need_lc: /home/seiza/buildroot/toolchain_build_mipsel/gcc-4.2.1-final/./gcc/xgcc -B/home/seiza/buildroot/toolchain_build_mipsel/gcc-4.2.1-final/./gcc/ -B/usr/mipsel-linux-uclibc/bin/ -B/usr/mipsel-linux-uclibc/lib/ -isystem /usr/mipsel-linux-uclibc/include -isystem /usr/mipsel-linux-uclibc/sys-include -shared conftest.o -v -Wl,-soname -Wl,conftest -o conftest
  180. /home/seiza/buildroot/toolchain_build_mipsel/gcc-4.2.1-final/./gcc/collect2 --sysroot=/home/seiza/buildroot/build_mipsel/staging_dir --eh-frame-hdr -EL -shared -o conftest /home/seiza/buildroot/build_mipsel/staging_dir/usr/lib/crti.o /home/seiza/buildroot/toolchain_build_mipsel/gcc-4.2.1-final/./gcc/crtbeginS.o -L/home/seiza/buildroot/toolchain_build_mipsel/gcc-4.2.1-final/./gcc -L/home/seiza/buildroot/build_mipsel/staging_dir/lib -L/home/seiza/buildroot/build_mipsel/staging_dir/usr/lib conftest.o -soname conftest -lgcc --as-needed -lgcc_s --no-as-needed -lc -lgcc --as-needed -lgcc_s --no-as-needed /home/seiza/buildroot/toolchain_build_mipsel/gcc-4.2.1-final/./gcc/crtendS.o /home/seiza/buildroot/build_mipsel/staging_dir/usr/lib/crtn.o
  181. ltconfig:678:checking for /home/seiza/buildroot/toolchain_build_mipsel/gcc-4.2.1-final/./gcc/xgcc option to produce PIC
  182. ltconfig:687:checking that /home/seiza/buildroot/toolchain_build_mipsel/gcc-4.2.1-final/./gcc/xgcc PIC flag -fPIC -DPIC works.
  183. ltconfig:697: /home/seiza/buildroot/toolchain_build_mipsel/gcc-4.2.1-final/./gcc/xgcc -B/home/seiza/buildroot/toolchain_build_mipsel/gcc-4.2.1-final/./gcc/ -B/usr/mipsel-linux-uclibc/bin/ -B/usr/mipsel-linux-uclibc/lib/ -isystem /usr/mipsel-linux-uclibc/include -isystem /usr/mipsel-linux-uclibc/sys-include -c -g -Os -fno-jump-tables -fPIC -DPIC -DPIC conftest.c 1>&5
  184. ltconfig:749: checking if /home/seiza/buildroot/toolchain_build_mipsel/gcc-4.2.1-final/./gcc/xgcc static flag -static works
  185. ltconfig:758: /home/seiza/buildroot/toolchain_build_mipsel/gcc-4.2.1-final/./gcc/xgcc -B/home/seiza/buildroot/toolchain_build_mipsel/gcc-4.2.1-final/./gcc/ -B/usr/mipsel-linux-uclibc/bin/ -B/usr/mipsel-linux-uclibc/lib/ -isystem /usr/mipsel-linux-uclibc/include -isystem /usr/mipsel-linux-uclibc/sys-include -o conftest -g -Os -fno-jump-tables -static conftest.c 1>&5
  186. ltconfig:780: finding the maximum length of command line arguments
  187. ltconfig:@lineno@: result: 49153
  188. ltconfig:833: checking if /home/seiza/buildroot/toolchain_build_mipsel/gcc-4.2.1-final/./gcc/xgcc supports -c -o file.o
  189. ltconfig:834: /home/seiza/buildroot/toolchain_build_mipsel/gcc-4.2.1-final/./gcc/xgcc -B/home/seiza/buildroot/toolchain_build_mipsel/gcc-4.2.1-final/./gcc/ -B/usr/mipsel-linux-uclibc/bin/ -B/usr/mipsel-linux-uclibc/lib/ -isystem /usr/mipsel-linux-uclibc/include -isystem /usr/mipsel-linux-uclibc/sys-include -c -g -Os -fno-jump-tables -o out/conftest2.o conftest.c 1>&5
  190. ltconfig:887: checking if /home/seiza/buildroot/toolchain_build_mipsel/gcc-4.2.1-final/./gcc/xgcc supports -fno-rtti -fno-exceptions
  191. ltconfig:888: /home/seiza/buildroot/toolchain_build_mipsel/gcc-4.2.1-final/./gcc/xgcc -B/home/seiza/buildroot/toolchain_build_mipsel/gcc-4.2.1-final/./gcc/ -B/usr/mipsel-linux-uclibc/bin/ -B/usr/mipsel-linux-uclibc/lib/ -isystem /usr/mipsel-linux-uclibc/include -isystem /usr/mipsel-linux-uclibc/sys-include -c -g -Os -fno-jump-tables -fno-rtti -fno-exceptions -c conftest.c conftest.c 1>&5
  192. ltconfig:1431: checking if global_symbol_pipe works
  193. ltconfig:1432: /home/seiza/buildroot/toolchain_build_mipsel/gcc-4.2.1-final/./gcc/xgcc -B/home/seiza/buildroot/toolchain_build_mipsel/gcc-4.2.1-final/./gcc/ -B/usr/mipsel-linux-uclibc/bin/ -B/usr/mipsel-linux-uclibc/lib/ -isystem /usr/mipsel-linux-uclibc/include -isystem /usr/mipsel-linux-uclibc/sys-include -c -g -Os -fno-jump-tables conftest.c 1>&5
  194. ltconfig:1435: eval "/home/seiza/buildroot/toolchain_build_mipsel/gcc-4.2.1-final/./gcc/nm conftest.o | sed -n -e 's/^.*[ ]\([ABCDGISTW][ABCDGISTW]*\)[ ][ ]*\(\)\([_A-Za-z][_A-Za-z0-9]*\)$/\1 \2\3 \3/p' > conftest.nm"
  195. ltconfig:1487: /home/seiza/buildroot/toolchain_build_mipsel/gcc-4.2.1-final/./gcc/xgcc -B/home/seiza/buildroot/toolchain_build_mipsel/gcc-4.2.1-final/./gcc/ -B/usr/mipsel-linux-uclibc/bin/ -B/usr/mipsel-linux-uclibc/lib/ -isystem /usr/mipsel-linux-uclibc/include -isystem /usr/mipsel-linux-uclibc/sys-include -o conftest -g -Os -fno-jump-tables -fno-builtin conftest.c conftstm.o 1>&5
  196. configure:4642: checking whether to enable maintainer-specific portions of Makefiles
  197. configure:4651: result: no
  198. configure:4680: checking for mipsel-linux-uclibc-gfortran
  199. configure:4706: result: mipsel-linux-uclibc-gfortran -B/usr/mipsel-linux-uclibc/bin/ -B/usr/mipsel-linux-uclibc/lib/ -isystem /usr/mipsel-linux-uclibc/include -isystem /usr/mipsel-linux-uclibc/sys-include
  200. configure:4763: checking for Fortran compiler version
  201. configure:4766: mipsel-linux-uclibc-gfortran -B/usr/mipsel-linux-uclibc/bin/ -B/usr/mipsel-linux-uclibc/lib/ -isystem /usr/mipsel-linux-uclibc/include -isystem /usr/mipsel-linux-uclibc/sys-include --version </dev/null >&5
  202. /home/seiza/buildroot/toolchain_build_mipsel/gcc-4.2.1/libgomp/configure: line 4767: mipsel-linux-uclibc-gfortran: command not found
  203. configure:4769: $? = 127
  204. configure:4771: mipsel-linux-uclibc-gfortran -B/usr/mipsel-linux-uclibc/bin/ -B/usr/mipsel-linux-uclibc/lib/ -isystem /usr/mipsel-linux-uclibc/include -isystem /usr/mipsel-linux-uclibc/sys-include -v </dev/null >&5
  205. /home/seiza/buildroot/toolchain_build_mipsel/gcc-4.2.1/libgomp/configure: line 4772: mipsel-linux-uclibc-gfortran: command not found
  206. configure:4774: $? = 127
  207. configure:4776: mipsel-linux-uclibc-gfortran -B/usr/mipsel-linux-uclibc/bin/ -B/usr/mipsel-linux-uclibc/lib/ -isystem /usr/mipsel-linux-uclibc/include -isystem /usr/mipsel-linux-uclibc/sys-include -V </dev/null >&5
  208. /home/seiza/buildroot/toolchain_build_mipsel/gcc-4.2.1/libgomp/configure: line 4777: mipsel-linux-uclibc-gfortran: command not found
  209. configure:4779: $? = 127
  210. configure:4787: checking whether we are using the GNU Fortran compiler
  211. configure:4801: mipsel-linux-uclibc-gfortran -B/usr/mipsel-linux-uclibc/bin/ -B/usr/mipsel-linux-uclibc/lib/ -isystem /usr/mipsel-linux-uclibc/include -isystem /usr/mipsel-linux-uclibc/sys-include -c conftest.F >&5
  212. /home/seiza/buildroot/toolchain_build_mipsel/gcc-4.2.1/libgomp/configure: line 4802: mipsel-linux-uclibc-gfortran: command not found
  213. configure:4807: $? = 127
  214. configure: failed program was:
  215. | program main
  216. | #ifndef __GNUC__
  217. | choke me
  218. | #endif
  219. |
  220. | end
  221. configure:4833: result: no
  222. configure:4839: checking whether mipsel-linux-uclibc-gfortran -B/usr/mipsel-linux-uclibc/bin/ -B/usr/mipsel-linux-uclibc/lib/ -isystem /usr/mipsel-linux-uclibc/include -isystem /usr/mipsel-linux-uclibc/sys-include accepts -g
  223. configure:4851: mipsel-linux-uclibc-gfortran -B/usr/mipsel-linux-uclibc/bin/ -B/usr/mipsel-linux-uclibc/lib/ -isystem /usr/mipsel-linux-uclibc/include -isystem /usr/mipsel-linux-uclibc/sys-include -c -g conftest.f >&5
  224. /home/seiza/buildroot/toolchain_build_mipsel/gcc-4.2.1/libgomp/configure: line 4852: mipsel-linux-uclibc-gfortran: command not found
  225. configure:4857: $? = 127
  226. configure: failed program was:
  227. | program main
  228. |
  229. | end
  230. configure:4882: result: no
  231. configure:4918: checking how to run the C preprocessor
  232. configure:4953: /home/seiza/buildroot/toolchain_build_mipsel/gcc-4.2.1-final/./gcc/xgcc -B/home/seiza/buildroot/toolchain_build_mipsel/gcc-4.2.1-final/./gcc/ -B/usr/mipsel-linux-uclibc/bin/ -B/usr/mipsel-linux-uclibc/lib/ -isystem /usr/mipsel-linux-uclibc/include -isystem /usr/mipsel-linux-uclibc/sys-include -E conftest.c
  233. configure:4959: $? = 0
  234. configure:4991: /home/seiza/buildroot/toolchain_build_mipsel/gcc-4.2.1-final/./gcc/xgcc -B/home/seiza/buildroot/toolchain_build_mipsel/gcc-4.2.1-final/./gcc/ -B/usr/mipsel-linux-uclibc/bin/ -B/usr/mipsel-linux-uclibc/lib/ -isystem /usr/mipsel-linux-uclibc/include -isystem /usr/mipsel-linux-uclibc/sys-include -E conftest.c
  235. conftest.c:11:28: error: ac_nonexistent.h: No such file or directory
  236. configure:4997: $? = 1
  237. configure: failed program was:
  238. | /* confdefs.h. */
  239. |
  240. | #define PACKAGE_NAME "GNU OpenMP Runtime Library"
  241. | #define PACKAGE_TARNAME "libgomp"
  242. | #define PACKAGE_VERSION "1.0"
  243. | #define PACKAGE_STRING "GNU OpenMP Runtime Library 1.0"
  244. | #define PACKAGE_BUGREPORT ""
  245. | #define PACKAGE "libgomp"
  246. | #define VERSION "1.0"
  247. | /* end confdefs.h. */
  248. | #include <ac_nonexistent.h>
  249. configure:5036: result: /home/seiza/buildroot/toolchain_build_mipsel/gcc-4.2.1-final/./gcc/xgcc -B/home/seiza/buildroot/toolchain_build_mipsel/gcc-4.2.1-final/./gcc/ -B/usr/mipsel-linux-uclibc/bin/ -B/usr/mipsel-linux-uclibc/lib/ -isystem /usr/mipsel-linux-uclibc/include -isystem /usr/mipsel-linux-uclibc/sys-include -E
  250. configure:5060: /home/seiza/buildroot/toolchain_build_mipsel/gcc-4.2.1-final/./gcc/xgcc -B/home/seiza/buildroot/toolchain_build_mipsel/gcc-4.2.1-final/./gcc/ -B/usr/mipsel-linux-uclibc/bin/ -B/usr/mipsel-linux-uclibc/lib/ -isystem /usr/mipsel-linux-uclibc/include -isystem /usr/mipsel-linux-uclibc/sys-include -E conftest.c
  251. configure:5066: $? = 0
  252. configure:5098: /home/seiza/buildroot/toolchain_build_mipsel/gcc-4.2.1-final/./gcc/xgcc -B/home/seiza/buildroot/toolchain_build_mipsel/gcc-4.2.1-final/./gcc/ -B/usr/mipsel-linux-uclibc/bin/ -B/usr/mipsel-linux-uclibc/lib/ -isystem /usr/mipsel-linux-uclibc/include -isystem /usr/mipsel-linux-uclibc/sys-include -E conftest.c
  253. conftest.c:11:28: error: ac_nonexistent.h: No such file or directory
  254. configure:5104: $? = 1
  255. configure: failed program was:
  256. | /* confdefs.h. */
  257. |
  258. | #define PACKAGE_NAME "GNU OpenMP Runtime Library"
  259. | #define PACKAGE_TARNAME "libgomp"
  260. | #define PACKAGE_VERSION "1.0"
  261. | #define PACKAGE_STRING "GNU OpenMP Runtime Library 1.0"
  262. | #define PACKAGE_BUGREPORT ""
  263. | #define PACKAGE "libgomp"
  264. | #define VERSION "1.0"
  265. | /* end confdefs.h. */
  266. | #include <ac_nonexistent.h>
  267. configure:5148: checking for egrep
  268. configure:5158: result: grep -E
  269. configure:5163: checking for ANSI C header files
  270. configure:5188: /home/seiza/buildroot/toolchain_build_mipsel/gcc-4.2.1-final/./gcc/xgcc -B/home/seiza/buildroot/toolchain_build_mipsel/gcc-4.2.1-final/./gcc/ -B/usr/mipsel-linux-uclibc/bin/ -B/usr/mipsel-linux-uclibc/lib/ -isystem /usr/mipsel-linux-uclibc/include -isystem /usr/mipsel-linux-uclibc/sys-include -c -g -Os -fno-jump-tables conftest.c >&5
  271. configure:5194: $? = 0
  272. configure:5198: test -z
  273. || test ! -s conftest.err
  274. configure:5201: $? = 0
  275. configure:5204: test -s conftest.o
  276. configure:5207: $? = 0
  277. configure:5319: result: yes
  278. configure:5329: checking whether time.h and sys/time.h may both be included
  279. configure:5354: /home/seiza/buildroot/toolchain_build_mipsel/gcc-4.2.1-final/./gcc/xgcc -B/home/seiza/buildroot/toolchain_build_mipsel/gcc-4.2.1-final/./gcc/ -B/usr/mipsel-linux-uclibc/bin/ -B/usr/mipsel-linux-uclibc/lib/ -isystem /usr/mipsel-linux-uclibc/include -isystem /usr/mipsel-linux-uclibc/sys-include -c -g -Os -fno-jump-tables conftest.c >&5
  280. configure:5360: $? = 0
  281. configure:5364: test -z
  282. || test ! -s conftest.err
  283. configure:5367: $? = 0
  284. configure:5370: test -s conftest.o
  285. configure:5373: $? = 0
  286. configure:5384: result: yes
  287. configure:5408: checking for sys/types.h
  288. configure:5424: /home/seiza/buildroot/toolchain_build_mipsel/gcc-4.2.1-final/./gcc/xgcc -B/home/seiza/buildroot/toolchain_build_mipsel/gcc-4.2.1-final/./gcc/ -B/usr/mipsel-linux-uclibc/bin/ -B/usr/mipsel-linux-uclibc/lib/ -isystem /usr/mipsel-linux-uclibc/include -isystem /usr/mipsel-linux-uclibc/sys-include -c -g -Os -fno-jump-tables conftest.c >&5
  289. configure:5430: $? = 0
  290. configure:5434: test -z
  291. || test ! -s conftest.err
  292. configure:5437: $? = 0
  293. configure:5440: test -s conftest.o
  294. configure:5443: $? = 0
  295. configure:5454: result: yes
  296. configure:5408: checking for sys/stat.h
  297. configure:5424: /home/seiza/buildroot/toolchain_build_mipsel/gcc-4.2.1-final/./gcc/xgcc -B/home/seiza/buildroot/toolchain_build_mipsel/gcc-4.2.1-final/./gcc/ -B/usr/mipsel-linux-uclibc/bin/ -B/usr/mipsel-linux-uclibc/lib/ -isystem /usr/mipsel-linux-uclibc/include -isystem /usr/mipsel-linux-uclibc/sys-include -c -g -Os -fno-jump-tables conftest.c >&5
  298. configure:5430: $? = 0
  299. configure:5434: test -z
  300. || test ! -s conftest.err
  301. configure:5437: $? = 0
  302. configure:5440: test -s conftest.o
  303. configure:5443: $? = 0
  304. configure:5454: result: yes
  305. configure:5408: checking for stdlib.h
  306. configure:5424: /home/seiza/buildroot/toolchain_build_mipsel/gcc-4.2.1-final/./gcc/xgcc -B/home/seiza/buildroot/toolchain_build_mipsel/gcc-4.2.1-final/./gcc/ -B/usr/mipsel-linux-uclibc/bin/ -B/usr/mipsel-linux-uclibc/lib/ -isystem /usr/mipsel-linux-uclibc/include -isystem /usr/mipsel-linux-uclibc/sys-include -c -g -Os -fno-jump-tables conftest.c >&5
  307. configure:5430: $? = 0
  308. configure:5434: test -z
  309. || test ! -s conftest.err
  310. configure:5437: $? = 0
  311. configure:5440: test -s conftest.o
  312. configure:5443: $? = 0
  313. configure:5454: result: yes
  314. configure:5408: checking for string.h
  315. configure:5424: /home/seiza/buildroot/toolchain_build_mipsel/gcc-4.2.1-final/./gcc/xgcc -B/home/seiza/buildroot/toolchain_build_mipsel/gcc-4.2.1-final/./gcc/ -B/usr/mipsel-linux-uclibc/bin/ -B/usr/mipsel-linux-uclibc/lib/ -isystem /usr/mipsel-linux-uclibc/include -isystem /usr/mipsel-linux-uclibc/sys-include -c -g -Os -fno-jump-tables conftest.c >&5
  316. configure:5430: $? = 0
  317. configure:5434: test -z
  318. || test ! -s conftest.err
  319. configure:5437: $? = 0
  320. configure:5440: test -s conftest.o
  321. configure:5443: $? = 0
  322. configure:5454: result: yes
  323. configure:5408: checking for memory.h
  324. configure:5424: /home/seiza/buildroot/toolchain_build_mipsel/gcc-4.2.1-final/./gcc/xgcc -B/home/seiza/buildroot/toolchain_build_mipsel/gcc-4.2.1-final/./gcc/ -B/usr/mipsel-linux-uclibc/bin/ -B/usr/mipsel-linux-uclibc/lib/ -isystem /usr/mipsel-linux-uclibc/include -isystem /usr/mipsel-linux-uclibc/sys-include -c -g -Os -fno-jump-tables conftest.c >&5
  325. configure:5430: $? = 0
  326. configure:5434: test -z
  327. || test ! -s conftest.err
  328. configure:5437: $? = 0
  329. configure:5440: test -s conftest.o
  330. configure:5443: $? = 0
  331. configure:5454: result: yes
  332. configure:5408: checking for strings.h
  333. configure:5424: /home/seiza/buildroot/toolchain_build_mipsel/gcc-4.2.1-final/./gcc/xgcc -B/home/seiza/buildroot/toolchain_build_mipsel/gcc-4.2.1-final/./gcc/ -B/usr/mipsel-linux-uclibc/bin/ -B/usr/mipsel-linux-uclibc/lib/ -isystem /usr/mipsel-linux-uclibc/include -isystem /usr/mipsel-linux-uclibc/sys-include -c -g -Os -fno-jump-tables conftest.c >&5
  334. configure:5430: $? = 0
  335. configure:5434: test -z
  336. || test ! -s conftest.err
  337. configure:5437: $? = 0
  338. configure:5440: test -s conftest.o
  339. configure:5443: $? = 0
  340. configure:5454: result: yes
  341. configure:5408: checking for inttypes.h
  342. configure:5424: /home/seiza/buildroot/toolchain_build_mipsel/gcc-4.2.1-final/./gcc/xgcc -B/home/seiza/buildroot/toolchain_build_mipsel/gcc-4.2.1-final/./gcc/ -B/usr/mipsel-linux-uclibc/bin/ -B/usr/mipsel-linux-uclibc/lib/ -isystem /usr/mipsel-linux-uclibc/include -isystem /usr/mipsel-linux-uclibc/sys-include -c -g -Os -fno-jump-tables conftest.c >&5
  343. configure:5430: $? = 0
  344. configure:5434: test -z
  345. || test ! -s conftest.err
  346. configure:5437: $? = 0
  347. configure:5440: test -s conftest.o
  348. configure:5443: $? = 0
  349. configure:5454: result: yes
  350. configure:5408: checking for stdint.h
  351. configure:5424: /home/seiza/buildroot/toolchain_build_mipsel/gcc-4.2.1-final/./gcc/xgcc -B/home/seiza/buildroot/toolchain_build_mipsel/gcc-4.2.1-final/./gcc/ -B/usr/mipsel-linux-uclibc/bin/ -B/usr/mipsel-linux-uclibc/lib/ -isystem /usr/mipsel-linux-uclibc/include -isystem /usr/mipsel-linux-uclibc/sys-include -c -g -Os -fno-jump-tables conftest.c >&5
  352. configure:5430: $? = 0
  353. configure:5434: test -z
  354. || test ! -s conftest.err
  355. configure:5437: $? = 0
  356. configure:5440: test -s conftest.o
  357. configure:5443: $? = 0
  358. configure:5454: result: yes
  359. configure:5408: checking for unistd.h
  360. configure:5424: /home/seiza/buildroot/toolchain_build_mipsel/gcc-4.2.1-final/./gcc/xgcc -B/home/seiza/buildroot/toolchain_build_mipsel/gcc-4.2.1-final/./gcc/ -B/usr/mipsel-linux-uclibc/bin/ -B/usr/mipsel-linux-uclibc/lib/ -isystem /usr/mipsel-linux-uclibc/include -isystem /usr/mipsel-linux-uclibc/sys-include -c -g -Os -fno-jump-tables conftest.c >&5
  361. configure:5430: $? = 0
  362. configure:5434: test -z
  363. || test ! -s conftest.err
  364. configure:5437: $? = 0
  365. configure:5440: test -s conftest.o
  366. configure:5443: $? = 0
  367. configure:5454: result: yes
  368. configure:5474: checking for unistd.h
  369. configure:5479: result: yes
  370. configure:5483: checking semaphore.h usability
  371. configure:5495: /home/seiza/buildroot/toolchain_build_mipsel/gcc-4.2.1-final/./gcc/xgcc -B/home/seiza/buildroot/toolchain_build_mipsel/gcc-4.2.1-final/./gcc/ -B/usr/mipsel-linux-uclibc/bin/ -B/usr/mipsel-linux-uclibc/lib/ -isystem /usr/mipsel-linux-uclibc/include -isystem /usr/mipsel-linux-uclibc/sys-include -c -g -Os -fno-jump-tables conftest.c >&5
  372. configure:5501: $? = 0
  373. configure:5505: test -z
  374. || test ! -s conftest.err
  375. configure:5508: $? = 0
  376. configure:5511: test -s conftest.o
  377. configure:5514: $? = 0
  378. configure:5524: result: yes
  379. configure:5528: checking semaphore.h presence
  380. configure:5538: /home/seiza/buildroot/toolchain_build_mipsel/gcc-4.2.1-final/./gcc/xgcc -B/home/seiza/buildroot/toolchain_build_mipsel/gcc-4.2.1-final/./gcc/ -B/usr/mipsel-linux-uclibc/bin/ -B/usr/mipsel-linux-uclibc/lib/ -isystem /usr/mipsel-linux-uclibc/include -isystem /usr/mipsel-linux-uclibc/sys-include -E conftest.c
  381. configure:5544: $? = 0
  382. configure:5564: result: yes
  383. configure:5599: checking for semaphore.h
  384. configure:5606: result: yes
  385. configure:5483: checking sys/loadavg.h usability
  386. configure:5495: /home/seiza/buildroot/toolchain_build_mipsel/gcc-4.2.1-final/./gcc/xgcc -B/home/seiza/buildroot/toolchain_build_mipsel/gcc-4.2.1-final/./gcc/ -B/usr/mipsel-linux-uclibc/bin/ -B/usr/mipsel-linux-uclibc/lib/ -isystem /usr/mipsel-linux-uclibc/include -isystem /usr/mipsel-linux-uclibc/sys-include -c -g -Os -fno-jump-tables conftest.c >&5
  387. conftest.c:58:25: error: sys/loadavg.h: No such file or directory
  388. configure:5501: $? = 1
  389. configure: failed program was:
  390. | /* confdefs.h. */
  391. |
  392. | #define PACKAGE_NAME "GNU OpenMP Runtime Library"
  393. | #define PACKAGE_TARNAME "libgomp"
  394. | #define PACKAGE_VERSION "1.0"
  395. | #define PACKAGE_STRING "GNU OpenMP Runtime Library 1.0"
  396. | #define PACKAGE_BUGREPORT ""
  397. | #define PACKAGE "libgomp"
  398. | #define VERSION "1.0"
  399. | #define STDC_HEADERS 1
  400. | #define TIME_WITH_SYS_TIME 1
  401. | #define HAVE_SYS_TYPES_H 1
  402. | #define HAVE_SYS_STAT_H 1
  403. | #define HAVE_STDLIB_H 1
  404. | #define HAVE_STRING_H 1
  405. | #define HAVE_MEMORY_H 1
  406. | #define HAVE_STRINGS_H 1
  407. | #define HAVE_INTTYPES_H 1
  408. | #define HAVE_STDINT_H 1
  409. | #define HAVE_UNISTD_H 1
  410. | #define HAVE_UNISTD_H 1
  411. | #define HAVE_SEMAPHORE_H 1
  412. | /* end confdefs.h. */
  413. | #include <stdio.h>
  414. | #if HAVE_SYS_TYPES_H
  415. | # include <sys/types.h>
  416. | #endif
  417. | #if HAVE_SYS_STAT_H
  418. | # include <sys/stat.h>
  419. | #endif
  420. | #if STDC_HEADERS
  421. | # include <stdlib.h>
  422. | # include <stddef.h>
  423. | #else
  424. | # if HAVE_STDLIB_H
  425. | # include <stdlib.h>
  426. | # endif
  427. | #endif
  428. | #if HAVE_STRING_H
  429. | # if !STDC_HEADERS && HAVE_MEMORY_H
  430. | # include <memory.h>
  431. | # endif
  432. | # include <string.h>
  433. | #endif
  434. | #if HAVE_STRINGS_H
  435. | # include <strings.h>
  436. | #endif
  437. | #if HAVE_INTTYPES_H
  438. | # include <inttypes.h>
  439. | #else
  440. | # if HAVE_STDINT_H
  441. | # include <stdint.h>
  442. | # endif
  443. | #endif
  444. | #if HAVE_UNISTD_H
  445. | # include <unistd.h>
  446. | #endif
  447. | #include <sys/loadavg.h>
  448. configure:5524: result: no
  449. configure:5528: checking sys/loadavg.h presence
  450. configure:5538: /home/seiza/buildroot/toolchain_build_mipsel/gcc-4.2.1-final/./gcc/xgcc -B/home/seiza/buildroot/toolchain_build_mipsel/gcc-4.2.1-final/./gcc/ -B/usr/mipsel-linux-uclibc/bin/ -B/usr/mipsel-linux-uclibc/lib/ -isystem /usr/mipsel-linux-uclibc/include -isystem /usr/mipsel-linux-uclibc/sys-include -E conftest.c
  451. conftest.c:24:25: error: sys/loadavg.h: No such file or directory
  452. configure:5544: $? = 1
  453. configure: failed program was:
  454. | /* confdefs.h. */
  455. |
  456. | #define PACKAGE_NAME "GNU OpenMP Runtime Library"
  457. | #define PACKAGE_TARNAME "libgomp"
  458. | #define PACKAGE_VERSION "1.0"
  459. | #define PACKAGE_STRING "GNU OpenMP Runtime Library 1.0"
  460. | #define PACKAGE_BUGREPORT ""
  461. | #define PACKAGE "libgomp"
  462. | #define VERSION "1.0"
  463. | #define STDC_HEADERS 1
  464. | #define TIME_WITH_SYS_TIME 1
  465. | #define HAVE_SYS_TYPES_H 1
  466. | #define HAVE_SYS_STAT_H 1
  467. | #define HAVE_STDLIB_H 1
  468. | #define HAVE_STRING_H 1
  469. | #define HAVE_MEMORY_H 1
  470. | #define HAVE_STRINGS_H 1
  471. | #define HAVE_INTTYPES_H 1
  472. | #define HAVE_STDINT_H 1
  473. | #define HAVE_UNISTD_H 1
  474. | #define HAVE_UNISTD_H 1
  475. | #define HAVE_SEMAPHORE_H 1
  476. | /* end confdefs.h. */
  477. | #include <sys/loadavg.h>
  478. configure:5564: result: no
  479. configure:5599: checking for sys/loadavg.h
  480. configure:5606: result: no
  481. configure:5483: checking sys/time.h usability
  482. configure:5495: /home/seiza/buildroot/toolchain_build_mipsel/gcc-4.2.1-final/./gcc/xgcc -B/home/seiza/buildroot/toolchain_build_mipsel/gcc-4.2.1-final/./gcc/ -B/usr/mipsel-linux-uclibc/bin/ -B/usr/mipsel-linux-uclibc/lib/ -isystem /usr/mipsel-linux-uclibc/include -isystem /usr/mipsel-linux-uclibc/sys-include -c -g -Os -fno-jump-tables conftest.c >&5
  483. configure:5501: $? = 0
  484. configure:5505: test -z
  485. || test ! -s conftest.err
  486. configure:5508: $? = 0
  487. configure:5511: test -s conftest.o
  488. configure:5514: $? = 0
  489. configure:5524: result: yes
  490. configure:5528: checking sys/time.h presence
  491. configure:5538: /home/seiza/buildroot/toolchain_build_mipsel/gcc-4.2.1-final/./gcc/xgcc -B/home/seiza/buildroot/toolchain_build_mipsel/gcc-4.2.1-final/./gcc/ -B/usr/mipsel-linux-uclibc/bin/ -B/usr/mipsel-linux-uclibc/lib/ -isystem /usr/mipsel-linux-uclibc/include -isystem /usr/mipsel-linux-uclibc/sys-include -E conftest.c
  492. configure:5544: $? = 0
  493. configure:5564: result: yes
  494. configure:5599: checking for sys/time.h
  495. configure:5606: result: yes
  496. configure:5633: checking for uintmax_t
  497. configure:5659: /home/seiza/buildroot/toolchain_build_mipsel/gcc-4.2.1-final/./gcc/xgcc -B/home/seiza/buildroot/toolchain_build_mipsel/gcc-4.2.1-final/./gcc/ -B/usr/mipsel-linux-uclibc/bin/ -B/usr/mipsel-linux-uclibc/lib/ -isystem /usr/mipsel-linux-uclibc/include -isystem /usr/mipsel-linux-uclibc/sys-include -c -g -Os -fno-jump-tables conftest.c >&5
  498. configure:5665: $? = 0
  499. configure:5669: test -z
  500. || test ! -s conftest.err
  501. configure:5672: $? = 0
  502. configure:5675: test -s conftest.o
  503. configure:5678: $? = 0
  504. configure:5689: result: yes
  505. configure:5697: checking for uintptr_t
  506. configure:5723: /home/seiza/buildroot/toolchain_build_mipsel/gcc-4.2.1-final/./gcc/xgcc -B/home/seiza/buildroot/toolchain_build_mipsel/gcc-4.2.1-final/./gcc/ -B/usr/mipsel-linux-uclibc/bin/ -B/usr/mipsel-linux-uclibc/lib/ -isystem /usr/mipsel-linux-uclibc/include -isystem /usr/mipsel-linux-uclibc/sys-include -c -g -Os -fno-jump-tables conftest.c >&5
  507. configure:5729: $? = 0
  508. configure:5733: test -z
  509. || test ! -s conftest.err
  510. configure:5736: $? = 0
  511. configure:5739: test -s conftest.o
  512. configure:5742: $? = 0
  513. configure:5753: result: yes
  514. configure:5761: checking for int_least32_t
  515. configure:5787: /home/seiza/buildroot/toolchain_build_mipsel/gcc-4.2.1-final/./gcc/xgcc -B/home/seiza/buildroot/toolchain_build_mipsel/gcc-4.2.1-final/./gcc/ -B/usr/mipsel-linux-uclibc/bin/ -B/usr/mipsel-linux-uclibc/lib/ -isystem /usr/mipsel-linux-uclibc/include -isystem /usr/mipsel-linux-uclibc/sys-include -c -g -Os -fno-jump-tables conftest.c >&5
  516. configure:5793: $? = 0
  517. configure:5797: test -z
  518. || test ! -s conftest.err
  519. configure:5800: $? = 0
  520. configure:5803: test -s conftest.o
  521. configure:5806: $? = 0
  522. configure:5817: result: yes
  523. configure:5825: checking for int_fast32_t
  524. configure:5851: /home/seiza/buildroot/toolchain_build_mipsel/gcc-4.2.1-final/./gcc/xgcc -B/home/seiza/buildroot/toolchain_build_mipsel/gcc-4.2.1-final/./gcc/ -B/usr/mipsel-linux-uclibc/bin/ -B/usr/mipsel-linux-uclibc/lib/ -isystem /usr/mipsel-linux-uclibc/include -isystem /usr/mipsel-linux-uclibc/sys-include -c -g -Os -fno-jump-tables conftest.c >&5
  525. configure:5857: $? = 0
  526. configure:5861: test -z
  527. || test ! -s conftest.err
  528. configure:5864: $? = 0
  529. configure:5867: test -s conftest.o
  530. configure:5870: $? = 0
  531. configure:5881: result: yes
  532. configure:5889: checking for uint64_t
  533. configure:5915: /home/seiza/buildroot/toolchain_build_mipsel/gcc-4.2.1-final/./gcc/xgcc -B/home/seiza/buildroot/toolchain_build_mipsel/gcc-4.2.1-final/./gcc/ -B/usr/mipsel-linux-uclibc/bin/ -B/usr/mipsel-linux-uclibc/lib/ -isystem /usr/mipsel-linux-uclibc/include -isystem /usr/mipsel-linux-uclibc/sys-include -c -g -Os -fno-jump-tables conftest.c >&5
  534. configure:5921: $? = 0
  535. configure:5925: test -z
  536. || test ! -s conftest.err
  537. configure:5928: $? = 0
  538. configure:5931: test -s conftest.o
  539. configure:5934: $? = 0
  540. configure:5945: result: yes
  541. configure:6291: checking what to include in gstdint.h
  542. configure:6311: result: stdint.h (already complete)
  543. configure:8489: /home/seiza/buildroot/toolchain_build_mipsel/gcc-4.2.1-final/./gcc/xgcc -B/home/seiza/buildroot/toolchain_build_mipsel/gcc-4.2.1-final/./gcc/ -B/usr/mipsel-linux-uclibc/bin/ -B/usr/mipsel-linux-uclibc/lib/ -isystem /usr/mipsel-linux-uclibc/include -isystem /usr/mipsel-linux-uclibc/sys-include -o conftest -g -Os -fno-jump-tables -pthread conftest.c >&5
  544. /home/seiza/buildroot/build_mipsel/staging_dir/usr/mipsel-linux-uclibc/bin/ld: cannot find -lpthread
  545. collect2: ld returned 1 exit status
  546. configure:8495: $? = 1
  547. configure: failed program was:
  548. | /* confdefs.h. */
  549. |
  550. | #define PACKAGE_NAME "GNU OpenMP Runtime Library"
  551. | #define PACKAGE_TARNAME "libgomp"
  552. | #define PACKAGE_VERSION "1.0"
  553. | #define PACKAGE_STRING "GNU OpenMP Runtime Library 1.0"
  554. | #define PACKAGE_BUGREPORT ""
  555. | #define PACKAGE "libgomp"
  556. | #define VERSION "1.0"
  557. | #define STDC_HEADERS 1
  558. | #define TIME_WITH_SYS_TIME 1
  559. | #define HAVE_SYS_TYPES_H 1
  560. | #define HAVE_SYS_STAT_H 1
  561. | #define HAVE_STDLIB_H 1
  562. | #define HAVE_STRING_H 1
  563. | #define HAVE_MEMORY_H 1
  564. | #define HAVE_STRINGS_H 1
  565. | #define HAVE_INTTYPES_H 1
  566. | #define HAVE_STDINT_H 1
  567. | #define HAVE_UNISTD_H 1
  568. | #define HAVE_UNISTD_H 1
  569. | #define HAVE_SEMAPHORE_H 1
  570. | #define HAVE_SYS_TIME_H 1
  571. | /* end confdefs.h. */
  572. | #include <pthread.h>
  573. | void *g(void *d) { return NULL; }
  574. | int
  575. | main ()
  576. | {
  577. | pthread_t t; pthread_create(&t,NULL,g,NULL);
  578. | ;
  579. | return 0;
  580. | }
  581. configure:8533: /home/seiza/buildroot/toolchain_build_mipsel/gcc-4.2.1-final/./gcc/xgcc -B/home/seiza/buildroot/toolchain_build_mipsel/gcc-4.2.1-final/./gcc/ -B/usr/mipsel-linux-uclibc/bin/ -B/usr/mipsel-linux-uclibc/lib/ -isystem /usr/mipsel-linux-uclibc/include -isystem /usr/mipsel-linux-uclibc/sys-include -o conftest -g -Os -fno-jump-tables conftest.c -lpthread >&5
  582. /home/seiza/buildroot/build_mipsel/staging_dir/usr/mipsel-linux-uclibc/bin/ld: cannot find -lpthread
  583. collect2: ld returned 1 exit status
  584. configure:8539: $? = 1
  585. configure: failed program was:
  586. | /* confdefs.h. */
  587. |
  588. | #define PACKAGE_NAME "GNU OpenMP Runtime Library"
  589. | #define PACKAGE_TARNAME "libgomp"
  590. | #define PACKAGE_VERSION "1.0"
  591. | #define PACKAGE_STRING "GNU OpenMP Runtime Library 1.0"
  592. | #define PACKAGE_BUGREPORT ""
  593. | #define PACKAGE "libgomp"
  594. | #define VERSION "1.0"
  595. | #define STDC_HEADERS 1
  596. | #define TIME_WITH_SYS_TIME 1
  597. | #define HAVE_SYS_TYPES_H 1
  598. | #define HAVE_SYS_STAT_H 1
  599. | #define HAVE_STDLIB_H 1
  600. | #define HAVE_STRING_H 1
  601. | #define HAVE_MEMORY_H 1
  602. | #define HAVE_STRINGS_H 1
  603. | #define HAVE_INTTYPES_H 1
  604. | #define HAVE_STDINT_H 1
  605. | #define HAVE_UNISTD_H 1
  606. | #define HAVE_UNISTD_H 1
  607. | #define HAVE_SEMAPHORE_H 1
  608. | #define HAVE_SYS_TIME_H 1
  609. | /* end confdefs.h. */
  610. | #include <pthread.h>
  611. | void *g(void *d) { return NULL; }
  612. | int
  613. | main ()
  614. | {
  615. | pthread_t t; pthread_create(&t,NULL,g,NULL);
  616. | ;
  617. | return 0;
  618. | }
  619. configure:8559: error: Pthreads are required to build libgomp
  620. configure:8575: checking for getloadavg
  621. configure:8632: /home/seiza/buildroot/toolchain_build_mipsel/gcc-4.2.1-final/./gcc/xgcc -B/home/seiza/buildroot/toolchain_build_mipsel/gcc-4.2.1-final/./gcc/ -B/usr/mipsel-linux-uclibc/bin/ -B/usr/mipsel-linux-uclibc/lib/ -isystem /usr/mipsel-linux-uclibc/include -isystem /usr/mipsel-linux-uclibc/sys-include -o conftest -g -Os -fno-jump-tables conftest.c -lpthread >&5
  622. /home/seiza/buildroot/build_mipsel/staging_dir/usr/mipsel-linux-uclibc/bin/ld: cannot find -lpthread
  623. collect2: ld returned 1 exit status
  624. configure:8638: $? = 1
  625. configure: failed program was:
  626. | /* confdefs.h. */
  627. |
  628. | #define PACKAGE_NAME "GNU OpenMP Runtime Library"
  629. | #define PACKAGE_TARNAME "libgomp"
  630. | #define PACKAGE_VERSION "1.0"
  631. | #define PACKAGE_STRING "GNU OpenMP Runtime Library 1.0"
  632. | #define PACKAGE_BUGREPORT ""
  633. | #define PACKAGE "libgomp"
  634. | #define VERSION "1.0"
  635. | #define STDC_HEADERS 1
  636. | #define TIME_WITH_SYS_TIME 1
  637. | #define HAVE_SYS_TYPES_H 1
  638. | #define HAVE_SYS_STAT_H 1
  639. | #define HAVE_STDLIB_H 1
  640. | #define HAVE_STRING_H 1
  641. | #define HAVE_MEMORY_H 1
  642. | #define HAVE_STRINGS_H 1
  643. | #define HAVE_INTTYPES_H 1
  644. | #define HAVE_STDINT_H 1
  645. | #define HAVE_UNISTD_H 1
  646. | #define HAVE_UNISTD_H 1
  647. | #define HAVE_SEMAPHORE_H 1
  648. | #define HAVE_SYS_TIME_H 1
  649. | /* end confdefs.h. */
  650. | /* Define getloadavg to an innocuous variant, in case <limits.h> declares getloadavg.
  651. | For example, HP-UX 11i <limits.h> declares gettimeofday. */
  652. | #define getloadavg innocuous_getloadavg
  653. |
  654. | /* System header to define __stub macros and hopefully few prototypes,
  655. | which can conflict with char getloadavg (); below.
  656. | Prefer <limits.h> to <assert.h> if __STDC__ is defined, since
  657. | <limits.h> exists even on freestanding compilers. */
  658. |
  659. | #ifdef __STDC__
  660. | # include <limits.h>
  661. | #else
  662. | # include <assert.h>
  663. | #endif
  664. |
  665. | #undef getloadavg
  666. |
  667. | /* Override any gcc2 internal prototype to avoid an error. */
  668. | #ifdef __cplusplus
  669. | extern "C"
  670. | {
  671. | #endif
  672. | /* We use char because int might match the return type of a gcc2
  673. | builtin and then its argument prototype would still apply. */
  674. | char getloadavg ();
  675. | /* The GNU C library defines this for functions which it implements
  676. | to always fail with ENOSYS. Some functions are actually named
  677. | something starting with __ and the normal name is an alias. */
  678. | #if defined (__stub_getloadavg) || defined (__stub___getloadavg)
  679. | choke me
  680. | #else
  681. | char (*f) () = getloadavg;
  682. | #endif
  683. | #ifdef __cplusplus
  684. | }
  685. | #endif
  686. |
  687. | int
  688. | main ()
  689. | {
  690. | return f != getloadavg;
  691. | ;
  692. | return 0;
  693. | }
  694. configure:8663: result: no
  695. configure:8575: checking for clock_gettime
  696. configure:8632: /home/seiza/buildroot/toolchain_build_mipsel/gcc-4.2.1-final/./gcc/xgcc -B/home/seiza/buildroot/toolchain_build_mipsel/gcc-4.2.1-final/./gcc/ -B/usr/mipsel-linux-uclibc/bin/ -B/usr/mipsel-linux-uclibc/lib/ -isystem /usr/mipsel-linux-uclibc/include -isystem /usr/mipsel-linux-uclibc/sys-include -o conftest -g -Os -fno-jump-tables conftest.c -lpthread >&5
  697. /home/seiza/buildroot/build_mipsel/staging_dir/usr/mipsel-linux-uclibc/bin/ld: cannot find -lpthread
  698. collect2: ld returned 1 exit status
  699. configure:8638: $? = 1
  700. configure: failed program was:
  701. | /* confdefs.h. */
  702. |
  703. | #define PACKAGE_NAME "GNU OpenMP Runtime Library"
  704. | #define PACKAGE_TARNAME "libgomp"
  705. | #define PACKAGE_VERSION "1.0"
  706. | #define PACKAGE_STRING "GNU OpenMP Runtime Library 1.0"
  707. | #define PACKAGE_BUGREPORT ""
  708. | #define PACKAGE "libgomp"
  709. | #define VERSION "1.0"
  710. | #define STDC_HEADERS 1
  711. | #define TIME_WITH_SYS_TIME 1
  712. | #define HAVE_SYS_TYPES_H 1
  713. | #define HAVE_SYS_STAT_H 1
  714. | #define HAVE_STDLIB_H 1
  715. | #define HAVE_STRING_H 1
  716. | #define HAVE_MEMORY_H 1
  717. | #define HAVE_STRINGS_H 1
  718. | #define HAVE_INTTYPES_H 1
  719. | #define HAVE_STDINT_H 1
  720. | #define HAVE_UNISTD_H 1
  721. | #define HAVE_UNISTD_H 1
  722. | #define HAVE_SEMAPHORE_H 1
  723. | #define HAVE_SYS_TIME_H 1
  724. | /* end confdefs.h. */
  725. | /* Define clock_gettime to an innocuous variant, in case <limits.h> declares clock_gettime.
  726. | For example, HP-UX 11i <limits.h> declares gettimeofday. */
  727. | #define clock_gettime innocuous_clock_gettime
  728. |
  729. | /* System header to define __stub macros and hopefully few prototypes,
  730. | which can conflict with char clock_gettime (); below.
  731. | Prefer <limits.h> to <assert.h> if __STDC__ is defined, since
  732. | <limits.h> exists even on freestanding compilers. */
  733. |
  734. | #ifdef __STDC__
  735. | # include <limits.h>
  736. | #else
  737. | # include <assert.h>
  738. | #endif
  739. |
  740. | #undef clock_gettime
  741. |
  742. | /* Override any gcc2 internal prototype to avoid an error. */
  743. | #ifdef __cplusplus
  744. | extern "C"
  745. | {
  746. | #endif
  747. | /* We use char because int might match the return type of a gcc2
  748. | builtin and then its argument prototype would still apply. */
  749. | char clock_gettime ();
  750. | /* The GNU C library defines this for functions which it implements
  751. | to always fail with ENOSYS. Some functions are actually named
  752. | something starting with __ and the normal name is an alias. */
  753. | #if defined (__stub_clock_gettime) || defined (__stub___clock_gettime)
  754. | choke me
  755. | #else
  756. | char (*f) () = clock_gettime;
  757. | #endif
  758. | #ifdef __cplusplus
  759. | }
  760. | #endif
  761. |
  762. | int
  763. | main ()
  764. | {
  765. | return f != clock_gettime;
  766. | ;
  767. | return 0;
  768. | }
  769. configure:8663: result: no
  770. configure:8711: /home/seiza/buildroot/toolchain_build_mipsel/gcc-4.2.1-final/./gcc/xgcc -B/home/seiza/buildroot/toolchain_build_mipsel/gcc-4.2.1-final/./gcc/ -B/usr/mipsel-linux-uclibc/bin/ -B/usr/mipsel-linux-uclibc/lib/ -isystem /usr/mipsel-linux-uclibc/include -isystem /usr/mipsel-linux-uclibc/sys-include -o conftest -g -Os -fno-jump-tables conftest.c -lpthread >&5
  771. /home/seiza/buildroot/build_mipsel/staging_dir/usr/mipsel-linux-uclibc/bin/ld: cannot find -lpthread
  772. collect2: ld returned 1 exit status
  773. configure:8717: $? = 1
  774. configure: failed program was:
  775. | /* confdefs.h. */
  776. |
  777. | #define PACKAGE_NAME "GNU OpenMP Runtime Library"
  778. | #define PACKAGE_TARNAME "libgomp"
  779. | #define PACKAGE_VERSION "1.0"
  780. | #define PACKAGE_STRING "GNU OpenMP Runtime Library 1.0"
  781. | #define PACKAGE_BUGREPORT ""
  782. | #define PACKAGE "libgomp"
  783. | #define VERSION "1.0"
  784. | #define STDC_HEADERS 1
  785. | #define TIME_WITH_SYS_TIME 1
  786. | #define HAVE_SYS_TYPES_H 1
  787. | #define HAVE_SYS_STAT_H 1
  788. | #define HAVE_STDLIB_H 1
  789. | #define HAVE_STRING_H 1
  790. | #define HAVE_MEMORY_H 1
  791. | #define HAVE_STRINGS_H 1
  792. | #define HAVE_INTTYPES_H 1
  793. | #define HAVE_STDINT_H 1
  794. | #define HAVE_UNISTD_H 1
  795. | #define HAVE_UNISTD_H 1
  796. | #define HAVE_SEMAPHORE_H 1
  797. | #define HAVE_SYS_TIME_H 1
  798. | /* end confdefs.h. */
  799. | #include <sys/syscall.h>
  800. | int lk;
  801. | int
  802. | main ()
  803. | {
  804. | syscall (SYS_gettid); syscall (SYS_futex, &lk, 0, 0, 0);
  805. | ;
  806. | return 0;
  807. | }
  808. configure:8857: checking for clock_gettime in -lrt
  809. configure:8887: /home/seiza/buildroot/toolchain_build_mipsel/gcc-4.2.1-final/./gcc/xgcc -B/home/seiza/buildroot/toolchain_build_mipsel/gcc-4.2.1-final/./gcc/ -B/usr/mipsel-linux-uclibc/bin/ -B/usr/mipsel-linux-uclibc/lib/ -isystem /usr/mipsel-linux-uclibc/include -isystem /usr/mipsel-linux-uclibc/sys-include -o conftest -g -Os -fno-jump-tables conftest.c -lrt -lpthread >&5
  810. /home/seiza/buildroot/build_mipsel/staging_dir/usr/mipsel-linux-uclibc/bin/ld: cannot find -lrt
  811. collect2: ld returned 1 exit status
  812. configure:8893: $? = 1
  813. configure: failed program was:
  814. | /* confdefs.h. */
  815. |
  816. | #define PACKAGE_NAME "GNU OpenMP Runtime Library"
  817. | #define PACKAGE_TARNAME "libgomp"
  818. | #define PACKAGE_VERSION "1.0"
  819. | #define PACKAGE_STRING "GNU OpenMP Runtime Library 1.0"
  820. | #define PACKAGE_BUGREPORT ""
  821. | #define PACKAGE "libgomp"
  822. | #define VERSION "1.0"
  823. | #define STDC_HEADERS 1
  824. | #define TIME_WITH_SYS_TIME 1
  825. | #define HAVE_SYS_TYPES_H 1
  826. | #define HAVE_SYS_STAT_H 1
  827. | #define HAVE_STDLIB_H 1
  828. | #define HAVE_STRING_H 1
  829. | #define HAVE_MEMORY_H 1
  830. | #define HAVE_STRINGS_H 1
  831. | #define HAVE_INTTYPES_H 1
  832. | #define HAVE_STDINT_H 1
  833. | #define HAVE_UNISTD_H 1
  834. | #define HAVE_UNISTD_H 1
  835. | #define HAVE_SEMAPHORE_H 1
  836. | #define HAVE_SYS_TIME_H 1
  837. | /* end confdefs.h. */
  838. |
  839. | /* Override any gcc2 internal prototype to avoid an error. */
  840. | #ifdef __cplusplus
  841. | extern "C"
  842. | #endif
  843. | /* We use char because int might match the return type of a gcc2
  844. | builtin and then its argument prototype would still apply. */
  845. | char clock_gettime ();
  846. | int
  847. | main ()
  848. | {
  849. | clock_gettime ();
  850. | ;
  851. | return 0;
  852. | }
  853. configure:8919: result: no
  854. configure:8949: checking whether the target supports thread-local storage
  855. configure:8960: /home/seiza/buildroot/toolchain_build_mipsel/gcc-4.2.1-final/./gcc/xgcc -B/home/seiza/buildroot/toolchain_build_mipsel/gcc-4.2.1-final/./gcc/ -B/usr/mipsel-linux-uclibc/bin/ -B/usr/mipsel-linux-uclibc/lib/ -isystem /usr/mipsel-linux-uclibc/include -isystem /usr/mipsel-linux-uclibc/sys-include -c -g -Os -fno-jump-tables conftest.c >&5
  856. configure:8966: $? = 0
  857. configure:8970: test -z
  858. || test ! -s conftest.err
  859. configure:8973: $? = 0
  860. configure:8976: test -s conftest.o
  861. configure:8979: $? = 0
  862. configure:9084: result: yes
  863. configure:9096: checking whether the target supports hidden visibility
  864. configure:9120: /home/seiza/buildroot/toolchain_build_mipsel/gcc-4.2.1-final/./gcc/xgcc -B/home/seiza/buildroot/toolchain_build_mipsel/gcc-4.2.1-final/./gcc/ -B/usr/mipsel-linux-uclibc/bin/ -B/usr/mipsel-linux-uclibc/lib/ -isystem /usr/mipsel-linux-uclibc/include -isystem /usr/mipsel-linux-uclibc/sys-include -c -g -Os -fno-jump-tables -Werror conftest.c >&5
  865. configure:9126: $? = 0
  866. configure:9130: test -z
  867. || test ! -s conftest.err
  868. configure:9133: $? = 0
  869. configure:9136: test -s conftest.o
  870. configure:9139: $? = 0
  871. configure:9151: result: yes
  872. configure:9161: checking whether the target supports dllexport
  873. configure:9185: /home/seiza/buildroot/toolchain_build_mipsel/gcc-4.2.1-final/./gcc/xgcc -B/home/seiza/buildroot/toolchain_build_mipsel/gcc-4.2.1-final/./gcc/ -B/usr/mipsel-linux-uclibc/bin/ -B/usr/mipsel-linux-uclibc/lib/ -isystem /usr/mipsel-linux-uclibc/include -isystem /usr/mipsel-linux-uclibc/sys-include -c -g -Os -fno-jump-tables -Werror conftest.c >&5
  874. cc1: warnings being treated as errors
  875. conftest.c:27: warning: 'dllexport' attribute directive ignored
  876. configure:9191: $? = 1
  877. configure: failed program was:
  878. | /* confdefs.h. */
  879. |
  880. | #define PACKAGE_NAME "GNU OpenMP Runtime Library"
  881. | #define PACKAGE_TARNAME "libgomp"
  882. | #define PACKAGE_VERSION "1.0"
  883. | #define PACKAGE_STRING "GNU OpenMP Runtime Library 1.0"
  884. | #define PACKAGE_BUGREPORT ""
  885. | #define PACKAGE "libgomp"
  886. | #define VERSION "1.0"
  887. | #define STDC_HEADERS 1
  888. | #define TIME_WITH_SYS_TIME 1
  889. | #define HAVE_SYS_TYPES_H 1
  890. | #define HAVE_SYS_STAT_H 1
  891. | #define HAVE_STDLIB_H 1
  892. | #define HAVE_STRING_H 1
  893. | #define HAVE_MEMORY_H 1
  894. | #define HAVE_STRINGS_H 1
  895. | #define HAVE_INTTYPES_H 1
  896. | #define HAVE_STDINT_H 1
  897. | #define HAVE_UNISTD_H 1
  898. | #define HAVE_UNISTD_H 1
  899. | #define HAVE_SEMAPHORE_H 1
  900. | #define HAVE_SYS_TIME_H 1
  901. | #define HAVE_TLS 1
  902. | #define HAVE_ATTRIBUTE_VISIBILITY 1
  903. | /* end confdefs.h. */
  904. | void __attribute__((dllexport)) foo(void) { }
  905. | int
  906. | main ()
  907. | {
  908. |
  909. | ;
  910. | return 0;
  911. | }
  912. configure:9216: result: no
  913. configure:9226: checking whether the target supports symbol aliases
  914. configure:9250: /home/seiza/buildroot/toolchain_build_mipsel/gcc-4.2.1-final/./gcc/xgcc -B/home/seiza/buildroot/toolchain_build_mipsel/gcc-4.2.1-final/./gcc/ -B/usr/mipsel-linux-uclibc/bin/ -B/usr/mipsel-linux-uclibc/lib/ -isystem /usr/mipsel-linux-uclibc/include -isystem /usr/mipsel-linux-uclibc/sys-include -o conftest -g -Os -fno-jump-tables conftest.c -lpthread >&5
  915. /home/seiza/buildroot/build_mipsel/staging_dir/usr/mipsel-linux-uclibc/bin/ld: cannot find -lpthread
  916. collect2: ld returned 1 exit status
  917. configure:9256: $? = 1
  918. configure: failed program was:
  919. | /* confdefs.h. */
  920. |
  921. | #define PACKAGE_NAME "GNU OpenMP Runtime Library"
  922. | #define PACKAGE_TARNAME "libgomp"
  923. | #define PACKAGE_VERSION "1.0"
  924. | #define PACKAGE_STRING "GNU OpenMP Runtime Library 1.0"
  925. | #define PACKAGE_BUGREPORT ""
  926. | #define PACKAGE "libgomp"
  927. | #define VERSION "1.0"
  928. | #define STDC_HEADERS 1
  929. | #define TIME_WITH_SYS_TIME 1
  930. | #define HAVE_SYS_TYPES_H 1
  931. | #define HAVE_SYS_STAT_H 1
  932. | #define HAVE_STDLIB_H 1
  933. | #define HAVE_STRING_H 1
  934. | #define HAVE_MEMORY_H 1
  935. | #define HAVE_STRINGS_H 1
  936. | #define HAVE_INTTYPES_H 1
  937. | #define HAVE_STDINT_H 1
  938. | #define HAVE_UNISTD_H 1
  939. | #define HAVE_UNISTD_H 1
  940. | #define HAVE_SEMAPHORE_H 1
  941. | #define HAVE_SYS_TIME_H 1
  942. | #define HAVE_TLS 1
  943. | #define HAVE_ATTRIBUTE_VISIBILITY 1
  944. | /* end confdefs.h. */
  945. |
  946. | void foo(void) { }
  947. | extern void bar(void) __attribute__((alias("foo")));
  948. | int
  949. | main ()
  950. | {
  951. | bar();
  952. | ;
  953. | return 0;
  954. | }
  955. configure:9281: result: no
  956. configure:9433: checking for shared libgcc
  957. configure:9453: /home/seiza/buildroot/toolchain_build_mipsel/gcc-4.2.1-final/./gcc/xgcc -B/home/seiza/buildroot/toolchain_build_mipsel/gcc-4.2.1-final/./gcc/ -B/usr/mipsel-linux-uclibc/bin/ -B/usr/mipsel-linux-uclibc/lib/ -isystem /usr/mipsel-linux-uclibc/include -isystem /usr/mipsel-linux-uclibc/sys-include -o conftest -lgcc_s conftest.c -lpthread >&5
  958. /home/seiza/buildroot/build_mipsel/staging_dir/usr/mipsel-linux-uclibc/bin/ld: cannot find -lpthread
  959. collect2: ld returned 1 exit status
  960. configure:9459: $? = 1
  961. configure: failed program was:
  962. | /* confdefs.h. */
  963. |
  964. | #define PACKAGE_NAME "GNU OpenMP Runtime Library"
  965. | #define PACKAGE_TARNAME "libgomp"
  966. | #define PACKAGE_VERSION "1.0"
  967. | #define PACKAGE_STRING "GNU OpenMP Runtime Library 1.0"
  968. | #define PACKAGE_BUGREPORT ""
  969. | #define PACKAGE "libgomp"
  970. | #define VERSION "1.0"
  971. | #define STDC_HEADERS 1
  972. | #define TIME_WITH_SYS_TIME 1
  973. | #define HAVE_SYS_TYPES_H 1
  974. | #define HAVE_SYS_STAT_H 1
  975. | #define HAVE_STDLIB_H 1
  976. | #define HAVE_STRING_H 1
  977. | #define HAVE_MEMORY_H 1
  978. | #define HAVE_STRINGS_H 1
  979. | #define HAVE_INTTYPES_H 1
  980. | #define HAVE_STDINT_H 1
  981. | #define HAVE_UNISTD_H 1
  982. | #define HAVE_UNISTD_H 1
  983. | #define HAVE_SEMAPHORE_H 1
  984. | #define HAVE_SYS_TIME_H 1
  985. | #define HAVE_TLS 1
  986. | #define HAVE_ATTRIBUTE_VISIBILITY 1
  987. | /* end confdefs.h. */
  988. |
  989. | int
  990. | main ()
  991. | {
  992. | return 0;
  993. | ;
  994. | return 0;
  995. | }
  996. configure:9511: /home/seiza/buildroot/toolchain_build_mipsel/gcc-4.2.1-final/./gcc/xgcc -B/home/seiza/buildroot/toolchain_build_mipsel/gcc-4.2.1-final/./gcc/ -B/usr/mipsel-linux-uclibc/bin/ -B/usr/mipsel-linux-uclibc/lib/ -isystem /usr/mipsel-linux-uclibc/include -isystem /usr/mipsel-linux-uclibc/sys-include -o conftest -lgcc_s conftest.c -lpthread >&5
  997. /home/seiza/buildroot/build_mipsel/staging_dir/usr/mipsel-linux-uclibc/bin/ld: cannot find -lpthread
  998. collect2: ld returned 1 exit status
  999. configure:9517: $? = 1
  1000. configure: failed program was:
  1001. | /* confdefs.h. */
  1002. |
  1003. | #define PACKAGE_NAME "GNU OpenMP Runtime Library"
  1004. | #define PACKAGE_TARNAME "libgomp"
  1005. | #define PACKAGE_VERSION "1.0"
  1006. | #define PACKAGE_STRING "GNU OpenMP Runtime Library 1.0"
  1007. | #define PACKAGE_BUGREPORT ""
  1008. | #define PACKAGE "libgomp"
  1009. | #define VERSION "1.0"
  1010. | #define STDC_HEADERS 1
  1011. | #define TIME_WITH_SYS_TIME 1
  1012. | #define HAVE_SYS_TYPES_H 1
  1013. | #define HAVE_SYS_STAT_H 1
  1014. | #define HAVE_STDLIB_H 1
  1015. | #define HAVE_STRING_H 1
  1016. | #define HAVE_MEMORY_H 1
  1017. | #define HAVE_STRINGS_H 1
  1018. | #define HAVE_INTTYPES_H 1
  1019. | #define HAVE_STDINT_H 1
  1020. | #define HAVE_UNISTD_H 1
  1021. | #define HAVE_UNISTD_H 1
  1022. | #define HAVE_SEMAPHORE_H 1
  1023. | #define HAVE_SYS_TIME_H 1
  1024. | #define HAVE_TLS 1
  1025. | #define HAVE_ATTRIBUTE_VISIBILITY 1
  1026. | /* end confdefs.h. */
  1027. |
  1028. | int
  1029. | main ()
  1030. | {
  1031. | return 0;
  1032. | ;
  1033. | return 0;
  1034. | }
  1035. configure:9543: result: no
  1036. configure:9584: WARNING: === You have requested some kind of symbol versioning, but
  1037. configure:9586: WARNING: === either you are not using a supported linker, or you are
  1038. configure:9588: WARNING: === not building a shared libgcc_s (which is required).
  1039. configure:9590: WARNING: === Symbol versioning will be disabled.
  1040. configure:9606: versioning on shared library symbols is no
  1041. configure:9617: checking whether the target supports __sync_*_compare_and_swap
  1042. configure:9639: /home/seiza/buildroot/toolchain_build_mipsel/gcc-4.2.1-final/./gcc/xgcc -B/home/seiza/buildroot/toolchain_build_mipsel/gcc-4.2.1-final/./gcc/ -B/usr/mipsel-linux-uclibc/bin/ -B/usr/mipsel-linux-uclibc/lib/ -isystem /usr/mipsel-linux-uclibc/include -isystem /usr/mipsel-linux-uclibc/sys-include -o conftest -g -Os -fno-jump-tables -Wall -Werror -ftls-model=initial-exec conftest.c -lpthread >&5
  1043. /home/seiza/buildroot/build_mipsel/staging_dir/usr/mipsel-linux-uclibc/bin/ld: cannot find -lpthread
  1044. collect2: ld returned 1 exit status
  1045. configure:9645: $? = 1
  1046. configure: failed program was:
  1047. | /* confdefs.h. */
  1048. |
  1049. | #define PACKAGE_NAME "GNU OpenMP Runtime Library"
  1050. | #define PACKAGE_TARNAME "libgomp"
  1051. | #define PACKAGE_VERSION "1.0"
  1052. | #define PACKAGE_STRING "GNU OpenMP Runtime Library 1.0"
  1053. | #define PACKAGE_BUGREPORT ""
  1054. | #define PACKAGE "libgomp"
  1055. | #define VERSION "1.0"
  1056. | #define STDC_HEADERS 1
  1057. | #define TIME_WITH_SYS_TIME 1
  1058. | #define HAVE_SYS_TYPES_H 1
  1059. | #define HAVE_SYS_STAT_H 1
  1060. | #define HAVE_STDLIB_H 1
  1061. | #define HAVE_STRING_H 1
  1062. | #define HAVE_MEMORY_H 1
  1063. | #define HAVE_STRINGS_H 1
  1064. | #define HAVE_INTTYPES_H 1
  1065. | #define HAVE_STDINT_H 1
  1066. | #define HAVE_UNISTD_H 1
  1067. | #define HAVE_UNISTD_H 1
  1068. | #define HAVE_SEMAPHORE_H 1
  1069. | #define HAVE_SYS_TIME_H 1
  1070. | #define HAVE_TLS 1
  1071. | #define HAVE_ATTRIBUTE_VISIBILITY 1
  1072. | /* end confdefs.h. */
  1073. |
  1074. | int
  1075. | main ()
  1076. | {
  1077. | int foo, bar; bar = __sync_val_compare_and_swap(&foo, 0, 1);
  1078. | ;
  1079. | return 0;
  1080. | }
  1081. configure:9670: result: no
  1082. configure:9803: /home/seiza/buildroot/toolchain_build_mipsel/gcc-4.2.1-final/./gcc/xgcc -B/home/seiza/buildroot/toolchain_build_mipsel/gcc-4.2.1-final/./gcc/ -B/usr/mipsel-linux-uclibc/bin/ -B/usr/mipsel-linux-uclibc/lib/ -isystem /usr/mipsel-linux-uclibc/include -isystem /usr/mipsel-linux-uclibc/sys-include -c -g -Os -fno-jump-tables -include /home/seiza/buildroot/toolchain_build_mipsel/gcc-4.2.1/libgomp/config/posix/omp-lock.h conftest.c >&5
  1083. configure:9809: $? = 0
  1084. configure:9813: test -z
  1085. || test ! -s conftest.err
  1086. configure:9816: $? = 0
  1087. configure:9819: test -s conftest.o
  1088. configure:9822: $? = 0
  1089. configure:9844: /home/seiza/buildroot/toolchain_build_mipsel/gcc-4.2.1-final/./gcc/xgcc -B/home/seiza/buildroot/toolchain_build_mipsel/gcc-4.2.1-final/./gcc/ -B/usr/mipsel-linux-uclibc/bin/ -B/usr/mipsel-linux-uclibc/lib/ -isystem /usr/mipsel-linux-uclibc/include -isystem /usr/mipsel-linux-uclibc/sys-include -c -g -Os -fno-jump-tables -include /home/seiza/buildroot/toolchain_build_mipsel/gcc-4.2.1/libgomp/config/posix/omp-lock.h conftest.c >&5
  1090. conftest.c: In function 'main':
  1091. conftest.c:31: error: size of array 'test_array' is negative
  1092. configure:9850: $? = 1
  1093. configure: failed program was:
  1094. | /* confdefs.h. */
  1095. |
  1096. | #define PACKAGE_NAME "GNU OpenMP Runtime Library"
  1097. | #define PACKAGE_TARNAME "libgomp"
  1098. | #define PACKAGE_VERSION "1.0"
  1099. | #define PACKAGE_STRING "GNU OpenMP Runtime Library 1.0"
  1100. | #define PACKAGE_BUGREPORT ""
  1101. | #define PACKAGE "libgomp"
  1102. | #define VERSION "1.0"
  1103. | #define STDC_HEADERS 1
  1104. | #define TIME_WITH_SYS_TIME 1
  1105. | #define HAVE_SYS_TYPES_H 1
  1106. | #define HAVE_SYS_STAT_H 1
  1107. | #define HAVE_STDLIB_H 1
  1108. | #define HAVE_STRING_H 1
  1109. | #define HAVE_MEMORY_H 1
  1110. | #define HAVE_STRINGS_H 1
  1111. | #define HAVE_INTTYPES_H 1
  1112. | #define HAVE_STDINT_H 1
  1113. | #define HAVE_UNISTD_H 1
  1114. | #define HAVE_UNISTD_H 1
  1115. | #define HAVE_SEMAPHORE_H 1
  1116. | #define HAVE_SYS_TIME_H 1
  1117. | #define HAVE_TLS 1
  1118. | #define HAVE_ATTRIBUTE_VISIBILITY 1
  1119. | /* end confdefs.h. */
  1120. |
  1121. | int
  1122. | main ()
  1123. | {
  1124. | static int test_array [1 - 2 * !((sizeof (omp_lock_t)) <= 0)];
  1125. | test_array [0] = 0
  1126. |
  1127. | ;
  1128. | return 0;
  1129. | }
  1130. configure:9844: /home/seiza/buildroot/toolchain_build_mipsel/gcc-4.2.1-final/./gcc/xgcc -B/home/seiza/buildroot/toolchain_build_mipsel/gcc-4.2.1-final/./gcc/ -B/usr/mipsel-linux-uclibc/bin/ -B/usr/mipsel-linux-uclibc/lib/ -isystem /usr/mipsel-linux-uclibc/include -isystem /usr/mipsel-linux-uclibc/sys-include -c -g -Os -fno-jump-tables -include /home/seiza/buildroot/toolchain_build_mipsel/gcc-4.2.1/libgomp/config/posix/omp-lock.h conftest.c >&5
  1131. conftest.c: In function 'main':
  1132. conftest.c:31: error: size of array 'test_array' is negative
  1133. configure:9850: $? = 1
  1134. configure: failed program was:
  1135. | /* confdefs.h. */
  1136. |
  1137. | #define PACKAGE_NAME "GNU OpenMP Runtime Library"
  1138. | #define PACKAGE_TARNAME "libgomp"
  1139. | #define PACKAGE_VERSION "1.0"
  1140. | #define PACKAGE_STRING "GNU OpenMP Runtime Library 1.0"
  1141. | #define PACKAGE_BUGREPORT ""
  1142. | #define PACKAGE "libgomp"
  1143. | #define VERSION "1.0"
  1144. | #define STDC_HEADERS 1
  1145. | #define TIME_WITH_SYS_TIME 1
  1146. | #define HAVE_SYS_TYPES_H 1
  1147. | #define HAVE_SYS_STAT_H 1
  1148. | #define HAVE_STDLIB_H 1
  1149. | #define HAVE_STRING_H 1
  1150. | #define HAVE_MEMORY_H 1
  1151. | #define HAVE_STRINGS_H 1
  1152. | #define HAVE_INTTYPES_H 1
  1153. | #define HAVE_STDINT_H 1
  1154. | #define HAVE_UNISTD_H 1
  1155. | #define HAVE_UNISTD_H 1
  1156. | #define HAVE_SEMAPHORE_H 1
  1157. | #define HAVE_SYS_TIME_H 1
  1158. | #define HAVE_TLS 1
  1159. | #define HAVE_ATTRIBUTE_VISIBILITY 1
  1160. | /* end confdefs.h. */
  1161. |
  1162. | int
  1163. | main ()
  1164. | {
  1165. | static int test_array [1 - 2 * !((sizeof (omp_lock_t)) <= 1)];
  1166. | test_array [0] = 0
  1167. |
  1168. | ;
  1169. | return 0;
  1170. | }
  1171. configure:9844: /home/seiza/buildroot/toolchain_build_mipsel/gcc-4.2.1-final/./gcc/xgcc -B/home/seiza/buildroot/toolchain_build_mipsel/gcc-4.2.1-final/./gcc/ -B/usr/mipsel-linux-uclibc/bin/ -B/usr/mipsel-linux-uclibc/lib/ -isystem /usr/mipsel-linux-uclibc/include -isystem /usr/mipsel-linux-uclibc/sys-include -c -g -Os -fno-jump-tables -include /home/seiza/buildroot/toolchain_build_mipsel/gcc-4.2.1/libgomp/config/posix/omp-lock.h conftest.c >&5
  1172. conftest.c: In function 'main':
  1173. conftest.c:31: error: size of array 'test_array' is negative
  1174. configure:9850: $? = 1
  1175. configure: failed program was:
  1176. | /* confdefs.h. */
  1177. |
  1178. | #define PACKAGE_NAME "GNU OpenMP Runtime Library"
  1179. | #define PACKAGE_TARNAME "libgomp"
  1180. | #define PACKAGE_VERSION "1.0"
  1181. | #define PACKAGE_STRING "GNU OpenMP Runtime Library 1.0"
  1182. | #define PACKAGE_BUGREPORT ""
  1183. | #define PACKAGE "libgomp"
  1184. | #define VERSION "1.0"
  1185. | #define STDC_HEADERS 1
  1186. | #define TIME_WITH_SYS_TIME 1
  1187. | #define HAVE_SYS_TYPES_H 1
  1188. | #define HAVE_SYS_STAT_H 1
  1189. | #define HAVE_STDLIB_H 1
  1190. | #define HAVE_STRING_H 1
  1191. | #define HAVE_MEMORY_H 1
  1192. | #define HAVE_STRINGS_H 1
  1193. | #define HAVE_INTTYPES_H 1
  1194. | #define HAVE_STDINT_H 1
  1195. | #define HAVE_UNISTD_H 1
  1196. | #define HAVE_UNISTD_H 1
  1197. | #define HAVE_SEMAPHORE_H 1
  1198. | #define HAVE_SYS_TIME_H 1
  1199. | #define HAVE_TLS 1
  1200. | #define HAVE_ATTRIBUTE_VISIBILITY 1
  1201. | /* end confdefs.h. */
  1202. |
  1203. | int
  1204. | main ()
  1205. | {
  1206. | static int test_array [1 - 2 * !((sizeof (omp_lock_t)) <= 3)];
  1207. | test_array [0] = 0
  1208. |
  1209. | ;
  1210. | return 0;
  1211. | }
  1212. configure:9844: /home/seiza/buildroot/toolchain_build_mipsel/gcc-4.2.1-final/./gcc/xgcc -B/home/seiza/buildroot/toolchain_build_mipsel/gcc-4.2.1-final/./gcc/ -B/usr/mipsel-linux-uclibc/bin/ -B/usr/mipsel-linux-uclibc/lib/ -isystem /usr/mipsel-linux-uclibc/include -isystem /usr/mipsel-linux-uclibc/sys-include -c -g -Os -fno-jump-tables -include /home/seiza/buildroot/toolchain_build_mipsel/gcc-4.2.1/libgomp/config/posix/omp-lock.h conftest.c >&5
  1213. conftest.c: In function 'main':
  1214. conftest.c:31: error: size of array 'test_array' is negative
  1215. configure:9850: $? = 1
  1216. configure: failed program was:
  1217. | /* confdefs.h. */
  1218. |
  1219. | #define PACKAGE_NAME "GNU OpenMP Runtime Library"
  1220. | #define PACKAGE_TARNAME "libgomp"
  1221. | #define PACKAGE_VERSION "1.0"
  1222. | #define PACKAGE_STRING "GNU OpenMP Runtime Library 1.0"
  1223. | #define PACKAGE_BUGREPORT ""
  1224. | #define PACKAGE "libgomp"
  1225. | #define VERSION "1.0"
  1226. | #define STDC_HEADERS 1
  1227. | #define TIME_WITH_SYS_TIME 1
  1228. | #define HAVE_SYS_TYPES_H 1
  1229. | #define HAVE_SYS_STAT_H 1
  1230. | #define HAVE_STDLIB_H 1
  1231. | #define HAVE_STRING_H 1
  1232. | #define HAVE_MEMORY_H 1
  1233. | #define HAVE_STRINGS_H 1
  1234. | #define HAVE_INTTYPES_H 1
  1235. | #define HAVE_STDINT_H 1
  1236. | #define HAVE_UNISTD_H 1
  1237. | #define HAVE_UNISTD_H 1
  1238. | #define HAVE_SEMAPHORE_H 1
  1239. | #define HAVE_SYS_TIME_H 1
  1240. | #define HAVE_TLS 1
  1241. | #define HAVE_ATTRIBUTE_VISIBILITY 1
  1242. | /* end confdefs.h. */
  1243. |
  1244. | int
  1245. | main ()
  1246. | {
  1247. | static int test_array [1 - 2 * !((sizeof (omp_lock_t)) <= 7)];
  1248. | test_array [0] = 0
  1249. |
  1250. | ;
  1251. | return 0;
  1252. | }
  1253. configure:9844: /home/seiza/buildroot/toolchain_build_mipsel/gcc-4.2.1-final/./gcc/xgcc -B/home/seiza/buildroot/toolchain_build_mipsel/gcc-4.2.1-final/./gcc/ -B/usr/mipsel-linux-uclibc/bin/ -B/usr/mipsel-linux-uclibc/lib/ -isystem /usr/mipsel-linux-uclibc/include -isystem /usr/mipsel-linux-uclibc/sys-include -c -g -Os -fno-jump-tables -include /home/seiza/buildroot/toolchain_build_mipsel/gcc-4.2.1/libgomp/config/posix/omp-lock.h conftest.c >&5
  1254. conftest.c: In function 'main':
  1255. conftest.c:31: error: size of array 'test_array' is negative
  1256. configure:9850: $? = 1
  1257. configure: failed program was:
  1258. | /* confdefs.h. */
  1259. |
  1260. | #define PACKAGE_NAME "GNU OpenMP Runtime Library"
  1261. | #define PACKAGE_TARNAME "libgomp"
  1262. | #define PACKAGE_VERSION "1.0"
  1263. | #define PACKAGE_STRING "GNU OpenMP Runtime Library 1.0"
  1264. | #define PACKAGE_BUGREPORT ""
  1265. | #define PACKAGE "libgomp"
  1266. | #define VERSION "1.0"
  1267. | #define STDC_HEADERS 1
  1268. | #define TIME_WITH_SYS_TIME 1
  1269. | #define HAVE_SYS_TYPES_H 1
  1270. | #define HAVE_SYS_STAT_H 1
  1271. | #define HAVE_STDLIB_H 1
  1272. | #define HAVE_STRING_H 1
  1273. | #define HAVE_MEMORY_H 1
  1274. | #define HAVE_STRINGS_H 1
  1275. | #define HAVE_INTTYPES_H 1
  1276. | #define HAVE_STDINT_H 1
  1277. | #define HAVE_UNISTD_H 1
  1278. | #define HAVE_UNISTD_H 1
  1279. | #define HAVE_SEMAPHORE_H 1
  1280. | #define HAVE_SYS_TIME_H 1
  1281. | #define HAVE_TLS 1
  1282. | #define HAVE_ATTRIBUTE_VISIBILITY 1
  1283. | /* end confdefs.h. */
  1284. |
  1285. | int
  1286. | main ()
  1287. | {
  1288. | static int test_array [1 - 2 * !((sizeof (omp_lock_t)) <= 15)];
  1289. | test_array [0] = 0
  1290. |
  1291. | ;
  1292. | return 0;
  1293. | }
  1294. configure:9844: /home/seiza/buildroot/toolchain_build_mipsel/gcc-4.2.1-final/./gcc/xgcc -B/home/seiza/buildroot/toolchain_build_mipsel/gcc-4.2.1-final/./gcc/ -B/usr/mipsel-linux-uclibc/bin/ -B/usr/mipsel-linux-uclibc/lib/ -isystem /usr/mipsel-linux-uclibc/include -isystem /usr/mipsel-linux-uclibc/sys-include -c -g -Os -fno-jump-tables -include /home/seiza/buildroot/toolchain_build_mipsel/gcc-4.2.1/libgomp/config/posix/omp-lock.h conftest.c >&5
  1295. configure:9850: $? = 0
  1296. configure:9854: test -z
  1297. || test ! -s conftest.err
  1298. configure:9857: $? = 0
  1299. configure:9860: test -s conftest.o
  1300. configure:9863: $? = 0
  1301. configure:10007: /home/seiza/buildroot/toolchain_build_mipsel/gcc-4.2.1-final/./gcc/xgcc -B/home/seiza/buildroot/toolchain_build_mipsel/gcc-4.2.1-final/./gcc/ -B/usr/mipsel-linux-uclibc/bin/ -B/usr/mipsel-linux-uclibc/lib/ -isystem /usr/mipsel-linux-uclibc/include -isystem /usr/mipsel-linux-uclibc/sys-include -c -g -Os -fno-jump-tables -include /home/seiza/buildroot/toolchain_build_mipsel/gcc-4.2.1/libgomp/config/posix/omp-lock.h conftest.c >&5
  1302. conftest.c: In function 'main':
  1303. conftest.c:31: error: size of array 'test_array' is negative
  1304. configure:10013: $? = 1
  1305. configure: failed program was:
  1306. | /* confdefs.h. */
  1307. |
  1308. | #define PACKAGE_NAME "GNU OpenMP Runtime Library"
  1309. | #define PACKAGE_TARNAME "libgomp"
  1310. | #define PACKAGE_VERSION "1.0"
  1311. | #define PACKAGE_STRING "GNU OpenMP Runtime Library 1.0"
  1312. | #define PACKAGE_BUGREPORT ""
  1313. | #define PACKAGE "libgomp"
  1314. | #define VERSION "1.0"
  1315. | #define STDC_HEADERS 1
  1316. | #define TIME_WITH_SYS_TIME 1
  1317. | #define HAVE_SYS_TYPES_H 1
  1318. | #define HAVE_SYS_STAT_H 1
  1319. | #define HAVE_STDLIB_H 1
  1320. | #define HAVE_STRING_H 1
  1321. | #define HAVE_MEMORY_H 1
  1322. | #define HAVE_STRINGS_H 1
  1323. | #define HAVE_INTTYPES_H 1
  1324. | #define HAVE_STDINT_H 1
  1325. | #define HAVE_UNISTD_H 1
  1326. | #define HAVE_UNISTD_H 1
  1327. | #define HAVE_SEMAPHORE_H 1
  1328. | #define HAVE_SYS_TIME_H 1
  1329. | #define HAVE_TLS 1
  1330. | #define HAVE_ATTRIBUTE_VISIBILITY 1
  1331. | /* end confdefs.h. */
  1332. |
  1333. | int
  1334. | main ()
  1335. | {
  1336. | static int test_array [1 - 2 * !((sizeof (omp_lock_t)) <= 23)];
  1337. | test_array [0] = 0
  1338. |
  1339. | ;
  1340. | return 0;
  1341. | }
  1342. configure:10007: /home/seiza/buildroot/toolchain_build_mipsel/gcc-4.2.1-final/./gcc/xgcc -B/home/seiza/buildroot/toolchain_build_mipsel/gcc-4.2.1-final/./gcc/ -B/usr/mipsel-linux-uclibc/bin/ -B/usr/mipsel-linux-uclibc/lib/ -isystem /usr/mipsel-linux-uclibc/include -isystem /usr/mipsel-linux-uclibc/sys-include -c -g -Os -fno-jump-tables -include /home/seiza/buildroot/toolchain_build_mipsel/gcc-4.2.1/libgomp/config/posix/omp-lock.h conftest.c >&5
  1343. configure:10013: $? = 0
  1344. configure:10017: test -z
  1345. || test ! -s conftest.err
  1346. configure:10020: $? = 0
  1347. configure:10023: test -s conftest.o
  1348. configure:10026: $? = 0
  1349. configure:10007: /home/seiza/buildroot/toolchain_build_mipsel/gcc-4.2.1-final/./gcc/xgcc -B/home/seiza/buildroot/toolchain_build_mipsel/gcc-4.2.1-final/./gcc/ -B/usr/mipsel-linux-uclibc/bin/ -B/usr/mipsel-linux-uclibc/lib/ -isystem /usr/mipsel-linux-uclibc/include -isystem /usr/mipsel-linux-uclibc/sys-include -c -g -Os -fno-jump-tables -include /home/seiza/buildroot/toolchain_build_mipsel/gcc-4.2.1/libgomp/config/posix/omp-lock.h conftest.c >&5
  1350. configure:10013: $? = 0
  1351. configure:10017: test -z
  1352. || test ! -s conftest.err
  1353. configure:10020: $? = 0
  1354. configure:10023: test -s conftest.o
  1355. configure:10026: $? = 0
  1356. configure:10007: /home/seiza/buildroot/toolchain_build_mipsel/gcc-4.2.1-final/./gcc/xgcc -B/home/seiza/buildroot/toolchain_build_mipsel/gcc-4.2.1-final/./gcc/ -B/usr/mipsel-linux-uclibc/bin/ -B/usr/mipsel-linux-uclibc/lib/ -isystem /usr/mipsel-linux-uclibc/include -isystem /usr/mipsel-linux-uclibc/sys-include -c -g -Os -fno-jump-tables -include /home/seiza/buildroot/toolchain_build_mipsel/gcc-4.2.1/libgomp/config/posix/omp-lock.h conftest.c >&5
  1357. configure:10013: $? = 0
  1358. configure:10017: test -z
  1359. || test ! -s conftest.err
  1360. configure:10020: $? = 0
  1361. configure:10023: test -s conftest.o
  1362. configure:10026: $? = 0
  1363. configure:10135: /home/seiza/buildroot/toolchain_build_mipsel/gcc-4.2.1-final/./gcc/xgcc -B/home/seiza/buildroot/toolchain_build_mipsel/gcc-4.2.1-final/./gcc/ -B/usr/mipsel-linux-uclibc/bin/ -B/usr/mipsel-linux-uclibc/lib/ -isystem /usr/mipsel-linux-uclibc/include -isystem /usr/mipsel-linux-uclibc/sys-include -c -g -Os -fno-jump-tables -include /home/seiza/buildroot/toolchain_build_mipsel/gcc-4.2.1/libgomp/config/posix/omp-lock.h conftest.c >&5
  1364. configure:10141: $? = 0
  1365. configure:10145: test -z
  1366. || test ! -s conftest.err
  1367. configure:10148: $? = 0
  1368. configure:10151: test -s conftest.o
  1369. configure:10154: $? = 0
  1370. configure:10176: /home/seiza/buildroot/toolchain_build_mipsel/gcc-4.2.1-final/./gcc/xgcc -B/home/seiza/buildroot/toolchain_build_mipsel/gcc-4.2.1-final/./gcc/ -B/usr/mipsel-linux-uclibc/bin/ -B/usr/mipsel-linux-uclibc/lib/ -isystem /usr/mipsel-linux-uclibc/include -isystem /usr/mipsel-linux-uclibc/sys-include -c -g -Os -fno-jump-tables -include /home/seiza/buildroot/toolchain_build_mipsel/gcc-4.2.1/libgomp/config/posix/omp-lock.h conftest.c >&5
  1371. conftest.c: In function 'main':
  1372. conftest.c:31: error: size of array 'test_array' is negative
  1373. configure:10182: $? = 1
  1374. configure: failed program was:
  1375. | /* confdefs.h. */
  1376. |
  1377. | #define PACKAGE_NAME "GNU OpenMP Runtime Library"
  1378. | #define PACKAGE_TARNAME "libgomp"
  1379. | #define PACKAGE_VERSION "1.0"
  1380. | #define PACKAGE_STRING "GNU OpenMP Runtime Library 1.0"
  1381. | #define PACKAGE_BUGREPORT ""
  1382. | #define PACKAGE "libgomp"
  1383. | #define VERSION "1.0"
  1384. | #define STDC_HEADERS 1
  1385. | #define TIME_WITH_SYS_TIME 1
  1386. | #define HAVE_SYS_TYPES_H 1
  1387. | #define HAVE_SYS_STAT_H 1
  1388. | #define HAVE_STDLIB_H 1
  1389. | #define HAVE_STRING_H 1
  1390. | #define HAVE_MEMORY_H 1
  1391. | #define HAVE_STRINGS_H 1
  1392. | #define HAVE_INTTYPES_H 1
  1393. | #define HAVE_STDINT_H 1
  1394. | #define HAVE_UNISTD_H 1
  1395. | #define HAVE_UNISTD_H 1
  1396. | #define HAVE_SEMAPHORE_H 1
  1397. | #define HAVE_SYS_TIME_H 1
  1398. | #define HAVE_TLS 1
  1399. | #define HAVE_ATTRIBUTE_VISIBILITY 1
  1400. | /* end confdefs.h. */
  1401. |
  1402. | int
  1403. | main ()
  1404. | {
  1405. | static int test_array [1 - 2 * !((__alignof (omp_lock_t)) <= 0)];
  1406. | test_array [0] = 0
  1407. |
  1408. | ;
  1409. | return 0;
  1410. | }
  1411. configure:10176: /home/seiza/buildroot/toolchain_build_mipsel/gcc-4.2.1-final/./gcc/xgcc -B/home/seiza/buildroot/toolchain_build_mipsel/gcc-4.2.1-final/./gcc/ -B/usr/mipsel-linux-uclibc/bin/ -B/usr/mipsel-linux-uclibc/lib/ -isystem /usr/mipsel-linux-uclibc/include -isystem /usr/mipsel-linux-uclibc/sys-include -c -g -Os -fno-jump-tables -include /home/seiza/buildroot/toolchain_build_mipsel/gcc-4.2.1/libgomp/config/posix/omp-lock.h conftest.c >&5
  1412. conftest.c: In function 'main':
  1413. conftest.c:31: error: size of array 'test_array' is negative
  1414. configure:10182: $? = 1
  1415. configure: failed program was:
  1416. | /* confdefs.h. */
  1417. |
  1418. | #define PACKAGE_NAME "GNU OpenMP Runtime Library"
  1419. | #define PACKAGE_TARNAME "libgomp"
  1420. | #define PACKAGE_VERSION "1.0"
  1421. | #define PACKAGE_STRING "GNU OpenMP Runtime Library 1.0"
  1422. | #define PACKAGE_BUGREPORT ""
  1423. | #define PACKAGE "libgomp"
  1424. | #define VERSION "1.0"
  1425. | #define STDC_HEADERS 1
  1426. | #define TIME_WITH_SYS_TIME 1
  1427. | #define HAVE_SYS_TYPES_H 1
  1428. | #define HAVE_SYS_STAT_H 1
  1429. | #define HAVE_STDLIB_H 1
  1430. | #define HAVE_STRING_H 1
  1431. | #define HAVE_MEMORY_H 1
  1432. | #define HAVE_STRINGS_H 1
  1433. | #define HAVE_INTTYPES_H 1
  1434. | #define HAVE_STDINT_H 1
  1435. | #define HAVE_UNISTD_H 1
  1436. | #define HAVE_UNISTD_H 1
  1437. | #define HAVE_SEMAPHORE_H 1
  1438. | #define HAVE_SYS_TIME_H 1
  1439. | #define HAVE_TLS 1
  1440. | #define HAVE_ATTRIBUTE_VISIBILITY 1
  1441. | /* end confdefs.h. */
  1442. |
  1443. | int
  1444. | main ()
  1445. | {
  1446. | static int test_array [1 - 2 * !((__alignof (omp_lock_t)) <= 1)];
  1447. | test_array [0] = 0
  1448. |
  1449. | ;
  1450. | return 0;
  1451. | }
  1452. configure:10176: /home/seiza/buildroot/toolchain_build_mipsel/gcc-4.2.1-final/./gcc/xgcc -B/home/seiza/buildroot/toolchain_build_mipsel/gcc-4.2.1-final/./gcc/ -B/usr/mipsel-linux-uclibc/bin/ -B/usr/mipsel-linux-uclibc/lib/ -isystem /usr/mipsel-linux-uclibc/include -isystem /usr/mipsel-linux-uclibc/sys-include -c -g -Os -fno-jump-tables -include /home/seiza/buildroot/toolchain_build_mipsel/gcc-4.2.1/libgomp/config/posix/omp-lock.h conftest.c >&5
  1453. conftest.c: In function 'main':
  1454. conftest.c:31: error: size of array 'test_array' is negative
  1455. configure:10182: $? = 1
  1456. configure: failed program was:
  1457. | /* confdefs.h. */
  1458. |
  1459. | #define PACKAGE_NAME "GNU OpenMP Runtime Library"
  1460. | #define PACKAGE_TARNAME "libgomp"
  1461. | #define PACKAGE_VERSION "1.0"
  1462. | #define PACKAGE_STRING "GNU OpenMP Runtime Library 1.0"
  1463. | #define PACKAGE_BUGREPORT ""
  1464. | #define PACKAGE "libgomp"
  1465. | #define VERSION "1.0"
  1466. | #define STDC_HEADERS 1
  1467. | #define TIME_WITH_SYS_TIME 1
  1468. | #define HAVE_SYS_TYPES_H 1
  1469. | #define HAVE_SYS_STAT_H 1
  1470. | #define HAVE_STDLIB_H 1
  1471. | #define HAVE_STRING_H 1
  1472. | #define HAVE_MEMORY_H 1
  1473. | #define HAVE_STRINGS_H 1
  1474. | #define HAVE_INTTYPES_H 1
  1475. | #define HAVE_STDINT_H 1
  1476. | #define HAVE_UNISTD_H 1
  1477. | #define HAVE_UNISTD_H 1
  1478. | #define HAVE_SEMAPHORE_H 1
  1479. | #define HAVE_SYS_TIME_H 1
  1480. | #define HAVE_TLS 1
  1481. | #define HAVE_ATTRIBUTE_VISIBILITY 1
  1482. | /* end confdefs.h. */
  1483. |
  1484. | int
  1485. | main ()
  1486. | {
  1487. | static int test_array [1 - 2 * !((__alignof (omp_lock_t)) <= 3)];
  1488. | test_array [0] = 0
  1489. |
  1490. | ;
  1491. | return 0;
  1492. | }
  1493. configure:10176: /home/seiza/buildroot/toolchain_build_mipsel/gcc-4.2.1-final/./gcc/xgcc -B/home/seiza/buildroot/toolchain_build_mipsel/gcc-4.2.1-final/./gcc/ -B/usr/mipsel-linux-uclibc/bin/ -B/usr/mipsel-linux-uclibc/lib/ -isystem /usr/mipsel-linux-uclibc/include -isystem /usr/mipsel-linux-uclibc/sys-include -c -g -Os -fno-jump-tables -include /home/seiza/buildroot/toolchain_build_mipsel/gcc-4.2.1/libgomp/config/posix/omp-lock.h conftest.c >&5
  1494. configure:10182: $? = 0
  1495. configure:10186: test -z
  1496. || test ! -s conftest.err
  1497. configure:10189: $? = 0
  1498. configure:10192: test -s conftest.o
  1499. configure:10195: $? = 0
  1500. configure:10339: /home/seiza/buildroot/toolchain_build_mipsel/gcc-4.2.1-final/./gcc/xgcc -B/home/seiza/buildroot/toolchain_build_mipsel/gcc-4.2.1-final/./gcc/ -B/usr/mipsel-linux-uclibc/bin/ -B/usr/mipsel-linux-uclibc/lib/ -isystem /usr/mipsel-linux-uclibc/include -isystem /usr/mipsel-linux-uclibc/sys-include -c -g -Os -fno-jump-tables -include /home/seiza/buildroot/toolchain_build_mipsel/gcc-4.2.1/libgomp/config/posix/omp-lock.h conftest.c >&5
  1501. configure:10345: $? = 0
  1502. configure:10349: test -z
  1503. || test ! -s conftest.err
  1504. configure:10352: $? = 0
  1505. configure:10355: test -s conftest.o
  1506. configure:10358: $? = 0
  1507. configure:10339: /home/seiza/buildroot/toolchain_build_mipsel/gcc-4.2.1-final/./gcc/xgcc -B/home/seiza/buildroot/toolchain_build_mipsel/gcc-4.2.1-final/./gcc/ -B/usr/mipsel-linux-uclibc/bin/ -B/usr/mipsel-linux-uclibc/lib/ -isystem /usr/mipsel-linux-uclibc/include -isystem /usr/mipsel-linux-uclibc/sys-include -c -g -Os -fno-jump-tables -include /home/seiza/buildroot/toolchain_build_mipsel/gcc-4.2.1/libgomp/config/posix/omp-lock.h conftest.c >&5
  1508. configure:10345: $? = 0
  1509. configure:10349: test -z
  1510. || test ! -s conftest.err
  1511. configure:10352: $? = 0
  1512. configure:10355: test -s conftest.o
  1513. configure:10358: $? = 0
  1514. configure:10461: /home/seiza/buildroot/toolchain_build_mipsel/gcc-4.2.1-final/./gcc/xgcc -B/home/seiza/buildroot/toolchain_build_mipsel/gcc-4.2.1-final/./gcc/ -B/usr/mipsel-linux-uclibc/bin/ -B/usr/mipsel-linux-uclibc/lib/ -isystem /usr/mipsel-linux-uclibc/include -isystem /usr/mipsel-linux-uclibc/sys-include -c -g -Os -fno-jump-tables -include /home/seiza/buildroot/toolchain_build_mipsel/gcc-4.2.1/libgomp/config/posix/omp-lock.h conftest.c >&5
  1515. configure:10467: $? = 0
  1516. configure:10471: test -z
  1517. || test ! -s conftest.err
  1518. configure:10474: $? = 0
  1519. configure:10477: test -s conftest.o
  1520. configure:10480: $? = 0
  1521. configure:10502: /home/seiza/buildroot/toolchain_build_mipsel/gcc-4.2.1-final/./gcc/xgcc -B/home/seiza/buildroot/toolchain_build_mipsel/gcc-4.2.1-final/./gcc/ -B/usr/mipsel-linux-uclibc/bin/ -B/usr/mipsel-linux-uclibc/lib/ -isystem /usr/mipsel-linux-uclibc/include -isystem /usr/mipsel-linux-uclibc/sys-include -c -g -Os -fno-jump-tables -include /home/seiza/buildroot/toolchain_build_mipsel/gcc-4.2.1/libgomp/config/posix/omp-lock.h conftest.c >&5
  1522. conftest.c: In function 'main':
  1523. conftest.c:31: error: size of array 'test_array' is negative
  1524. configure:10508: $? = 1
  1525. configure: failed program was:
  1526. | /* confdefs.h. */
  1527. |
  1528. | #define PACKAGE_NAME "GNU OpenMP Runtime Library"
  1529. | #define PACKAGE_TARNAME "libgomp"
  1530. | #define PACKAGE_VERSION "1.0"
  1531. | #define PACKAGE_STRING "GNU OpenMP Runtime Library 1.0"
  1532. | #define PACKAGE_BUGREPORT ""
  1533. | #define PACKAGE "libgomp"
  1534. | #define VERSION "1.0"
  1535. | #define STDC_HEADERS 1
  1536. | #define TIME_WITH_SYS_TIME 1
  1537. | #define HAVE_SYS_TYPES_H 1
  1538. | #define HAVE_SYS_STAT_H 1
  1539. | #define HAVE_STDLIB_H 1
  1540. | #define HAVE_STRING_H 1
  1541. | #define HAVE_MEMORY_H 1
  1542. | #define HAVE_STRINGS_H 1
  1543. | #define HAVE_INTTYPES_H 1
  1544. | #define HAVE_STDINT_H 1
  1545. | #define HAVE_UNISTD_H 1
  1546. | #define HAVE_UNISTD_H 1
  1547. | #define HAVE_SEMAPHORE_H 1
  1548. | #define HAVE_SYS_TIME_H 1
  1549. | #define HAVE_TLS 1
  1550. | #define HAVE_ATTRIBUTE_VISIBILITY 1
  1551. | /* end confdefs.h. */
  1552. |
  1553. | int
  1554. | main ()
  1555. | {
  1556. | static int test_array [1 - 2 * !((sizeof (omp_nest_lock_t)) <= 0)];
  1557. | test_array [0] = 0
  1558. |
  1559. | ;
  1560. | return 0;
  1561. | }
  1562. configure:10502: /home/seiza/buildroot/toolchain_build_mipsel/gcc-4.2.1-final/./gcc/xgcc -B/home/seiza/buildroot/toolchain_build_mipsel/gcc-4.2.1-final/./gcc/ -B/usr/mipsel-linux-uclibc/bin/ -B/usr/mipsel-linux-uclibc/lib/ -isystem /usr/mipsel-linux-uclibc/include -isystem /usr/mipsel-linux-uclibc/sys-include -c -g -Os -fno-jump-tables -include /home/seiza/buildroot/toolchain_build_mipsel/gcc-4.2.1/libgomp/config/posix/omp-lock.h conftest.c >&5
  1563. conftest.c: In function 'main':
  1564. conftest.c:31: error: size of array 'test_array' is negative
  1565. configure:10508: $? = 1
  1566. configure: failed program was:
  1567. | /* confdefs.h. */
  1568. |
  1569. | #define PACKAGE_NAME "GNU OpenMP Runtime Library"
  1570. | #define PACKAGE_TARNAME "libgomp"
  1571. | #define PACKAGE_VERSION "1.0"
  1572. | #define PACKAGE_STRING "GNU OpenMP Runtime Library 1.0"
  1573. | #define PACKAGE_BUGREPORT ""
  1574. | #define PACKAGE "libgomp"
  1575. | #define VERSION "1.0"
  1576. | #define STDC_HEADERS 1
  1577. | #define TIME_WITH_SYS_TIME 1
  1578. | #define HAVE_SYS_TYPES_H 1
  1579. | #define HAVE_SYS_STAT_H 1
  1580. | #define HAVE_STDLIB_H 1
  1581. | #define HAVE_STRING_H 1
  1582. | #define HAVE_MEMORY_H 1
  1583. | #define HAVE_STRINGS_H 1
  1584. | #define HAVE_INTTYPES_H 1
  1585. | #define HAVE_STDINT_H 1
  1586. | #define HAVE_UNISTD_H 1
  1587. | #define HAVE_UNISTD_H 1
  1588. | #define HAVE_SEMAPHORE_H 1
  1589. | #define HAVE_SYS_TIME_H 1
  1590. | #define HAVE_TLS 1
  1591. | #define HAVE_ATTRIBUTE_VISIBILITY 1
  1592. | /* end confdefs.h. */
  1593. |
  1594. | int
  1595. | main ()
  1596. | {
  1597. | static int test_array [1 - 2 * !((sizeof (omp_nest_lock_t)) <= 1)];
  1598. | test_array [0] = 0
  1599. |
  1600. | ;
  1601. | return 0;
  1602. | }
  1603. configure:10502: /home/seiza/buildroot/toolchain_build_mipsel/gcc-4.2.1-final/./gcc/xgcc -B/home/seiza/buildroot/toolchain_build_mipsel/gcc-4.2.1-final/./gcc/ -B/usr/mipsel-linux-uclibc/bin/ -B/usr/mipsel-linux-uclibc/lib/ -isystem /usr/mipsel-linux-uclibc/include -isystem /usr/mipsel-linux-uclibc/sys-include -c -g -Os -fno-jump-tables -include /home/seiza/buildroot/toolchain_build_mipsel/gcc-4.2.1/libgomp/config/posix/omp-lock.h conftest.c >&5
  1604. conftest.c: In function 'main':
  1605. conftest.c:31: error: size of array 'test_array' is negative
  1606. configure:10508: $? = 1
  1607. configure: failed program was:
  1608. | /* confdefs.h. */
  1609. |
  1610. | #define PACKAGE_NAME "GNU OpenMP Runtime Library"
  1611. | #define PACKAGE_TARNAME "libgomp"
  1612. | #define PACKAGE_VERSION "1.0"
  1613. | #define PACKAGE_STRING "GNU OpenMP Runtime Library 1.0"
  1614. | #define PACKAGE_BUGREPORT ""
  1615. | #define PACKAGE "libgomp"
  1616. | #define VERSION "1.0"
  1617. | #define STDC_HEADERS 1
  1618. | #define TIME_WITH_SYS_TIME 1
  1619. | #define HAVE_SYS_TYPES_H 1
  1620. | #define HAVE_SYS_STAT_H 1
  1621. | #define HAVE_STDLIB_H 1
  1622. | #define HAVE_STRING_H 1
  1623. | #define HAVE_MEMORY_H 1
  1624. | #define HAVE_STRINGS_H 1
  1625. | #define HAVE_INTTYPES_H 1
  1626. | #define HAVE_STDINT_H 1
  1627. | #define HAVE_UNISTD_H 1
  1628. | #define HAVE_UNISTD_H 1
  1629. | #define HAVE_SEMAPHORE_H 1
  1630. | #define HAVE_SYS_TIME_H 1
  1631. | #define HAVE_TLS 1
  1632. | #define HAVE_ATTRIBUTE_VISIBILITY 1
  1633. | /* end confdefs.h. */
  1634. |
  1635. | int
  1636. | main ()
  1637. | {
  1638. | static int test_array [1 - 2 * !((sizeof (omp_nest_lock_t)) <= 3)];
  1639. | test_array [0] = 0
  1640. |
  1641. | ;
  1642. | return 0;
  1643. | }
  1644. configure:10502: /home/seiza/buildroot/toolchain_build_mipsel/gcc-4.2.1-final/./gcc/xgcc -B/home/seiza/buildroot/toolchain_build_mipsel/gcc-4.2.1-final/./gcc/ -B/usr/mipsel-linux-uclibc/bin/ -B/usr/mipsel-linux-uclibc/lib/ -isystem /usr/mipsel-linux-uclibc/include -isystem /usr/mipsel-linux-uclibc/sys-include -c -g -Os -fno-jump-tables -include /home/seiza/buildroot/toolchain_build_mipsel/gcc-4.2.1/libgomp/config/posix/omp-lock.h conftest.c >&5
  1645. conftest.c: In function 'main':
  1646. conftest.c:31: error: size of array 'test_array' is negative
  1647. configure:10508: $? = 1
  1648. configure: failed program was:
  1649. | /* confdefs.h. */
  1650. |
  1651. | #define PACKAGE_NAME "GNU OpenMP Runtime Library"
  1652. | #define PACKAGE_TARNAME "libgomp"
  1653. | #define PACKAGE_VERSION "1.0"
  1654. | #define PACKAGE_STRING "GNU OpenMP Runtime Library 1.0"
  1655. | #define PACKAGE_BUGREPORT ""
  1656. | #define PACKAGE "libgomp"
  1657. | #define VERSION "1.0"
  1658. | #define STDC_HEADERS 1
  1659. | #define TIME_WITH_SYS_TIME 1
  1660. | #define HAVE_SYS_TYPES_H 1
  1661. | #define HAVE_SYS_STAT_H 1
  1662. | #define HAVE_STDLIB_H 1
  1663. | #define HAVE_STRING_H 1
  1664. | #define HAVE_MEMORY_H 1
  1665. | #define HAVE_STRINGS_H 1
  1666. | #define HAVE_INTTYPES_H 1
  1667. | #define HAVE_STDINT_H 1
  1668. | #define HAVE_UNISTD_H 1
  1669. | #define HAVE_UNISTD_H 1
  1670. | #define HAVE_SEMAPHORE_H 1
  1671. | #define HAVE_SYS_TIME_H 1
  1672. | #define HAVE_TLS 1
  1673. | #define HAVE_ATTRIBUTE_VISIBILITY 1
  1674. | /* end confdefs.h. */
  1675. |
  1676. | int
  1677. | main ()
  1678. | {
  1679. | static int test_array [1 - 2 * !((sizeof (omp_nest_lock_t)) <= 7)];
  1680. | test_array [0] = 0
  1681. |
  1682. | ;
  1683. | return 0;
  1684. | }
  1685. configure:10502: /home/seiza/buildroot/toolchain_build_mipsel/gcc-4.2.1-final/./gcc/xgcc -B/home/seiza/buildroot/toolchain_build_mipsel/gcc-4.2.1-final/./gcc/ -B/usr/mipsel-linux-uclibc/bin/ -B/usr/mipsel-linux-uclibc/lib/ -isystem /usr/mipsel-linux-uclibc/include -isystem /usr/mipsel-linux-uclibc/sys-include -c -g -Os -fno-jump-tables -include /home/seiza/buildroot/toolchain_build_mipsel/gcc-4.2.1/libgomp/config/posix/omp-lock.h conftest.c >&5
  1686. conftest.c: In function 'main':
  1687. conftest.c:31: error: size of array 'test_array' is negative
  1688. configure:10508: $? = 1
  1689. configure: failed program was:
  1690. | /* confdefs.h. */
  1691. |
  1692. | #define PACKAGE_NAME "GNU OpenMP Runtime Library"
  1693. | #define PACKAGE_TARNAME "libgomp"
  1694. | #define PACKAGE_VERSION "1.0"
  1695. | #define PACKAGE_STRING "GNU OpenMP Runtime Library 1.0"
  1696. | #define PACKAGE_BUGREPORT ""
  1697. | #define PACKAGE "libgomp"
  1698. | #define VERSION "1.0"
  1699. | #define STDC_HEADERS 1
  1700. | #define TIME_WITH_SYS_TIME 1
  1701. | #define HAVE_SYS_TYPES_H 1
  1702. | #define HAVE_SYS_STAT_H 1
  1703. | #define HAVE_STDLIB_H 1
  1704. | #define HAVE_STRING_H 1
  1705. | #define HAVE_MEMORY_H 1
  1706. | #define HAVE_STRINGS_H 1
  1707. | #define HAVE_INTTYPES_H 1
  1708. | #define HAVE_STDINT_H 1
  1709. | #define HAVE_UNISTD_H 1
  1710. | #define HAVE_UNISTD_H 1
  1711. | #define HAVE_SEMAPHORE_H 1
  1712. | #define HAVE_SYS_TIME_H 1
  1713. | #define HAVE_TLS 1
  1714. | #define HAVE_ATTRIBUTE_VISIBILITY 1
  1715. | /* end confdefs.h. */
  1716. |
  1717. | int
  1718. | main ()
  1719. | {
  1720. | static int test_array [1 - 2 * !((sizeof (omp_nest_lock_t)) <= 15)];
  1721. | test_array [0] = 0
  1722. |
  1723. | ;
  1724. | return 0;
  1725. | }
  1726. configure:10502: /home/seiza/buildroot/toolchain_build_mipsel/gcc-4.2.1-final/./gcc/xgcc -B/home/seiza/buildroot/toolchain_build_mipsel/gcc-4.2.1-final/./gcc/ -B/usr/mipsel-linux-uclibc/bin/ -B/usr/mipsel-linux-uclibc/lib/ -isystem /usr/mipsel-linux-uclibc/include -isystem /usr/mipsel-linux-uclibc/sys-include -c -g -Os -fno-jump-tables -include /home/seiza/buildroot/toolchain_build_mipsel/gcc-4.2.1/libgomp/config/posix/omp-lock.h conftest.c >&5
  1727. configure:10508: $? = 0
  1728. configure:10512: test -z
  1729. || test ! -s conftest.err
  1730. configure:10515: $? = 0
  1731. configure:10518: test -s conftest.o
  1732. configure:10521: $? = 0
  1733. configure:10665: /home/seiza/buildroot/toolchain_build_mipsel/gcc-4.2.1-final/./gcc/xgcc -B/home/seiza/buildroot/toolchain_build_mipsel/gcc-4.2.1-final/./gcc/ -B/usr/mipsel-linux-uclibc/bin/ -B/usr/mipsel-linux-uclibc/lib/ -isystem /usr/mipsel-linux-uclibc/include -isystem /usr/mipsel-linux-uclibc/sys-include -c -g -Os -fno-jump-tables -include /home/seiza/buildroot/toolchain_build_mipsel/gcc-4.2.1/libgomp/config/posix/omp-lock.h conftest.c >&5
  1734. conftest.c: In function 'main':
  1735. conftest.c:31: error: size of array 'test_array' is negative
  1736. configure:10671: $? = 1
  1737. configure: failed program was:
  1738. | /* confdefs.h. */
  1739. |
  1740. | #define PACKAGE_NAME "GNU OpenMP Runtime Library"
  1741. | #define PACKAGE_TARNAME "libgomp"
  1742. | #define PACKAGE_VERSION "1.0"
  1743. | #define PACKAGE_STRING "GNU OpenMP Runtime Library 1.0"
  1744. | #define PACKAGE_BUGREPORT ""
  1745. | #define PACKAGE "libgomp"
  1746. | #define VERSION "1.0"
  1747. | #define STDC_HEADERS 1
  1748. | #define TIME_WITH_SYS_TIME 1
  1749. | #define HAVE_SYS_TYPES_H 1
  1750. | #define HAVE_SYS_STAT_H 1
  1751. | #define HAVE_STDLIB_H 1
  1752. | #define HAVE_STRING_H 1
  1753. | #define HAVE_MEMORY_H 1
  1754. | #define HAVE_STRINGS_H 1
  1755. | #define HAVE_INTTYPES_H 1
  1756. | #define HAVE_STDINT_H 1
  1757. | #define HAVE_UNISTD_H 1
  1758. | #define HAVE_UNISTD_H 1
  1759. | #define HAVE_SEMAPHORE_H 1
  1760. | #define HAVE_SYS_TIME_H 1
  1761. | #define HAVE_TLS 1
  1762. | #define HAVE_ATTRIBUTE_VISIBILITY 1
  1763. | /* end confdefs.h. */
  1764. |
  1765. | int
  1766. | main ()
  1767. | {
  1768. | static int test_array [1 - 2 * !((sizeof (omp_nest_lock_t)) <= 23)];
  1769. | test_array [0] = 0
  1770. |
  1771. | ;
  1772. | return 0;
  1773. | }
  1774. configure:10665: /home/seiza/buildroot/toolchain_build_mipsel/gcc-4.2.1-final/./gcc/xgcc -B/home/seiza/buildroot/toolchain_build_mipsel/gcc-4.2.1-final/./gcc/ -B/usr/mipsel-linux-uclibc/bin/ -B/usr/mipsel-linux-uclibc/lib/ -isystem /usr/mipsel-linux-uclibc/include -isystem /usr/mipsel-linux-uclibc/sys-include -c -g -Os -fno-jump-tables -include /home/seiza/buildroot/toolchain_build_mipsel/gcc-4.2.1/libgomp/config/posix/omp-lock.h conftest.c >&5
  1775. conftest.c: In function 'main':
  1776. conftest.c:31: error: size of array 'test_array' is negative
  1777. configure:10671: $? = 1
  1778. configure: failed program was:
  1779. | /* confdefs.h. */
  1780. |
  1781. | #define PACKAGE_NAME "GNU OpenMP Runtime Library"
  1782. | #define PACKAGE_TARNAME "libgomp"
  1783. | #define PACKAGE_VERSION "1.0"
  1784. | #define PACKAGE_STRING "GNU OpenMP Runtime Library 1.0"
  1785. | #define PACKAGE_BUGREPORT ""
  1786. | #define PACKAGE "libgomp"
  1787. | #define VERSION "1.0"
  1788. | #define STDC_HEADERS 1
  1789. | #define TIME_WITH_SYS_TIME 1
  1790. | #define HAVE_SYS_TYPES_H 1
  1791. | #define HAVE_SYS_STAT_H 1
  1792. | #define HAVE_STDLIB_H 1
  1793. | #define HAVE_STRING_H 1
  1794. | #define HAVE_MEMORY_H 1
  1795. | #define HAVE_STRINGS_H 1
  1796. | #define HAVE_INTTYPES_H 1
  1797. | #define HAVE_STDINT_H 1
  1798. | #define HAVE_UNISTD_H 1
  1799. | #define HAVE_UNISTD_H 1
  1800. | #define HAVE_SEMAPHORE_H 1
  1801. | #define HAVE_SYS_TIME_H 1
  1802. | #define HAVE_TLS 1
  1803. | #define HAVE_ATTRIBUTE_VISIBILITY 1
  1804. | /* end confdefs.h. */
  1805. |
  1806. | int
  1807. | main ()
  1808. | {
  1809. | static int test_array [1 - 2 * !((sizeof (omp_nest_lock_t)) <= 27)];
  1810. | test_array [0] = 0
  1811. |
  1812. | ;
  1813. | return 0;
  1814. | }
  1815. configure:10665: /home/seiza/buildroot/toolchain_build_mipsel/gcc-4.2.1-final/./gcc/xgcc -B/home/seiza/buildroot/toolchain_build_mipsel/gcc-4.2.1-final/./gcc/ -B/usr/mipsel-linux-uclibc/bin/ -B/usr/mipsel-linux-uclibc/lib/ -isystem /usr/mipsel-linux-uclibc/include -isystem /usr/mipsel-linux-uclibc/sys-include -c -g -Os -fno-jump-tables -include /home/seiza/buildroot/toolchain_build_mipsel/gcc-4.2.1/libgomp/config/posix/omp-lock.h conftest.c >&5
  1816. configure:10671: $? = 0
  1817. configure:10675: test -z
  1818. || test ! -s conftest.err
  1819. configure:10678: $? = 0
  1820. configure:10681: test -s conftest.o
  1821. configure:10684: $? = 0
  1822. configure:10665: /home/seiza/buildroot/toolchain_build_mipsel/gcc-4.2.1-final/./gcc/xgcc -B/home/seiza/buildroot/toolchain_build_mipsel/gcc-4.2.1-final/./gcc/ -B/usr/mipsel-linux-uclibc/bin/ -B/usr/mipsel-linux-uclibc/lib/ -isystem /usr/mipsel-linux-uclibc/include -isystem /usr/mipsel-linux-uclibc/sys-include -c -g -Os -fno-jump-tables -include /home/seiza/buildroot/toolchain_build_mipsel/gcc-4.2.1/libgomp/config/posix/omp-lock.h conftest.c >&5
  1823. configure:10671: $? = 0
  1824. configure:10675: test -z
  1825. || test ! -s conftest.err
  1826. configure:10678: $? = 0
  1827. configure:10681: test -s conftest.o
  1828. configure:10684: $? = 0
  1829. configure:10787: /home/seiza/buildroot/toolchain_build_mipsel/gcc-4.2.1-final/./gcc/xgcc -B/home/seiza/buildroot/toolchain_build_mipsel/gcc-4.2.1-final/./gcc/ -B/usr/mipsel-linux-uclibc/bin/ -B/usr/mipsel-linux-uclibc/lib/ -isystem /usr/mipsel-linux-uclibc/include -isystem /usr/mipsel-linux-uclibc/sys-include -c -g -Os -fno-jump-tables -include /home/seiza/buildroot/toolchain_build_mipsel/gcc-4.2.1/libgomp/config/posix/omp-lock.h conftest.c >&5
  1830. configure:10793: $? = 0
  1831. configure:10797: test -z
  1832. || test ! -s conftest.err
  1833. configure:10800: $? = 0
  1834. configure:10803: test -s conftest.o
  1835. configure:10806: $? = 0
  1836. configure:10828: /home/seiza/buildroot/toolchain_build_mipsel/gcc-4.2.1-final/./gcc/xgcc -B/home/seiza/buildroot/toolchain_build_mipsel/gcc-4.2.1-final/./gcc/ -B/usr/mipsel-linux-uclibc/bin/ -B/usr/mipsel-linux-uclibc/lib/ -isystem /usr/mipsel-linux-uclibc/include -isystem /usr/mipsel-linux-uclibc/sys-include -c -g -Os -fno-jump-tables -include /home/seiza/buildroot/toolchain_build_mipsel/gcc-4.2.1/libgomp/config/posix/omp-lock.h conftest.c >&5
  1837. conftest.c: In function 'main':
  1838. conftest.c:31: error: size of array 'test_array' is negative
  1839. configure:10834: $? = 1
  1840. configure: failed program was:
  1841. | /* confdefs.h. */
  1842. |
  1843. | #define PACKAGE_NAME "GNU OpenMP Runtime Library"
  1844. | #define PACKAGE_TARNAME "libgomp"
  1845. | #define PACKAGE_VERSION "1.0"
  1846. | #define PACKAGE_STRING "GNU OpenMP Runtime Library 1.0"
  1847. | #define PACKAGE_BUGREPORT ""
  1848. | #define PACKAGE "libgomp"
  1849. | #define VERSION "1.0"
  1850. | #define STDC_HEADERS 1
  1851. | #define TIME_WITH_SYS_TIME 1
  1852. | #define HAVE_SYS_TYPES_H 1
  1853. | #define HAVE_SYS_STAT_H 1
  1854. | #define HAVE_STDLIB_H 1
  1855. | #define HAVE_STRING_H 1
  1856. | #define HAVE_MEMORY_H 1
  1857. | #define HAVE_STRINGS_H 1
  1858. | #define HAVE_INTTYPES_H 1
  1859. | #define HAVE_STDINT_H 1
  1860. | #define HAVE_UNISTD_H 1
  1861. | #define HAVE_UNISTD_H 1
  1862. | #define HAVE_SEMAPHORE_H 1
  1863. | #define HAVE_SYS_TIME_H 1
  1864. | #define HAVE_TLS 1
  1865. | #define HAVE_ATTRIBUTE_VISIBILITY 1
  1866. | /* end confdefs.h. */
  1867. |
  1868. | int
  1869. | main ()
  1870. | {
  1871. | static int test_array [1 - 2 * !((__alignof (omp_nest_lock_t)) <= 0)];
  1872. | test_array [0] = 0
  1873. |
  1874. | ;
  1875. | return 0;
  1876. | }
  1877. configure:10828: /home/seiza/buildroot/toolchain_build_mipsel/gcc-4.2.1-final/./gcc/xgcc -B/home/seiza/buildroot/toolchain_build_mipsel/gcc-4.2.1-final/./gcc/ -B/usr/mipsel-linux-uclibc/bin/ -B/usr/mipsel-linux-uclibc/lib/ -isystem /usr/mipsel-linux-uclibc/include -isystem /usr/mipsel-linux-uclibc/sys-include -c -g -Os -fno-jump-tables -include /home/seiza/buildroot/toolchain_build_mipsel/gcc-4.2.1/libgomp/config/posix/omp-lock.h conftest.c >&5
  1878. conftest.c: In function 'main':
  1879. conftest.c:31: error: size of array 'test_array' is negative
  1880. configure:10834: $? = 1
  1881. configure: failed program was:
  1882. | /* confdefs.h. */
  1883. |
  1884. | #define PACKAGE_NAME "GNU OpenMP Runtime Library"
  1885. | #define PACKAGE_TARNAME "libgomp"
  1886. | #define PACKAGE_VERSION "1.0"
  1887. | #define PACKAGE_STRING "GNU OpenMP Runtime Library 1.0"
  1888. | #define PACKAGE_BUGREPORT ""
  1889. | #define PACKAGE "libgomp"
  1890. | #define VERSION "1.0"
  1891. | #define STDC_HEADERS 1
  1892. | #define TIME_WITH_SYS_TIME 1
  1893. | #define HAVE_SYS_TYPES_H 1
  1894. | #define HAVE_SYS_STAT_H 1
  1895. | #define HAVE_STDLIB_H 1
  1896. | #define HAVE_STRING_H 1
  1897. | #define HAVE_MEMORY_H 1
  1898. | #define HAVE_STRINGS_H 1
  1899. | #define HAVE_INTTYPES_H 1
  1900. | #define HAVE_STDINT_H 1
  1901. | #define HAVE_UNISTD_H 1
  1902. | #define HAVE_UNISTD_H 1
  1903. | #define HAVE_SEMAPHORE_H 1
  1904. | #define HAVE_SYS_TIME_H 1
  1905. | #define HAVE_TLS 1
  1906. | #define HAVE_ATTRIBUTE_VISIBILITY 1
  1907. | /* end confdefs.h. */
  1908. |
  1909. | int
  1910. | main ()
  1911. | {
  1912. | static int test_array [1 - 2 * !((__alignof (omp_nest_lock_t)) <= 1)];
  1913. | test_array [0] = 0
  1914. |
  1915. | ;
  1916. | return 0;
  1917. | }
  1918. configure:10828: /home/seiza/buildroot/toolchain_build_mipsel/gcc-4.2.1-final/./gcc/xgcc -B/home/seiza/buildroot/toolchain_build_mipsel/gcc-4.2.1-final/./gcc/ -B/usr/mipsel-linux-uclibc/bin/ -B/usr/mipsel-linux-uclibc/lib/ -isystem /usr/mipsel-linux-uclibc/include -isystem /usr/mipsel-linux-uclibc/sys-include -c -g -Os -fno-jump-tables -include /home/seiza/buildroot/toolchain_build_mipsel/gcc-4.2.1/libgomp/config/posix/omp-lock.h conftest.c >&5
  1919. conftest.c: In function 'main':
  1920. conftest.c:31: error: size of array 'test_array' is negative
  1921. configure:10834: $? = 1
  1922. configure: failed program was:
  1923. | /* confdefs.h. */
  1924. |
  1925. | #define PACKAGE_NAME "GNU OpenMP Runtime Library"
  1926. | #define PACKAGE_TARNAME "libgomp"
  1927. | #define PACKAGE_VERSION "1.0"
  1928. | #define PACKAGE_STRING "GNU OpenMP Runtime Library 1.0"
  1929. | #define PACKAGE_BUGREPORT ""
  1930. | #define PACKAGE "libgomp"
  1931. | #define VERSION "1.0"
  1932. | #define STDC_HEADERS 1
  1933. | #define TIME_WITH_SYS_TIME 1
  1934. | #define HAVE_SYS_TYPES_H 1
  1935. | #define HAVE_SYS_STAT_H 1
  1936. | #define HAVE_STDLIB_H 1
  1937. | #define HAVE_STRING_H 1
  1938. | #define HAVE_MEMORY_H 1
  1939. | #define HAVE_STRINGS_H 1
  1940. | #define HAVE_INTTYPES_H 1
  1941. | #define HAVE_STDINT_H 1
  1942. | #define HAVE_UNISTD_H 1
  1943. | #define HAVE_UNISTD_H 1
  1944. | #define HAVE_SEMAPHORE_H 1
  1945. | #define HAVE_SYS_TIME_H 1
  1946. | #define HAVE_TLS 1
  1947. | #define HAVE_ATTRIBUTE_VISIBILITY 1
  1948. | /* end confdefs.h. */
  1949. |
  1950. | int
  1951. | main ()
  1952. | {
  1953. | static int test_array [1 - 2 * !((__alignof (omp_nest_lock_t)) <= 3)];
  1954. | test_array [0] = 0
  1955. |
  1956. | ;
  1957. | return 0;
  1958. | }
  1959. configure:10828: /home/seiza/buildroot/toolchain_build_mipsel/gcc-4.2.1-final/./gcc/xgcc -B/home/seiza/buildroot/toolchain_build_mipsel/gcc-4.2.1-final/./gcc/ -B/usr/mipsel-linux-uclibc/bin/ -B/usr/mipsel-linux-uclibc/lib/ -isystem /usr/mipsel-linux-uclibc/include -isystem /usr/mipsel-linux-uclibc/sys-include -c -g -Os -fno-jump-tables -include /home/seiza/buildroot/toolchain_build_mipsel/gcc-4.2.1/libgomp/config/posix/omp-lock.h conftest.c >&5
  1960. configure:10834: $? = 0
  1961. configure:10838: test -z
  1962. || test ! -s conftest.err
  1963. configure:10841: $? = 0
  1964. configure:10844: test -s conftest.o
  1965. configure:10847: $? = 0
  1966. configure:10991: /home/seiza/buildroot/toolchain_build_mipsel/gcc-4.2.1-final/./gcc/xgcc -B/home/seiza/buildroot/toolchain_build_mipsel/gcc-4.2.1-final/./gcc/ -B/usr/mipsel-linux-uclibc/bin/ -B/usr/mipsel-linux-uclibc/lib/ -isystem /usr/mipsel-linux-uclibc/include -isystem /usr/mipsel-linux-uclibc/sys-include -c -g -Os -fno-jump-tables -include /home/seiza/buildroot/toolchain_build_mipsel/gcc-4.2.1/libgomp/config/posix/omp-lock.h conftest.c >&5
  1967. configure:10997: $? = 0
  1968. configure:11001: test -z
  1969. || test ! -s conftest.err
  1970. configure:11004: $? = 0
  1971. configure:11007: test -s conftest.o
  1972. configure:11010: $? = 0
  1973. configure:10991: /home/seiza/buildroot/toolchain_build_mipsel/gcc-4.2.1-final/./gcc/xgcc -B/home/seiza/buildroot/toolchain_build_mipsel/gcc-4.2.1-final/./gcc/ -B/usr/mipsel-linux-uclibc/bin/ -B/usr/mipsel-linux-uclibc/lib/ -isystem /usr/mipsel-linux-uclibc/include -isystem /usr/mipsel-linux-uclibc/sys-include -c -g -Os -fno-jump-tables -include /home/seiza/buildroot/toolchain_build_mipsel/gcc-4.2.1/libgomp/config/posix/omp-lock.h conftest.c >&5
  1974. configure:10997: $? = 0
  1975. configure:11001: test -z
  1976. || test ! -s conftest.err
  1977. configure:11004: $? = 0
  1978. configure:11007: test -s conftest.o
  1979. configure:11010: $? = 0
  1980. configure:11264: creating ./config.status
  1981.  
  1982. ## ---------------------- ##
  1983. ## Running config.status. ##
  1984. ## ---------------------- ##
  1985.  
  1986. This file was extended by GNU OpenMP Runtime Library config.status 1.0, which was
  1987. generated by GNU Autoconf 2.59. Invocation command line was
  1988.  
  1989. CONFIG_FILES =
  1990. CONFIG_HEADERS =
  1991. CONFIG_LINKS =
  1992. CONFIG_COMMANDS =
  1993. $ ./config.status
  1994.  
  1995. on seiza-desktop
  1996.  
  1997. config.status:777: creating omp.h
  1998. config.status:777: creating omp_lib.h
  1999. config.status:777: creating omp_lib.f90
  2000. config.status:777: creating libgomp_f.h
  2001. config.status:777: creating Makefile
  2002. config.status:777: creating testsuite/Makefile
  2003. config.status:777: creating libgomp.spec
  2004. config.status:874: creating config.h
  2005. config.status:1170: executing default-1 commands
  2006. config.status:1170: executing depfiles commands
  2007. config.status:1170: executing gstdint.h commands
  2008.  
  2009. ## ---------------- ##
  2010. ## Cache variables. ##
  2011. ## ---------------- ##
  2012.  
  2013. ac_cv_archive_cmds_needs_lc=no
  2014. ac_cv_build=x86_64-pc-linux-gnu
  2015. ac_cv_build_alias=x86_64-pc-linux-gnu
  2016. ac_cv_c_compiler_gnu=yes
  2017. ac_cv_env_CPPFLAGS_set=set
  2018. ac_cv_env_CPPFLAGS_value=
  2019. ac_cv_env_CPP_set=
  2020. ac_cv_env_CPP_value=
  2021. ac_cv_env_FCFLAGS_set=
  2022. ac_cv_env_FCFLAGS_value=
  2023. ac_cv_env_FC_set=
  2024. ac_cv_env_FC_value=
  2025. ac_cv_env_LDFLAGS_set=set
  2026. ac_cv_env_LDFLAGS_value=
  2027. ac_cv_env_build_alias_set=set
  2028. ac_cv_env_build_alias_value=x86_64-pc-linux-gnu
  2029. ac_cv_env_host_alias_set=set
  2030. ac_cv_env_host_alias_value=mipsel-linux-uclibc
  2031. ac_cv_env_target_alias_set=set
  2032. ac_cv_env_target_alias_value=mipsel-linux-uclibc
  2033. ac_cv_exeext=
  2034. ac_cv_fc_compiler_gnu=no
  2035. ac_cv_func_clock_gettime=no
  2036. ac_cv_func_getloadavg=no
  2037. ac_cv_header_inttypes_h=yes
  2038. ac_cv_header_memory_h=yes
  2039. ac_cv_header_semaphore_h=yes
  2040. ac_cv_header_stdc=yes
  2041. ac_cv_header_stdint_h=yes
  2042. ac_cv_header_stdlib_h=yes
  2043. ac_cv_header_string_h=yes
  2044. ac_cv_header_strings_h=yes
  2045. ac_cv_header_sys_loadavg_h=no
  2046. ac_cv_header_sys_stat_h=yes
  2047. ac_cv_header_sys_time_h=yes
  2048. ac_cv_header_sys_types_h=yes
  2049. ac_cv_header_time=yes
  2050. ac_cv_header_unistd_h=yes
  2051. ac_cv_host=mipsel-unknown-linux-uclibc
  2052. ac_cv_host_alias=mipsel-linux-uclibc
  2053. ac_cv_lib_rt_clock_gettime=no
  2054. ac_cv_objext=o
  2055. ac_cv_path_PERL=/usr/bin/perl
  2056. ac_cv_prog_AR=/home/seiza/buildroot/build_mipsel/staging_dir/usr/mipsel-linux-uclibc/bin/ar
  2057. ac_cv_prog_AWK=mawk
  2058. ac_cv_prog_CC='/home/seiza/buildroot/toolchain_build_mipsel/gcc-4.2.1-final/./gcc/xgcc -B/home/seiza/buildroot/toolchain_build_mipsel/gcc-4.2.1-final/./gcc/ -B/usr/mipsel-linux-uclibc/bin/ -B/usr/mipsel-linux-uclibc/lib/ -isystem /usr/mipsel-linux-uclibc/include -isystem /usr/mipsel-linux-uclibc/sys-include'
  2059. ac_cv_prog_CPP='/home/seiza/buildroot/toolchain_build_mipsel/gcc-4.2.1-final/./gcc/xgcc -B/home/seiza/buildroot/toolchain_build_mipsel/gcc-4.2.1-final/./gcc/ -B/usr/mipsel-linux-uclibc/bin/ -B/usr/mipsel-linux-uclibc/lib/ -isystem /usr/mipsel-linux-uclibc/include -isystem /usr/mipsel-linux-uclibc/sys-include -E'
  2060. ac_cv_prog_FC='mipsel-linux-uclibc-gfortran -B/usr/mipsel-linux-uclibc/bin/ -B/usr/mipsel-linux-uclibc/lib/ -isystem /usr/mipsel-linux-uclibc/include -isystem /usr/mipsel-linux-uclibc/sys-include'
  2061. ac_cv_prog_MAKEINFO='true --split-size=5000000'
  2062. ac_cv_prog_RANLIB=/home/seiza/buildroot/build_mipsel/staging_dir/usr/mipsel-linux-uclibc/bin/ranlib
  2063. ac_cv_prog_STRIP=/home/seiza/buildroot/build_mipsel/staging_dir/usr/mipsel-linux-uclibc/bin/strip
  2064. ac_cv_prog_cc_can_build_shared=yes
  2065. ac_cv_prog_cc_g=yes
  2066. ac_cv_prog_cc_no_builtin=
  2067. ac_cv_prog_cc_pic=' -fPIC -DPIC'
  2068. ac_cv_prog_cc_pic_works=yes
  2069. ac_cv_prog_cc_shlib=
  2070. ac_cv_prog_cc_static=-static
  2071. ac_cv_prog_cc_static_works=yes
  2072. ac_cv_prog_cc_stdc=
  2073. ac_cv_prog_cc_wl=-Wl,
  2074. ac_cv_prog_egrep='grep -E'
  2075. ac_cv_prog_fc_g=no
  2076. ac_cv_prog_make__usr_bin_make_set=yes
  2077. ac_cv_target=mipsel-unknown-linux-uclibc
  2078. ac_cv_target_alias=mipsel-linux-uclibc
  2079. ac_cv_type_int_fast32_t=yes
  2080. ac_cv_type_int_least32_t=yes
  2081. ac_cv_type_u_int64_t=no
  2082. ac_cv_type_uint64_t=yes
  2083. ac_cv_type_uintmax_t=yes
  2084. ac_cv_type_uintptr_t=yes
  2085. acx_cv_header_stdint=stdint.h
  2086. acx_cv_header_stdint_kind='(already complete)'
  2087. am_cv_CC_dependencies_compiler_type=gcc3
  2088. gcc_cv_prog_makeinfo_modern=no
  2089. lt_cv_compiler_c_o=yes
  2090. lt_cv_deplibs_check_method=pass_all
  2091. lt_cv_file_magic_cmd='$MAGIC_CMD'
  2092. lt_cv_file_magic_test_file=
  2093. lt_cv_ld_reload_flag=-r
  2094. lt_cv_path_LD=/home/seiza/buildroot/toolchain_build_mipsel/gcc-4.2.1-final/./gcc/collect-ld
  2095. lt_cv_path_NM=/home/seiza/buildroot/toolchain_build_mipsel/gcc-4.2.1-final/./gcc/nm
  2096. lt_cv_prog_gnu_ld=yes
  2097. lt_cv_sys_max_cmd_len=49153
  2098.  
  2099. ## ----------------- ##
  2100. ## Output variables. ##
  2101. ## ----------------- ##
  2102.  
  2103. ACLOCAL='${SHELL} /home/seiza/buildroot/toolchain_build_mipsel/gcc-4.2.1/missing --run aclocal-1.9'
  2104. AMDEPBACKSLASH='\'
  2105. AMDEP_FALSE='#'
  2106. AMDEP_TRUE=''
  2107. AMTAR='${SHELL} /home/seiza/buildroot/toolchain_build_mipsel/gcc-4.2.1/missing --run tar'
  2108. AR='/home/seiza/buildroot/build_mipsel/staging_dir/usr/mipsel-linux-uclibc/bin/ar'
  2109. AUTOCONF='${SHELL} /home/seiza/buildroot/toolchain_build_mipsel/gcc-4.2.1/missing --run autoconf'
  2110. AUTOHEADER='${SHELL} /home/seiza/buildroot/toolchain_build_mipsel/gcc-4.2.1/missing --run autoheader'
  2111. AUTOMAKE='${SHELL} /home/seiza/buildroot/toolchain_build_mipsel/gcc-4.2.1/missing --run automake-1.9'
  2112. AWK='mawk'
  2113. BUILD_INFO_FALSE=''
  2114. BUILD_INFO_TRUE='#'
  2115. CC='/home/seiza/buildroot/toolchain_build_mipsel/gcc-4.2.1-final/./gcc/xgcc -B/home/seiza/buildroot/toolchain_build_mipsel/gcc-4.2.1-final/./gcc/ -B/usr/mipsel-linux-uclibc/bin/ -B/usr/mipsel-linux-uclibc/lib/ -isystem /usr/mipsel-linux-uclibc/include -isystem /usr/mipsel-linux-uclibc/sys-include'
  2116. CCDEPMODE='depmode=gcc3'
  2117. CFLAGS='-g -Os -fno-jump-tables'
  2118. CPP='/home/seiza/buildroot/toolchain_build_mipsel/gcc-4.2.1-final/./gcc/xgcc -B/home/seiza/buildroot/toolchain_build_mipsel/gcc-4.2.1-final/./gcc/ -B/usr/mipsel-linux-uclibc/bin/ -B/usr/mipsel-linux-uclibc/lib/ -isystem /usr/mipsel-linux-uclibc/include -isystem /usr/mipsel-linux-uclibc/sys-include -E'
  2119. CPPFLAGS=''
  2120. CYGPATH_W='echo'
  2121. DEFS='-DHAVE_CONFIG_H'
  2122. DEPDIR='.deps'
  2123. ECHO_C=''
  2124. ECHO_N='-n'
  2125. ECHO_T=''
  2126. EGREP='grep -E'
  2127. EXEEXT=''
  2128. FC='mipsel-linux-uclibc-gfortran -B/usr/mipsel-linux-uclibc/bin/ -B/usr/mipsel-linux-uclibc/lib/ -isystem /usr/mipsel-linux-uclibc/include -isystem /usr/mipsel-linux-uclibc/sys-include'
  2129. FCFLAGS=' -Wall'
  2130. GENINSRC_FALSE=''
  2131. GENINSRC_TRUE='#'
  2132. INSTALL_DATA='/usr/bin/install -c -m 644'
  2133. INSTALL_PROGRAM='/usr/bin/install -c'
  2134. INSTALL_SCRIPT='/usr/bin/install -c'
  2135. INSTALL_STRIP_PROGRAM='${SHELL} $(install_sh) -c -s'
  2136. LDFLAGS=''
  2137. LIBGOMP_BUILD_VERSIONED_SHLIB_FALSE=''
  2138. LIBGOMP_BUILD_VERSIONED_SHLIB_TRUE='#'
  2139. LIBOBJS=''
  2140. LIBS='-lpthread '
  2141. LIBTOOL='$(SHELL) $(top_builddir)/libtool'
  2142. LN_S='ln -s'
  2143. LTLIBOBJS=''
  2144. MAINT='#'
  2145. MAINTAINER_MODE_FALSE=''
  2146. MAINTAINER_MODE_TRUE='#'
  2147. MAKEINFO='/bin/bash /home/seiza/buildroot/toolchain_build_mipsel/gcc-4.2.1/libgomp/../missing makeinfo'
  2148. OBJEXT='o'
  2149. OMP_LOCK_ALIGN='4'
  2150. OMP_LOCK_KIND='8'
  2151. OMP_LOCK_SIZE='24'
  2152. OMP_NEST_LOCK_ALIGN='4'
  2153. OMP_NEST_LOCK_KIND='8'
  2154. OMP_NEST_LOCK_SIZE='28'
  2155. OPT_LDFLAGS='-Wl,-O1 '
  2156. PACKAGE='libgomp'
  2157. PACKAGE_BUGREPORT=''
  2158. PACKAGE_NAME='GNU OpenMP Runtime Library'
  2159. PACKAGE_STRING='GNU OpenMP Runtime Library 1.0'
  2160. PACKAGE_TARNAME='libgomp'
  2161. PACKAGE_VERSION='1.0'
  2162. PATH_SEPARATOR=':'
  2163. PERL='/usr/bin/perl'
  2164. RANLIB='/home/seiza/buildroot/build_mipsel/staging_dir/usr/mipsel-linux-uclibc/bin/ranlib'
  2165. SECTION_LDFLAGS=''
  2166. SET_MAKE=''
  2167. SHELL='/bin/bash'
  2168. STRIP='/home/seiza/buildroot/build_mipsel/staging_dir/usr/mipsel-linux-uclibc/bin/strip'
  2169. USE_FORTRAN_FALSE=''
  2170. USE_FORTRAN_TRUE='#'
  2171. VERSION='1.0'
  2172. XCFLAGS=' -Wall -Werror -ftls-model=initial-exec'
  2173. XLDFLAGS=' -Wl,-z,nodlopen'
  2174. ac_ct_AR=''
  2175. ac_ct_CC=''
  2176. ac_ct_FC=''
  2177. ac_ct_RANLIB=''
  2178. ac_ct_STRIP=''
  2179. am__fastdepCC_FALSE='#'
  2180. am__fastdepCC_TRUE=''
  2181. am__include='include'
  2182. am__leading_dot='.'
  2183. am__quote=''
  2184. am__tar='${AMTAR} chof - "$$tardir"'
  2185. am__untar='${AMTAR} xf -'
  2186. bindir='${exec_prefix}/bin'
  2187. build='x86_64-pc-linux-gnu'
  2188. build_alias='x86_64-pc-linux-gnu'
  2189. build_cpu='x86_64'
  2190. build_os='linux-gnu'
  2191. build_vendor='pc'
  2192. config_path='posix'
  2193. datadir='${prefix}/share'
  2194. enable_shared='yes'
  2195. enable_static='yes'
  2196. exec_prefix='${prefix}'
  2197. host='mipsel-unknown-linux-uclibc'
  2198. host_alias='mipsel-linux-uclibc'
  2199. host_cpu='mipsel'
  2200. host_os='linux-uclibc'
  2201. host_vendor='unknown'
  2202. includedir='${prefix}/include'
  2203. infodir='${prefix}/info'
  2204. install_sh='/home/seiza/buildroot/toolchain_build_mipsel/gcc-4.2.1/install-sh'
  2205. libdir='${exec_prefix}/lib'
  2206. libexecdir='${exec_prefix}/libexec'
  2207. libtool_VERSION='1:0:0'
  2208. link_gomp='-lgomp %{static: -lpthread }'
  2209. localstatedir='${prefix}/var'
  2210. mandir='${prefix}/man'
  2211. mkdir_p='mkdir -p --'
  2212. multi_basedir='/home/seiza/buildroot/toolchain_build_mipsel/gcc-4.2.1/libgomp/..'
  2213. oldincludedir='/usr/include'
  2214. prefix='/usr'
  2215. program_transform_name='s,^,mipsel-linux-uclibc-,;'
  2216. sbindir='${exec_prefix}/sbin'
  2217. sharedstatedir='${prefix}/com'
  2218. sysconfdir='${prefix}/etc'
  2219. target='mipsel-unknown-linux-uclibc'
  2220. target_alias='mipsel-linux-uclibc'
  2221. target_cpu='mipsel'
  2222. target_os='linux-uclibc'
  2223. target_vendor='unknown'
  2224. toolexecdir='$(exec_prefix)/$(target_alias)'
  2225. toolexeclibdir='$(toolexecdir)/lib'
  2226.  
  2227. ## ----------- ##
  2228. ## confdefs.h. ##
  2229. ## ----------- ##
  2230.  
  2231. #define HAVE_ATTRIBUTE_VISIBILITY 1
  2232. #define HAVE_INTTYPES_H 1
  2233. #define HAVE_MEMORY_H 1
  2234. #define HAVE_SEMAPHORE_H 1
  2235. #define HAVE_STDINT_H 1
  2236. #define HAVE_STDLIB_H 1
  2237. #define HAVE_STRINGS_H 1
  2238. #define HAVE_STRING_H 1
  2239. #define HAVE_SYS_STAT_H 1
  2240. #define HAVE_SYS_TIME_H 1
  2241. #define HAVE_SYS_TYPES_H 1
  2242. #define HAVE_TLS 1
  2243. #define HAVE_UNISTD_H 1
  2244. #define HAVE_UNISTD_H 1
  2245. #define PACKAGE "libgomp"
  2246. #define PACKAGE_BUGREPORT ""
  2247. #define PACKAGE_NAME "GNU OpenMP Runtime Library"
  2248. #define PACKAGE_STRING "GNU OpenMP Runtime Library 1.0"
  2249. #define PACKAGE_TARNAME "libgomp"
  2250. #define PACKAGE_VERSION "1.0"
  2251. #define STDC_HEADERS 1
  2252. #define TIME_WITH_SYS_TIME 1
  2253. #define VERSION "1.0"
  2254.  
  2255. configure: exit 0
Advertisement
RAW Paste Data Copied
Advertisement