SHARE
TWEET

mycroft-suse-log

AnstLi Dec 11th, 2019 91 Never
Not a member of Pastebin yet? Sign Up, it unlocks many cool features!
  1. Installing packages...
  2.  Installing packages for OpenSUSE...(B
  3. Loading repository data...
  4. Reading installed packages...
  5. 'python3' is already installed.
  6. No update candidate for 'python3-3.6.9-lp150.2.14.1.x86_64'. The highest available version is already installed.
  7. 'pulseaudio' is already installed.
  8. No update candidate for 'pulseaudio-11.1-lp150.4.1.x86_64'. The highest available version is already installed.
  9. 'curl' is already installed.
  10. No update candidate for 'curl-7.60.0-lp150.2.28.1.x86_64'. The highest available version is already installed.
  11. 'pkg-config' is already installed.
  12. No update candidate for 'pkg-config-0.29.2-lp150.1.49.x86_64'. The highest available version is already installed.
  13. 'git' is already installed.
  14. No update candidate for 'git-2.16.4-lp150.2.9.1.x86_64'. The highest available version is already installed.
  15. 'libjpeg-devel' not found in package names. Trying capabilities.
  16. 'libjpeg62-devel' providing 'libjpeg-devel' is already installed.
  17. 'python3-devel' is already installed.
  18. No update candidate for 'python3-devel-3.6.9-lp150.2.14.1.x86_64'. The highest available version is already installed.
  19. 'libopenssl-devel' is already installed.
  20. No update candidate for 'libopenssl-devel-1.1.0i-lp150.6.1.noarch'. The highest available version is already installed.
  21. 'mpg123' is already installed.
  22. No update candidate for 'mpg123-1.25.10-lp150.1.1.x86_64'. The highest available version is already installed.
  23. 'libtool' is already installed.
  24. No update candidate for 'libtool-2.4.6-lp150.1.47.x86_64'. The highest available version is already installed.
  25. 'python3-curses' is already installed.
  26. No update candidate for 'python3-curses-3.6.9-lp150.2.14.1.x86_64'. The highest available version is already installed.
  27. 'autoconf' is already installed.
  28. No update candidate for 'autoconf-2.69-lp150.1.48.noarch'. The highest available version is already installed.
  29. 'automake' is already installed.
  30. No update candidate for 'automake-1.15.1-lp150.2.41.noarch'. The highest available version is already installed.
  31. 'swig' is already installed.
  32. No update candidate for 'swig-3.0.12-lp150.4.2.x86_64'. The highest available version is already installed.
  33. 'flac' is already installed.
  34. No update candidate for 'flac-1.3.2-lp150.2.3.1.x86_64'. The highest available version is already installed.
  35. 'bison' is already installed.
  36. No update candidate for 'bison-3.0.4-lp150.1.48.x86_64'. The highest available version is already installed.
  37. 'libffi-devel' is already installed.
  38. No update candidate for 'libffi-devel-3.2.1.git259-lp150.3.3.x86_64'. The highest available version is already installed.
  39. 'libicu-devel' is already installed.
  40. No update candidate for 'libicu-devel-60.2-lp150.1.4.x86_64'. The highest available version is already installed.
  41. 'portaudio-devel' is already installed.
  42. No update candidate for 'portaudio-devel-190600_20161030-lp150.1.12.x86_64'. The highest available version is already installed.
  43. 'libfann-devel' is already installed.
  44. No update candidate for 'libfann-devel-2.2.0-lp150.1.3.x86_64'. The highest available version is already installed.
  45. Resolving package dependencies...
  46.  
  47. Nothing to do.
  48. Loading repository data...
  49. Reading installed packages...
  50. 'pattern:devel_C_C++' is already installed.
  51. No update candidate for 'pattern:devel_C_C++-20170319-lp150.1.7.x86_64'. The highest available version is already installed.
  52. Resolving package dependencies...
  53.  
  54. Nothing to do.
  55. Collecting pip==18.0.0
  56.   Using cached https://files.pythonhosted.org/packages/5f/25/e52d3f31441505a5f3af41213346e5b6c221c9e086a166f3703d2ddaf940/pip-18.0-py2.py3-none-any.whl
  57. Installing collected packages: pip
  58.   Found existing installation: pip 18.0
  59.     Uninstalling pip-18.0:
  60.       Successfully uninstalled pip-18.0
  61. Successfully installed pip-18.0
  62. Requirement already satisfied: six==1.10.0 in ./.venv/lib/python3.7/site-packages (from -r requirements.txt (line 1)) (1.10.0)
  63. Requirement already satisfied: cryptography==2.6.1 in ./.venv/lib/python3.7/site-packages (from -r requirements.txt (line 2)) (2.6.1)
  64. Requirement already satisfied: requests==2.20.0 in ./.venv/lib/python3.7/site-packages (from -r requirements.txt (line 3)) (2.20.0)
  65. Requirement already satisfied: gTTS==2.0.4 in ./.venv/lib/python3.7/site-packages (from -r requirements.txt (line 4)) (2.0.4)
  66. Collecting PyAudio==0.2.11 (from -r requirements.txt (line 5))
  67.   Using cached https://files.pythonhosted.org/packages/ab/42/b4f04721c5c5bfc196ce156b3c768998ef8c0ae3654ed29ea5020c749a6b/PyAudio-0.2.11.tar.gz
  68. Collecting pyee==5.0.0 (from -r requirements.txt (line 6))
  69.   Using cached https://files.pythonhosted.org/packages/8e/06/10c18578e2d8b9cf9902f424f86d433c647ca55e82293100f53e6c0afab4/pyee-5.0.0-py2.py3-none-any.whl
  70. Collecting SpeechRecognition==3.8.1 (from -r requirements.txt (line 7))
  71.   Using cached https://files.pythonhosted.org/packages/26/e1/7f5678cd94ec1234269d23756dbdaa4c8cfaed973412f88ae8adf7893a50/SpeechRecognition-3.8.1-py2.py3-none-any.whl
  72. Collecting tornado==4.5.3 (from -r requirements.txt (line 8))
  73. Collecting websocket-client==0.54.0 (from -r requirements.txt (line 9))
  74.   Using cached https://files.pythonhosted.org/packages/26/2d/f749a5c82f6192d77ed061a38e02001afcba55fe8477336d26a950ab17ce/websocket_client-0.54.0-py2.py3-none-any.whl
  75. Collecting requests-futures==0.9.5 (from -r requirements.txt (line 10))
  76. Collecting pyalsaaudio==0.8.2 (from -r requirements.txt (line 11))
  77.   Using cached https://files.pythonhosted.org/packages/0d/99/1f48912b5ffccecdd0c0c477023f4eaf45ebac6c92bc1865c7142c570d6d/pyalsaaudio-0.8.2.tar.gz
  78. Collecting xmlrunner==1.7.7 (from -r requirements.txt (line 12))
  79. Collecting pyserial==3.0 (from -r requirements.txt (line 13))
  80. Collecting psutil==5.2.1 (from -r requirements.txt (line 14))
  81.   Using cached https://files.pythonhosted.org/packages/b8/47/c85fbcd23f40892db6ecc88782beb6ee66d22008c2f9821d777cb1984240/psutil-5.2.1.tar.gz
  82. Collecting pocketsphinx==0.1.0 (from -r requirements.txt (line 15))
  83.   Using cached https://files.pythonhosted.org/packages/25/73/1d4f4734e2afe72bec6756853e7cdcffbb05115045fcea471224537243bd/pocketsphinx-0.1.0.tar.gz
  84. Requirement already satisfied: inflection==0.3.1 in ./.venv/lib/python3.7/site-packages (from -r requirements.txt (line 16)) (0.3.1)
  85. Collecting pillow==6.2.1 (from -r requirements.txt (line 17))
  86.   Using cached https://files.pythonhosted.org/packages/89/3e/31c2e5385d7588016c6f7ac552e81c3fff2bef4bc61b6f82f8177752405c/Pillow-6.2.1-cp37-cp37m-manylinux1_x86_64.whl
  87. Collecting python-dateutil==2.6.0 (from -r requirements.txt (line 18))
  88.   Using cached https://files.pythonhosted.org/packages/40/8b/275015d7a9ec293cf1bbf55433258fbc9d0711890a7f6dc538bac7b86bce/python_dateutil-2.6.0-py2.py3-none-any.whl
  89. Collecting pychromecast==3.2.2 (from -r requirements.txt (line 19))
  90.   Using cached https://files.pythonhosted.org/packages/43/af/2bf0d4543e07662aa18e9e783cc3669732386445afe8098c040fb5ba2993/PyChromecast-3.2.2-py2.py3-none-any.whl
  91. Collecting python-vlc==1.1.2 (from -r requirements.txt (line 20))
  92. Collecting google-api-python-client==1.6.4 (from -r requirements.txt (line 21))
  93.   Using cached https://files.pythonhosted.org/packages/29/5e/389acdb859a5e6d0ec41edf8f9fd555f6a57f9ae79b74612eaa8e1163b9a/google_api_python_client-1.6.4-py2.py3-none-any.whl
  94. Collecting fasteners==0.14.1 (from -r requirements.txt (line 22))
  95.   Using cached https://files.pythonhosted.org/packages/14/3a/096c7ad18e102d4f219f5dd15951f9728ca5092a3385d2e8f79a7c1e1017/fasteners-0.14.1-py2.py3-none-any.whl
  96. Collecting PyYAML==3.13 (from -r requirements.txt (line 23))
  97. Collecting msm==0.8.3 (from -r requirements.txt (line 25))
  98. Collecting msk==0.3.13 (from -r requirements.txt (line 26))
  99. Collecting adapt-parser==0.3.3 (from -r requirements.txt (line 27))
  100. Collecting padatious==0.4.6 (from -r requirements.txt (line 28))
  101. Collecting fann2==1.0.7 (from -r requirements.txt (line 29))
  102.   Using cached https://files.pythonhosted.org/packages/a9/a3/af368a683a04850aa1bf2e097f17781eb26e7e7c269ddcecfcec5f2e05a3/fann2-1.0.7.tar.gz
  103. Collecting padaos==0.1.9 (from -r requirements.txt (line 30))
  104. Collecting precise-runner==0.2.1 (from -r requirements.txt (line 31))
  105. Collecting petact==0.1.2 (from -r requirements.txt (line 32))
  106. Requirement already satisfied: cffi!=1.11.3,>=1.8 in ./.venv/lib/python3.7/site-packages (from cryptography==2.6.1->-r requirements.txt (line 2)) (1.13.2)
  107. Requirement already satisfied: asn1crypto>=0.21.0 in ./.venv/lib/python3.7/site-packages (from cryptography==2.6.1->-r requirements.txt (line 2)) (1.2.0)
  108. Requirement already satisfied: chardet<3.1.0,>=3.0.2 in ./.venv/lib/python3.7/site-packages (from requests==2.20.0->-r requirements.txt (line 3)) (3.0.4)
  109. Requirement already satisfied: urllib3<1.25,>=1.21.1 in ./.venv/lib/python3.7/site-packages (from requests==2.20.0->-r requirements.txt (line 3)) (1.24.3)
  110. Requirement already satisfied: idna<2.8,>=2.5 in ./.venv/lib/python3.7/site-packages (from requests==2.20.0->-r requirements.txt (line 3)) (2.7)
  111. Requirement already satisfied: certifi>=2017.4.17 in ./.venv/lib/python3.7/site-packages (from requests==2.20.0->-r requirements.txt (line 3)) (2019.9.11)
  112. Requirement already satisfied: beautifulsoup4 in ./.venv/lib/python3.7/site-packages (from gTTS==2.0.4->-r requirements.txt (line 4)) (4.8.1)
  113. Requirement already satisfied: click in ./.venv/lib/python3.7/site-packages (from gTTS==2.0.4->-r requirements.txt (line 4)) (7.0)
  114. Requirement already satisfied: gtts-token>=1.1.3 in ./.venv/lib/python3.7/site-packages (from gTTS==2.0.4->-r requirements.txt (line 4)) (1.1.3)
  115. Collecting casttube>=0.2.0 (from pychromecast==3.2.2->-r requirements.txt (line 19))
  116.   Using cached https://files.pythonhosted.org/packages/31/ef/acf3646cf670d095cf29e1f21b7cfc4eb6f896d6dfe0f7264ed6a624e8c7/casttube-0.2.0-py3-none-any.whl
  117. Collecting protobuf>=3.0.0 (from pychromecast==3.2.2->-r requirements.txt (line 19))
  118.   Using cached https://files.pythonhosted.org/packages/c8/bd/9609c681f655c4b85f4e4f4c99d42b68bca63ad8891c6924ba6696dee0bb/protobuf-3.11.1-cp37-cp37m-manylinux1_x86_64.whl
  119. Collecting zeroconf>=0.17.7 (from pychromecast==3.2.2->-r requirements.txt (line 19))
  120.   Using cached https://files.pythonhosted.org/packages/43/25/b6746049834c7ede865c3a3079d7bdb6f0a3cebdd6997eb916be3a647440/zeroconf-0.24.0-py3-none-any.whl
  121. Collecting uritemplate<4dev,>=3.0.0 (from google-api-python-client==1.6.4->-r requirements.txt (line 21))
  122.   Using cached https://files.pythonhosted.org/packages/e5/7d/9d5a640c4f8bf2c8b1afc015e9a9d8de32e13c9016dcc4b0ec03481fb396/uritemplate-3.0.0-py2.py3-none-any.whl
  123. Collecting oauth2client<5.0.0dev,>=1.5.0 (from google-api-python-client==1.6.4->-r requirements.txt (line 21))
  124.   Using cached https://files.pythonhosted.org/packages/95/a9/4f25a14d23f0786b64875b91784607c2277eff25d48f915e39ff0cff505a/oauth2client-4.1.3-py2.py3-none-any.whl
  125. Collecting httplib2<1dev,>=0.9.2 (from google-api-python-client==1.6.4->-r requirements.txt (line 21))
  126.   Using cached https://files.pythonhosted.org/packages/d2/84/f97b9efdb17c9b73e133bdbf2b4bfd09cd0be655e36e3ee3c4bec9095048/httplib2-0.14.0-py3-none-any.whl
  127. Collecting monotonic>=0.1 (from fasteners==0.14.1->-r requirements.txt (line 22))
  128.   Using cached https://files.pythonhosted.org/packages/ac/aa/063eca6a416f397bd99552c534c6d11d57f58f2e94c14780f3bbf818c4cf/monotonic-1.5-py2.py3-none-any.whl
  129. Collecting GitPython (from msm==0.8.3->-r requirements.txt (line 25))
  130.   Using cached https://files.pythonhosted.org/packages/20/8c/4543981439d23c4ff65b2e62dddd767ebc84a8e664a9b67e840d1e2730d3/GitPython-3.0.5-py3-none-any.whl
  131. Collecting lazy (from msm==0.8.3->-r requirements.txt (line 25))
  132.   Using cached https://files.pythonhosted.org/packages/b8/06/9e1893ff24ca262950755292015dae2cb32082d19c9432a632747e9f7d43/lazy-1.4-py2.py3-none-any.whl
  133. Collecting pako (from msm==0.8.3->-r requirements.txt (line 25))
  134. Collecting typing (from msm==0.8.3->-r requirements.txt (line 25))
  135.   Using cached https://files.pythonhosted.org/packages/fe/2e/b480ee1b75e6d17d2993738670e75c1feeb9ff7f64452153cf018051cc92/typing-3.7.4.1-py3-none-any.whl
  136. Collecting pygithub (from msk==0.3.13->-r requirements.txt (line 26))
  137. Collecting xxhash (from padatious==0.4.6->-r requirements.txt (line 28))
  138.   Using cached https://files.pythonhosted.org/packages/50/b8/0adf955ec9f88dcab8e7cf4254e3b6c50c08ea63d95fea9b1cea2c9a48ac/xxhash-1.4.3-cp37-cp37m-manylinux1_x86_64.whl
  139. Requirement already satisfied: pycparser in ./.venv/lib/python3.7/site-packages (from cffi!=1.11.3,>=1.8->cryptography==2.6.1->-r requirements.txt (line 2)) (2.19)
  140. Requirement already satisfied: soupsieve>=1.2 in ./.venv/lib/python3.7/site-packages (from beautifulsoup4->gTTS==2.0.4->-r requirements.txt (line 4)) (1.9.5)
  141. Requirement already satisfied: setuptools in ./.venv/lib/python3.7/site-packages (from protobuf>=3.0.0->pychromecast==3.2.2->-r requirements.txt (line 19)) (41.6.0)
  142. Collecting ifaddr (from zeroconf>=0.17.7->pychromecast==3.2.2->-r requirements.txt (line 19))
  143. Collecting rsa>=3.1.4 (from oauth2client<5.0.0dev,>=1.5.0->google-api-python-client==1.6.4->-r requirements.txt (line 21))
  144.   Using cached https://files.pythonhosted.org/packages/02/e5/38518af393f7c214357079ce67a317307936896e961e35450b70fad2a9cf/rsa-4.0-py2.py3-none-any.whl
  145. Collecting pyasn1>=0.1.7 (from oauth2client<5.0.0dev,>=1.5.0->google-api-python-client==1.6.4->-r requirements.txt (line 21))
  146.   Using cached https://files.pythonhosted.org/packages/62/1e/a94a8d635fa3ce4cfc7f506003548d0a2447ae76fd5ca53932970fe3053f/pyasn1-0.4.8-py2.py3-none-any.whl
  147. Collecting pyasn1-modules>=0.0.5 (from oauth2client<5.0.0dev,>=1.5.0->google-api-python-client==1.6.4->-r requirements.txt (line 21))
  148.   Using cached https://files.pythonhosted.org/packages/52/50/bb4cefca37da63a0c52218ba2cb1b1c36110d84dcbae8aa48cd67c5e95c2/pyasn1_modules-0.2.7-py2.py3-none-any.whl
  149. Collecting gitdb2>=2.0.0 (from GitPython->msm==0.8.3->-r requirements.txt (line 25))
  150.   Using cached https://files.pythonhosted.org/packages/03/6c/99296f89bad2ef85626e1df9f677acbee8885bb043ad82ad3ed4746d2325/gitdb2-2.0.6-py2.py3-none-any.whl
  151. Collecting appdirs (from pako->msm==0.8.3->-r requirements.txt (line 25))
  152.   Using cached https://files.pythonhosted.org/packages/56/eb/810e700ed1349edde4cbdc1b2a21e28cdf115f9faf263f6bbf8447c1abf3/appdirs-1.4.3-py2.py3-none-any.whl
  153. Collecting pyjwt (from pygithub->msk==0.3.13->-r requirements.txt (line 26))
  154.   Using cached https://files.pythonhosted.org/packages/87/8b/6a9f14b5f781697e51259d81657e6048fd31a113229cf346880bb7545565/PyJWT-1.7.1-py2.py3-none-any.whl
  155. Collecting deprecated (from pygithub->msk==0.3.13->-r requirements.txt (line 26))
  156.   Using cached https://files.pythonhosted.org/packages/f6/89/62912e01f3cede11edcc0abf81298e3439d9c06c8dce644369380ed13f6d/Deprecated-1.2.7-py2.py3-none-any.whl
  157. Collecting smmap2>=2.0.0 (from gitdb2>=2.0.0->GitPython->msm==0.8.3->-r requirements.txt (line 25))
  158.   Using cached https://files.pythonhosted.org/packages/55/d2/866d45e3a121ee15a1dc013824d58072fd5c7799c9c34d01378eb262ca8f/smmap2-2.0.5-py2.py3-none-any.whl
  159. Collecting wrapt<2,>=1.10 (from deprecated->pygithub->msk==0.3.13->-r requirements.txt (line 26))
  160. Building wheels for collected packages: PyAudio, pyalsaaudio, psutil, pocketsphinx, fann2
  161.   Running setup.py bdist_wheel for PyAudio: started
  162.   Running setup.py bdist_wheel for PyAudio: finished with status 'error'
  163.   Complete output from command /home/stabitl/mycroft-core/.venv/bin/python -u -c "import setuptools, tokenize;__file__='/tmp/pip-install-ice0dklc/PyAudio/setup.py';f=getattr(tokenize, 'open', open)(__file__);code=f.read().replace('\r\n', '\n');f.close();exec(compile(code, __file__, 'exec'))" bdist_wheel -d /tmp/pip-wheel-5sgyxnrn --python-tag cp37:
  164.   running bdist_wheel
  165.   running build
  166.   running build_py
  167.   creating build
  168.   creating build/lib.linux-x86_64-3.7
  169.   copying src/pyaudio.py -> build/lib.linux-x86_64-3.7
  170.   running build_ext
  171.   building '_portaudio' extension
  172.   creating build/temp.linux-x86_64-3.7
  173.   creating build/temp.linux-x86_64-3.7/src
  174.   gcc -pthread -B /home/stabitl/miniconda3/compiler_compat -Wl,--sysroot=/ -Wsign-compare -DNDEBUG -g -fwrapv -O3 -Wall -Wstrict-prototypes -fPIC -I/home/stabitl/mycroft-core/.venv/include -I/home/stabitl/miniconda3/include/python3.7m -c src/_portaudiomodule.c -o build/temp.linux-x86_64-3.7/src/_portaudiomodule.o
  175.   gcc -pthread -shared -B /home/stabitl/miniconda3/compiler_compat -L/home/stabitl/miniconda3/lib -Wl,-rpath=/home/stabitl/miniconda3/lib -Wl,--no-as-needed -Wl,--sysroot=/ build/temp.linux-x86_64-3.7/src/_portaudiomodule.o -lportaudio -o build/lib.linux-x86_64-3.7/_portaudio.cpython-37m-x86_64-linux-gnu.so
  176.   /home/stabitl/miniconda3/compiler_compat/ld: build/temp.linux-x86_64-3.7/src/_portaudiomodule.o: unable to initialize decompress status for section .debug_info
  177.   /home/stabitl/miniconda3/compiler_compat/ld: build/temp.linux-x86_64-3.7/src/_portaudiomodule.o: unable to initialize decompress status for section .debug_info
  178.   /home/stabitl/miniconda3/compiler_compat/ld: build/temp.linux-x86_64-3.7/src/_portaudiomodule.o: unable to initialize decompress status for section .debug_info
  179.   /home/stabitl/miniconda3/compiler_compat/ld: build/temp.linux-x86_64-3.7/src/_portaudiomodule.o: unable to initialize decompress status for section .debug_info
  180.   build/temp.linux-x86_64-3.7/src/_portaudiomodule.o: file not recognized: file format not recognized
  181.   collect2: error: ld returned 1 exit status
  182.   error: command 'gcc' failed with exit status 1
  183.  
  184.   ----------------------------------------
  185.   Running setup.py clean for PyAudio
  186.   Running setup.py bdist_wheel for pyalsaaudio: started
  187.   Running setup.py bdist_wheel for pyalsaaudio: finished with status 'error'
  188.   Complete output from command /home/stabitl/mycroft-core/.venv/bin/python -u -c "import setuptools, tokenize;__file__='/tmp/pip-install-ice0dklc/pyalsaaudio/setup.py';f=getattr(tokenize, 'open', open)(__file__);code=f.read().replace('\r\n', '\n');f.close();exec(compile(code, __file__, 'exec'))" bdist_wheel -d /tmp/pip-wheel-10yt9lqp --python-tag cp37:
  189.   running bdist_wheel
  190.   running build
  191.   running build_ext
  192.   building 'alsaaudio' extension
  193.   creating build
  194.   creating build/temp.linux-x86_64-3.7
  195.   gcc -pthread -B /home/stabitl/miniconda3/compiler_compat -Wl,--sysroot=/ -Wsign-compare -DNDEBUG -g -fwrapv -O3 -Wall -Wstrict-prototypes -fPIC -I/home/stabitl/mycroft-core/.venv/include -I/home/stabitl/miniconda3/include/python3.7m -c alsaaudio.c -o build/temp.linux-x86_64-3.7/alsaaudio.o
  196.   creating build/lib.linux-x86_64-3.7
  197.   gcc -pthread -shared -B /home/stabitl/miniconda3/compiler_compat -L/home/stabitl/miniconda3/lib -Wl,-rpath=/home/stabitl/miniconda3/lib -Wl,--no-as-needed -Wl,--sysroot=/ build/temp.linux-x86_64-3.7/alsaaudio.o -lasound -o build/lib.linux-x86_64-3.7/alsaaudio.cpython-37m-x86_64-linux-gnu.so
  198.   /home/stabitl/miniconda3/compiler_compat/ld: build/temp.linux-x86_64-3.7/alsaaudio.o: unable to initialize decompress status for section .debug_info
  199.   /home/stabitl/miniconda3/compiler_compat/ld: build/temp.linux-x86_64-3.7/alsaaudio.o: unable to initialize decompress status for section .debug_info
  200.   /home/stabitl/miniconda3/compiler_compat/ld: build/temp.linux-x86_64-3.7/alsaaudio.o: unable to initialize decompress status for section .debug_info
  201.   /home/stabitl/miniconda3/compiler_compat/ld: build/temp.linux-x86_64-3.7/alsaaudio.o: unable to initialize decompress status for section .debug_info
  202.   build/temp.linux-x86_64-3.7/alsaaudio.o: file not recognized: file format not recognized
  203.   collect2: error: ld returned 1 exit status
  204.   error: command 'gcc' failed with exit status 1
  205.  
  206.   ----------------------------------------
  207.   Running setup.py clean for pyalsaaudio
  208.   Running setup.py bdist_wheel for psutil: started
  209.   Running setup.py bdist_wheel for psutil: finished with status 'error'
  210.   Complete output from command /home/stabitl/mycroft-core/.venv/bin/python -u -c "import setuptools, tokenize;__file__='/tmp/pip-install-ice0dklc/psutil/setup.py';f=getattr(tokenize, 'open', open)(__file__);code=f.read().replace('\r\n', '\n');f.close();exec(compile(code, __file__, 'exec'))" bdist_wheel -d /tmp/pip-wheel-99j9q6sc --python-tag cp37:
  211.   running bdist_wheel
  212.   running build
  213.   running build_py
  214.   creating build
  215.   creating build/lib.linux-x86_64-3.7
  216.   creating build/lib.linux-x86_64-3.7/psutil
  217.   copying psutil/_pssunos.py -> build/lib.linux-x86_64-3.7/psutil
  218.   copying psutil/_compat.py -> build/lib.linux-x86_64-3.7/psutil
  219.   copying psutil/__init__.py -> build/lib.linux-x86_64-3.7/psutil
  220.   copying psutil/_psosx.py -> build/lib.linux-x86_64-3.7/psutil
  221.   copying psutil/_pslinux.py -> build/lib.linux-x86_64-3.7/psutil
  222.   copying psutil/_common.py -> build/lib.linux-x86_64-3.7/psutil
  223.   copying psutil/_psposix.py -> build/lib.linux-x86_64-3.7/psutil
  224.   copying psutil/_psbsd.py -> build/lib.linux-x86_64-3.7/psutil
  225.   copying psutil/_pswindows.py -> build/lib.linux-x86_64-3.7/psutil
  226.   creating build/lib.linux-x86_64-3.7/psutil/tests
  227.   copying psutil/tests/test_linux.py -> build/lib.linux-x86_64-3.7/psutil/tests
  228.   copying psutil/tests/runner.py -> build/lib.linux-x86_64-3.7/psutil/tests
  229.   copying psutil/tests/test_osx.py -> build/lib.linux-x86_64-3.7/psutil/tests
  230.   copying psutil/tests/test_system.py -> build/lib.linux-x86_64-3.7/psutil/tests
  231.   copying psutil/tests/test_memory_leaks.py -> build/lib.linux-x86_64-3.7/psutil/tests
  232.   copying psutil/tests/__init__.py -> build/lib.linux-x86_64-3.7/psutil/tests
  233.   copying psutil/tests/test_windows.py -> build/lib.linux-x86_64-3.7/psutil/tests
  234.   copying psutil/tests/test_misc.py -> build/lib.linux-x86_64-3.7/psutil/tests
  235.   copying psutil/tests/test_sunos.py -> build/lib.linux-x86_64-3.7/psutil/tests
  236.   copying psutil/tests/test_posix.py -> build/lib.linux-x86_64-3.7/psutil/tests
  237.   copying psutil/tests/test_bsd.py -> build/lib.linux-x86_64-3.7/psutil/tests
  238.   copying psutil/tests/test_process.py -> build/lib.linux-x86_64-3.7/psutil/tests
  239.   running build_ext
  240.   building 'psutil._psutil_linux' extension
  241.   creating build/temp.linux-x86_64-3.7
  242.   creating build/temp.linux-x86_64-3.7/psutil
  243.   gcc -pthread -B /home/stabitl/miniconda3/compiler_compat -Wl,--sysroot=/ -Wsign-compare -DNDEBUG -g -fwrapv -O3 -Wall -Wstrict-prototypes -fPIC -DPSUTIL_POSIX=1 -DPSUTIL_VERSION=521 -DPSUTIL_LINUX=1 -I/home/stabitl/mycroft-core/.venv/include -I/home/stabitl/miniconda3/include/python3.7m -c psutil/_psutil_linux.c -o build/temp.linux-x86_64-3.7/psutil/_psutil_linux.o
  244.   gcc -pthread -shared -B /home/stabitl/miniconda3/compiler_compat -L/home/stabitl/miniconda3/lib -Wl,-rpath=/home/stabitl/miniconda3/lib -Wl,--no-as-needed -Wl,--sysroot=/ build/temp.linux-x86_64-3.7/psutil/_psutil_linux.o -o build/lib.linux-x86_64-3.7/psutil/_psutil_linux.cpython-37m-x86_64-linux-gnu.so
  245.   /home/stabitl/miniconda3/compiler_compat/ld: build/temp.linux-x86_64-3.7/psutil/_psutil_linux.o: unable to initialize decompress status for section .debug_info
  246.   /home/stabitl/miniconda3/compiler_compat/ld: build/temp.linux-x86_64-3.7/psutil/_psutil_linux.o: unable to initialize decompress status for section .debug_info
  247.   /home/stabitl/miniconda3/compiler_compat/ld: build/temp.linux-x86_64-3.7/psutil/_psutil_linux.o: unable to initialize decompress status for section .debug_info
  248.   /home/stabitl/miniconda3/compiler_compat/ld: build/temp.linux-x86_64-3.7/psutil/_psutil_linux.o: unable to initialize decompress status for section .debug_info
  249.   build/temp.linux-x86_64-3.7/psutil/_psutil_linux.o: file not recognized: file format not recognized
  250.   collect2: error: ld returned 1 exit status
  251.   error: command 'gcc' failed with exit status 1
  252.  
  253.   ----------------------------------------
  254.   Running setup.py clean for psutil
  255.   Running setup.py bdist_wheel for pocketsphinx: started
  256.   Running setup.py bdist_wheel for pocketsphinx: finished with status 'error'
  257.   Complete output from command /home/stabitl/mycroft-core/.venv/bin/python -u -c "import setuptools, tokenize;__file__='/tmp/pip-install-ice0dklc/pocketsphinx/setup.py';f=getattr(tokenize, 'open', open)(__file__);code=f.read().replace('\r\n', '\n');f.close();exec(compile(code, __file__, 'exec'))" bdist_wheel -d /tmp/pip-wheel-9iwqv2kf --python-tag cp37:
  258.   running bdist_wheel
  259.   running build
  260.   running build_py
  261.   creating build
  262.   creating build/lib.linux-x86_64-3.7
  263.   creating build/lib.linux-x86_64-3.7/sphinxbase
  264.   copying sphinxbase/__init__.py -> build/lib.linux-x86_64-3.7/sphinxbase
  265.   copying sphinxbase/sphinxbase.py -> build/lib.linux-x86_64-3.7/sphinxbase
  266.   creating build/lib.linux-x86_64-3.7/pocketsphinx
  267.   copying pocketsphinx/__init__.py -> build/lib.linux-x86_64-3.7/pocketsphinx
  268.   copying pocketsphinx/pocketsphinx.py -> build/lib.linux-x86_64-3.7/pocketsphinx
  269.   running build_ext
  270.   building 'sphinxbase._sphinxbase' extension
  271.   swigging deps/sphinxbase/swig/sphinxbase.i to deps/sphinxbase/swig/sphinxbase_wrap.c
  272.   swig -python -modern -Ideps/sphinxbase/include -Ideps/sphinxbase/include/sphinxbase -Ideps/sphinxbase/include/android -outdir sphinxbase -o deps/sphinxbase/swig/sphinxbase_wrap.c deps/sphinxbase/swig/sphinxbase.i
  273.   creating build/temp.linux-x86_64-3.7
  274.   creating build/temp.linux-x86_64-3.7/deps
  275.   creating build/temp.linux-x86_64-3.7/deps/sphinxbase
  276.   creating build/temp.linux-x86_64-3.7/deps/sphinxbase/src
  277.   creating build/temp.linux-x86_64-3.7/deps/sphinxbase/src/libsphinxbase
  278.   creating build/temp.linux-x86_64-3.7/deps/sphinxbase/src/libsphinxbase/lm
  279.   creating build/temp.linux-x86_64-3.7/deps/sphinxbase/src/libsphinxbase/feat
  280.   creating build/temp.linux-x86_64-3.7/deps/sphinxbase/src/libsphinxbase/util
  281.   creating build/temp.linux-x86_64-3.7/deps/sphinxbase/src/libsphinxbase/fe
  282.   creating build/temp.linux-x86_64-3.7/deps/sphinxbase/swig
  283.   gcc -pthread -B /home/stabitl/miniconda3/compiler_compat -Wl,--sysroot=/ -Wsign-compare -DNDEBUG -g -fwrapv -O3 -Wall -Wstrict-prototypes -fPIC -DSPHINXBASE_EXPORTS -DPOCKETSPHINX_EXPORTS -DSPHINX_DLL -DHAVE_CONFIG_H -Ideps/sphinxbase/include -Ideps/sphinxbase/include/sphinxbase -Ideps/sphinxbase/include/android -I/home/stabitl/mycroft-core/.venv/include -I/home/stabitl/miniconda3/include/python3.7m -c deps/sphinxbase/src/libsphinxbase/lm/ngram_model_trie.c -o build/temp.linux-x86_64-3.7/deps/sphinxbase/src/libsphinxbase/lm/ngram_model_trie.o -Wno-unused-label -Wno-strict-prototypes -Wno-parentheses -Wno-unused-but-set-variable -Wno-unused-variable -Wno-unused-result -Wno-sign-compare
  284.   gcc -pthread -B /home/stabitl/miniconda3/compiler_compat -Wl,--sysroot=/ -Wsign-compare -DNDEBUG -g -fwrapv -O3 -Wall -Wstrict-prototypes -fPIC -DSPHINXBASE_EXPORTS -DPOCKETSPHINX_EXPORTS -DSPHINX_DLL -DHAVE_CONFIG_H -Ideps/sphinxbase/include -Ideps/sphinxbase/include/sphinxbase -Ideps/sphinxbase/include/android -I/home/stabitl/mycroft-core/.venv/include -I/home/stabitl/miniconda3/include/python3.7m -c deps/sphinxbase/src/libsphinxbase/lm/ngram_model_set.c -o build/temp.linux-x86_64-3.7/deps/sphinxbase/src/libsphinxbase/lm/ngram_model_set.o -Wno-unused-label -Wno-strict-prototypes -Wno-parentheses -Wno-unused-but-set-variable -Wno-unused-variable -Wno-unused-result -Wno-sign-compare
  285.   gcc -pthread -B /home/stabitl/miniconda3/compiler_compat -Wl,--sysroot=/ -Wsign-compare -DNDEBUG -g -fwrapv -O3 -Wall -Wstrict-prototypes -fPIC -DSPHINXBASE_EXPORTS -DPOCKETSPHINX_EXPORTS -DSPHINX_DLL -DHAVE_CONFIG_H -Ideps/sphinxbase/include -Ideps/sphinxbase/include/sphinxbase -Ideps/sphinxbase/include/android -I/home/stabitl/mycroft-core/.venv/include -I/home/stabitl/miniconda3/include/python3.7m -c deps/sphinxbase/src/libsphinxbase/lm/ngrams_raw.c -o build/temp.linux-x86_64-3.7/deps/sphinxbase/src/libsphinxbase/lm/ngrams_raw.o -Wno-unused-label -Wno-strict-prototypes -Wno-parentheses -Wno-unused-but-set-variable -Wno-unused-variable -Wno-unused-result -Wno-sign-compare
  286.   gcc -pthread -B /home/stabitl/miniconda3/compiler_compat -Wl,--sysroot=/ -Wsign-compare -DNDEBUG -g -fwrapv -O3 -Wall -Wstrict-prototypes -fPIC -DSPHINXBASE_EXPORTS -DPOCKETSPHINX_EXPORTS -DSPHINX_DLL -DHAVE_CONFIG_H -Ideps/sphinxbase/include -Ideps/sphinxbase/include/sphinxbase -Ideps/sphinxbase/include/android -I/home/stabitl/mycroft-core/.venv/include -I/home/stabitl/miniconda3/include/python3.7m -c deps/sphinxbase/src/libsphinxbase/lm/lm_trie.c -o build/temp.linux-x86_64-3.7/deps/sphinxbase/src/libsphinxbase/lm/lm_trie.o -Wno-unused-label -Wno-strict-prototypes -Wno-parentheses -Wno-unused-but-set-variable -Wno-unused-variable -Wno-unused-result -Wno-sign-compare
  287.   gcc -pthread -B /home/stabitl/miniconda3/compiler_compat -Wl,--sysroot=/ -Wsign-compare -DNDEBUG -g -fwrapv -O3 -Wall -Wstrict-prototypes -fPIC -DSPHINXBASE_EXPORTS -DPOCKETSPHINX_EXPORTS -DSPHINX_DLL -DHAVE_CONFIG_H -Ideps/sphinxbase/include -Ideps/sphinxbase/include/sphinxbase -Ideps/sphinxbase/include/android -I/home/stabitl/mycroft-core/.venv/include -I/home/stabitl/miniconda3/include/python3.7m -c deps/sphinxbase/src/libsphinxbase/lm/ngram_model.c -o build/temp.linux-x86_64-3.7/deps/sphinxbase/src/libsphinxbase/lm/ngram_model.o -Wno-unused-label -Wno-strict-prototypes -Wno-parentheses -Wno-unused-but-set-variable -Wno-unused-variable -Wno-unused-result -Wno-sign-compare
  288.   gcc -pthread -B /home/stabitl/miniconda3/compiler_compat -Wl,--sysroot=/ -Wsign-compare -DNDEBUG -g -fwrapv -O3 -Wall -Wstrict-prototypes -fPIC -DSPHINXBASE_EXPORTS -DPOCKETSPHINX_EXPORTS -DSPHINX_DLL -DHAVE_CONFIG_H -Ideps/sphinxbase/include -Ideps/sphinxbase/include/sphinxbase -Ideps/sphinxbase/include/android -I/home/stabitl/mycroft-core/.venv/include -I/home/stabitl/miniconda3/include/python3.7m -c deps/sphinxbase/src/libsphinxbase/lm/jsgf_parser.c -o build/temp.linux-x86_64-3.7/deps/sphinxbase/src/libsphinxbase/lm/jsgf_parser.o -Wno-unused-label -Wno-strict-prototypes -Wno-parentheses -Wno-unused-but-set-variable -Wno-unused-variable -Wno-unused-result -Wno-sign-compare
  289.   gcc -pthread -B /home/stabitl/miniconda3/compiler_compat -Wl,--sysroot=/ -Wsign-compare -DNDEBUG -g -fwrapv -O3 -Wall -Wstrict-prototypes -fPIC -DSPHINXBASE_EXPORTS -DPOCKETSPHINX_EXPORTS -DSPHINX_DLL -DHAVE_CONFIG_H -Ideps/sphinxbase/include -Ideps/sphinxbase/include/sphinxbase -Ideps/sphinxbase/include/android -I/home/stabitl/mycroft-core/.venv/include -I/home/stabitl/miniconda3/include/python3.7m -c deps/sphinxbase/src/libsphinxbase/lm/fsg_model.c -o build/temp.linux-x86_64-3.7/deps/sphinxbase/src/libsphinxbase/lm/fsg_model.o -Wno-unused-label -Wno-strict-prototypes -Wno-parentheses -Wno-unused-but-set-variable -Wno-unused-variable -Wno-unused-result -Wno-sign-compare
  290.   gcc -pthread -B /home/stabitl/miniconda3/compiler_compat -Wl,--sysroot=/ -Wsign-compare -DNDEBUG -g -fwrapv -O3 -Wall -Wstrict-prototypes -fPIC -DSPHINXBASE_EXPORTS -DPOCKETSPHINX_EXPORTS -DSPHINX_DLL -DHAVE_CONFIG_H -Ideps/sphinxbase/include -Ideps/sphinxbase/include/sphinxbase -Ideps/sphinxbase/include/android -I/home/stabitl/mycroft-core/.venv/include -I/home/stabitl/miniconda3/include/python3.7m -c deps/sphinxbase/src/libsphinxbase/lm/jsgf_scanner.c -o build/temp.linux-x86_64-3.7/deps/sphinxbase/src/libsphinxbase/lm/jsgf_scanner.o -Wno-unused-label -Wno-strict-prototypes -Wno-parentheses -Wno-unused-but-set-variable -Wno-unused-variable -Wno-unused-result -Wno-sign-compare
  291.   gcc -pthread -B /home/stabitl/miniconda3/compiler_compat -Wl,--sysroot=/ -Wsign-compare -DNDEBUG -g -fwrapv -O3 -Wall -Wstrict-prototypes -fPIC -DSPHINXBASE_EXPORTS -DPOCKETSPHINX_EXPORTS -DSPHINX_DLL -DHAVE_CONFIG_H -Ideps/sphinxbase/include -Ideps/sphinxbase/include/sphinxbase -Ideps/sphinxbase/include/android -I/home/stabitl/mycroft-core/.venv/include -I/home/stabitl/miniconda3/include/python3.7m -c deps/sphinxbase/src/libsphinxbase/lm/jsgf.c -o build/temp.linux-x86_64-3.7/deps/sphinxbase/src/libsphinxbase/lm/jsgf.o -Wno-unused-label -Wno-strict-prototypes -Wno-parentheses -Wno-unused-but-set-variable -Wno-unused-variable -Wno-unused-result -Wno-sign-compare
  292.   gcc -pthread -B /home/stabitl/miniconda3/compiler_compat -Wl,--sysroot=/ -Wsign-compare -DNDEBUG -g -fwrapv -O3 -Wall -Wstrict-prototypes -fPIC -DSPHINXBASE_EXPORTS -DPOCKETSPHINX_EXPORTS -DSPHINX_DLL -DHAVE_CONFIG_H -Ideps/sphinxbase/include -Ideps/sphinxbase/include/sphinxbase -Ideps/sphinxbase/include/android -I/home/stabitl/mycroft-core/.venv/include -I/home/stabitl/miniconda3/include/python3.7m -c deps/sphinxbase/src/libsphinxbase/lm/lm_trie_quant.c -o build/temp.linux-x86_64-3.7/deps/sphinxbase/src/libsphinxbase/lm/lm_trie_quant.o -Wno-unused-label -Wno-strict-prototypes -Wno-parentheses -Wno-unused-but-set-variable -Wno-unused-variable -Wno-unused-result -Wno-sign-compare
  293.   gcc -pthread -B /home/stabitl/miniconda3/compiler_compat -Wl,--sysroot=/ -Wsign-compare -DNDEBUG -g -fwrapv -O3 -Wall -Wstrict-prototypes -fPIC -DSPHINXBASE_EXPORTS -DPOCKETSPHINX_EXPORTS -DSPHINX_DLL -DHAVE_CONFIG_H -Ideps/sphinxbase/include -Ideps/sphinxbase/include/sphinxbase -Ideps/sphinxbase/include/android -I/home/stabitl/mycroft-core/.venv/include -I/home/stabitl/miniconda3/include/python3.7m -c deps/sphinxbase/src/libsphinxbase/feat/feat.c -o build/temp.linux-x86_64-3.7/deps/sphinxbase/src/libsphinxbase/feat/feat.o -Wno-unused-label -Wno-strict-prototypes -Wno-parentheses -Wno-unused-but-set-variable -Wno-unused-variable -Wno-unused-result -Wno-sign-compare
  294.   gcc -pthread -B /home/stabitl/miniconda3/compiler_compat -Wl,--sysroot=/ -Wsign-compare -DNDEBUG -g -fwrapv -O3 -Wall -Wstrict-prototypes -fPIC -DSPHINXBASE_EXPORTS -DPOCKETSPHINX_EXPORTS -DSPHINX_DLL -DHAVE_CONFIG_H -Ideps/sphinxbase/include -Ideps/sphinxbase/include/sphinxbase -Ideps/sphinxbase/include/android -I/home/stabitl/mycroft-core/.venv/include -I/home/stabitl/miniconda3/include/python3.7m -c deps/sphinxbase/src/libsphinxbase/feat/lda.c -o build/temp.linux-x86_64-3.7/deps/sphinxbase/src/libsphinxbase/feat/lda.o -Wno-unused-label -Wno-strict-prototypes -Wno-parentheses -Wno-unused-but-set-variable -Wno-unused-variable -Wno-unused-result -Wno-sign-compare
  295.   gcc -pthread -B /home/stabitl/miniconda3/compiler_compat -Wl,--sysroot=/ -Wsign-compare -DNDEBUG -g -fwrapv -O3 -Wall -Wstrict-prototypes -fPIC -DSPHINXBASE_EXPORTS -DPOCKETSPHINX_EXPORTS -DSPHINX_DLL -DHAVE_CONFIG_H -Ideps/sphinxbase/include -Ideps/sphinxbase/include/sphinxbase -Ideps/sphinxbase/include/android -I/home/stabitl/mycroft-core/.venv/include -I/home/stabitl/miniconda3/include/python3.7m -c deps/sphinxbase/src/libsphinxbase/feat/cmn.c -o build/temp.linux-x86_64-3.7/deps/sphinxbase/src/libsphinxbase/feat/cmn.o -Wno-unused-label -Wno-strict-prototypes -Wno-parentheses -Wno-unused-but-set-variable -Wno-unused-variable -Wno-unused-result -Wno-sign-compare
  296.   gcc -pthread -B /home/stabitl/miniconda3/compiler_compat -Wl,--sysroot=/ -Wsign-compare -DNDEBUG -g -fwrapv -O3 -Wall -Wstrict-prototypes -fPIC -DSPHINXBASE_EXPORTS -DPOCKETSPHINX_EXPORTS -DSPHINX_DLL -DHAVE_CONFIG_H -Ideps/sphinxbase/include -Ideps/sphinxbase/include/sphinxbase -Ideps/sphinxbase/include/android -I/home/stabitl/mycroft-core/.venv/include -I/home/stabitl/miniconda3/include/python3.7m -c deps/sphinxbase/src/libsphinxbase/feat/cmn_live.c -o build/temp.linux-x86_64-3.7/deps/sphinxbase/src/libsphinxbase/feat/cmn_live.o -Wno-unused-label -Wno-strict-prototypes -Wno-parentheses -Wno-unused-but-set-variable -Wno-unused-variable -Wno-unused-result -Wno-sign-compare
  297.   gcc -pthread -B /home/stabitl/miniconda3/compiler_compat -Wl,--sysroot=/ -Wsign-compare -DNDEBUG -g -fwrapv -O3 -Wall -Wstrict-prototypes -fPIC -DSPHINXBASE_EXPORTS -DPOCKETSPHINX_EXPORTS -DSPHINX_DLL -DHAVE_CONFIG_H -Ideps/sphinxbase/include -Ideps/sphinxbase/include/sphinxbase -Ideps/sphinxbase/include/android -I/home/stabitl/mycroft-core/.venv/include -I/home/stabitl/miniconda3/include/python3.7m -c deps/sphinxbase/src/libsphinxbase/feat/agc.c -o build/temp.linux-x86_64-3.7/deps/sphinxbase/src/libsphinxbase/feat/agc.o -Wno-unused-label -Wno-strict-prototypes -Wno-parentheses -Wno-unused-but-set-variable -Wno-unused-variable -Wno-unused-result -Wno-sign-compare
  298.   gcc -pthread -B /home/stabitl/miniconda3/compiler_compat -Wl,--sysroot=/ -Wsign-compare -DNDEBUG -g -fwrapv -O3 -Wall -Wstrict-prototypes -fPIC -DSPHINXBASE_EXPORTS -DPOCKETSPHINX_EXPORTS -DSPHINX_DLL -DHAVE_CONFIG_H -Ideps/sphinxbase/include -Ideps/sphinxbase/include/sphinxbase -Ideps/sphinxbase/include/android -I/home/stabitl/mycroft-core/.venv/include -I/home/stabitl/miniconda3/include/python3.7m -c deps/sphinxbase/src/libsphinxbase/util/hash_table.c -o build/temp.linux-x86_64-3.7/deps/sphinxbase/src/libsphinxbase/util/hash_table.o -Wno-unused-label -Wno-strict-prototypes -Wno-parentheses -Wno-unused-but-set-variable -Wno-unused-variable -Wno-unused-result -Wno-sign-compare
  299.   gcc -pthread -B /home/stabitl/miniconda3/compiler_compat -Wl,--sysroot=/ -Wsign-compare -DNDEBUG -g -fwrapv -O3 -Wall -Wstrict-prototypes -fPIC -DSPHINXBASE_EXPORTS -DPOCKETSPHINX_EXPORTS -DSPHINX_DLL -DHAVE_CONFIG_H -Ideps/sphinxbase/include -Ideps/sphinxbase/include/sphinxbase -Ideps/sphinxbase/include/android -I/home/stabitl/mycroft-core/.venv/include -I/home/stabitl/miniconda3/include/python3.7m -c deps/sphinxbase/src/libsphinxbase/util/case.c -o build/temp.linux-x86_64-3.7/deps/sphinxbase/src/libsphinxbase/util/case.o -Wno-unused-label -Wno-strict-prototypes -Wno-parentheses -Wno-unused-but-set-variable -Wno-unused-variable -Wno-unused-result -Wno-sign-compare
  300.   gcc -pthread -B /home/stabitl/miniconda3/compiler_compat -Wl,--sysroot=/ -Wsign-compare -DNDEBUG -g -fwrapv -O3 -Wall -Wstrict-prototypes -fPIC -DSPHINXBASE_EXPORTS -DPOCKETSPHINX_EXPORTS -DSPHINX_DLL -DHAVE_CONFIG_H -Ideps/sphinxbase/include -Ideps/sphinxbase/include/sphinxbase -Ideps/sphinxbase/include/android -I/home/stabitl/mycroft-core/.venv/include -I/home/stabitl/miniconda3/include/python3.7m -c deps/sphinxbase/src/libsphinxbase/util/slapack_lite.c -o build/temp.linux-x86_64-3.7/deps/sphinxbase/src/libsphinxbase/util/slapack_lite.o -Wno-unused-label -Wno-strict-prototypes -Wno-parentheses -Wno-unused-but-set-variable -Wno-unused-variable -Wno-unused-result -Wno-sign-compare
  301.   gcc -pthread -B /home/stabitl/miniconda3/compiler_compat -Wl,--sysroot=/ -Wsign-compare -DNDEBUG -g -fwrapv -O3 -Wall -Wstrict-prototypes -fPIC -DSPHINXBASE_EXPORTS -DPOCKETSPHINX_EXPORTS -DSPHINX_DLL -DHAVE_CONFIG_H -Ideps/sphinxbase/include -Ideps/sphinxbase/include/sphinxbase -Ideps/sphinxbase/include/android -I/home/stabitl/mycroft-core/.venv/include -I/home/stabitl/miniconda3/include/python3.7m -c deps/sphinxbase/src/libsphinxbase/util/heap.c -o build/temp.linux-x86_64-3.7/deps/sphinxbase/src/libsphinxbase/util/heap.o -Wno-unused-label -Wno-strict-prototypes -Wno-parentheses -Wno-unused-but-set-variable -Wno-unused-variable -Wno-unused-result -Wno-sign-compare
  302.   gcc -pthread -B /home/stabitl/miniconda3/compiler_compat -Wl,--sysroot=/ -Wsign-compare -DNDEBUG -g -fwrapv -O3 -Wall -Wstrict-prototypes -fPIC -DSPHINXBASE_EXPORTS -DPOCKETSPHINX_EXPORTS -DSPHINX_DLL -DHAVE_CONFIG_H -Ideps/sphinxbase/include -Ideps/sphinxbase/include/sphinxbase -Ideps/sphinxbase/include/android -I/home/stabitl/mycroft-core/.venv/include -I/home/stabitl/miniconda3/include/python3.7m -c deps/sphinxbase/src/libsphinxbase/util/pio.c -o build/temp.linux-x86_64-3.7/deps/sphinxbase/src/libsphinxbase/util/pio.o -Wno-unused-label -Wno-strict-prototypes -Wno-parentheses -Wno-unused-but-set-variable -Wno-unused-variable -Wno-unused-result -Wno-sign-compare
  303.   gcc -pthread -B /home/stabitl/miniconda3/compiler_compat -Wl,--sysroot=/ -Wsign-compare -DNDEBUG -g -fwrapv -O3 -Wall -Wstrict-prototypes -fPIC -DSPHINXBASE_EXPORTS -DPOCKETSPHINX_EXPORTS -DSPHINX_DLL -DHAVE_CONFIG_H -Ideps/sphinxbase/include -Ideps/sphinxbase/include/sphinxbase -Ideps/sphinxbase/include/android -I/home/stabitl/mycroft-core/.venv/include -I/home/stabitl/miniconda3/include/python3.7m -c deps/sphinxbase/src/libsphinxbase/util/glist.c -o build/temp.linux-x86_64-3.7/deps/sphinxbase/src/libsphinxbase/util/glist.o -Wno-unused-label -Wno-strict-prototypes -Wno-parentheses -Wno-unused-but-set-variable -Wno-unused-variable -Wno-unused-result -Wno-sign-compare
  304.   gcc -pthread -B /home/stabitl/miniconda3/compiler_compat -Wl,--sysroot=/ -Wsign-compare -DNDEBUG -g -fwrapv -O3 -Wall -Wstrict-prototypes -fPIC -DSPHINXBASE_EXPORTS -DPOCKETSPHINX_EXPORTS -DSPHINX_DLL -DHAVE_CONFIG_H -Ideps/sphinxbase/include -Ideps/sphinxbase/include/sphinxbase -Ideps/sphinxbase/include/android -I/home/stabitl/mycroft-core/.venv/include -I/home/stabitl/miniconda3/include/python3.7m -c deps/sphinxbase/src/libsphinxbase/util/errno.c -o build/temp.linux-x86_64-3.7/deps/sphinxbase/src/libsphinxbase/util/errno.o -Wno-unused-label -Wno-strict-prototypes -Wno-parentheses -Wno-unused-but-set-variable -Wno-unused-variable -Wno-unused-result -Wno-sign-compare
  305.   gcc -pthread -B /home/stabitl/miniconda3/compiler_compat -Wl,--sysroot=/ -Wsign-compare -DNDEBUG -g -fwrapv -O3 -Wall -Wstrict-prototypes -fPIC -DSPHINXBASE_EXPORTS -DPOCKETSPHINX_EXPORTS -DSPHINX_DLL -DHAVE_CONFIG_H -Ideps/sphinxbase/include -Ideps/sphinxbase/include/sphinxbase -Ideps/sphinxbase/include/android -I/home/stabitl/mycroft-core/.venv/include -I/home/stabitl/miniconda3/include/python3.7m -c deps/sphinxbase/src/libsphinxbase/util/bio.c -o build/temp.linux-x86_64-3.7/deps/sphinxbase/src/libsphinxbase/util/bio.o -Wno-unused-label -Wno-strict-prototypes -Wno-parentheses -Wno-unused-but-set-variable -Wno-unused-variable -Wno-unused-result -Wno-sign-compare
  306.   gcc -pthread -B /home/stabitl/miniconda3/compiler_compat -Wl,--sysroot=/ -Wsign-compare -DNDEBUG -g -fwrapv -O3 -Wall -Wstrict-prototypes -fPIC -DSPHINXBASE_EXPORTS -DPOCKETSPHINX_EXPORTS -DSPHINX_DLL -DHAVE_CONFIG_H -Ideps/sphinxbase/include -Ideps/sphinxbase/include/sphinxbase -Ideps/sphinxbase/include/android -I/home/stabitl/mycroft-core/.venv/include -I/home/stabitl/miniconda3/include/python3.7m -c deps/sphinxbase/src/libsphinxbase/util/priority_queue.c -o build/temp.linux-x86_64-3.7/deps/sphinxbase/src/libsphinxbase/util/priority_queue.o -Wno-unused-label -Wno-strict-prototypes -Wno-parentheses -Wno-unused-but-set-variable -Wno-unused-variable -Wno-unused-result -Wno-sign-compare
  307.   gcc -pthread -B /home/stabitl/miniconda3/compiler_compat -Wl,--sysroot=/ -Wsign-compare -DNDEBUG -g -fwrapv -O3 -Wall -Wstrict-prototypes -fPIC -DSPHINXBASE_EXPORTS -DPOCKETSPHINX_EXPORTS -DSPHINX_DLL -DHAVE_CONFIG_H -Ideps/sphinxbase/include -Ideps/sphinxbase/include/sphinxbase -Ideps/sphinxbase/include/android -I/home/stabitl/mycroft-core/.venv/include -I/home/stabitl/miniconda3/include/python3.7m -c deps/sphinxbase/src/libsphinxbase/util/f2c_lite.c -o build/temp.linux-x86_64-3.7/deps/sphinxbase/src/libsphinxbase/util/f2c_lite.o -Wno-unused-label -Wno-strict-prototypes -Wno-parentheses -Wno-unused-but-set-variable -Wno-unused-variable -Wno-unused-result -Wno-sign-compare
  308.   gcc -pthread -B /home/stabitl/miniconda3/compiler_compat -Wl,--sysroot=/ -Wsign-compare -DNDEBUG -g -fwrapv -O3 -Wall -Wstrict-prototypes -fPIC -DSPHINXBASE_EXPORTS -DPOCKETSPHINX_EXPORTS -DSPHINX_DLL -DHAVE_CONFIG_H -Ideps/sphinxbase/include -Ideps/sphinxbase/include/sphinxbase -Ideps/sphinxbase/include/android -I/home/stabitl/mycroft-core/.venv/include -I/home/stabitl/miniconda3/include/python3.7m -c deps/sphinxbase/src/libsphinxbase/util/genrand.c -o build/temp.linux-x86_64-3.7/deps/sphinxbase/src/libsphinxbase/util/genrand.o -Wno-unused-label -Wno-strict-prototypes -Wno-parentheses -Wno-unused-but-set-variable -Wno-unused-variable -Wno-unused-result -Wno-sign-compare
  309.   gcc -pthread -B /home/stabitl/miniconda3/compiler_compat -Wl,--sysroot=/ -Wsign-compare -DNDEBUG -g -fwrapv -O3 -Wall -Wstrict-prototypes -fPIC -DSPHINXBASE_EXPORTS -DPOCKETSPHINX_EXPORTS -DSPHINX_DLL -DHAVE_CONFIG_H -Ideps/sphinxbase/include -Ideps/sphinxbase/include/sphinxbase -Ideps/sphinxbase/include/android -I/home/stabitl/mycroft-core/.venv/include -I/home/stabitl/miniconda3/include/python3.7m -c deps/sphinxbase/src/libsphinxbase/util/logmath.c -o build/temp.linux-x86_64-3.7/deps/sphinxbase/src/libsphinxbase/util/logmath.o -Wno-unused-label -Wno-strict-prototypes -Wno-parentheses -Wno-unused-but-set-variable -Wno-unused-variable -Wno-unused-result -Wno-sign-compare
  310.   gcc -pthread -B /home/stabitl/miniconda3/compiler_compat -Wl,--sysroot=/ -Wsign-compare -DNDEBUG -g -fwrapv -O3 -Wall -Wstrict-prototypes -fPIC -DSPHINXBASE_EXPORTS -DPOCKETSPHINX_EXPORTS -DSPHINX_DLL -DHAVE_CONFIG_H -Ideps/sphinxbase/include -Ideps/sphinxbase/include/sphinxbase -Ideps/sphinxbase/include/android -I/home/stabitl/mycroft-core/.venv/include -I/home/stabitl/miniconda3/include/python3.7m -c deps/sphinxbase/src/libsphinxbase/util/bitvec.c -o build/temp.linux-x86_64-3.7/deps/sphinxbase/src/libsphinxbase/util/bitvec.o -Wno-unused-label -Wno-strict-prototypes -Wno-parentheses -Wno-unused-but-set-variable -Wno-unused-variable -Wno-unused-result -Wno-sign-compare
  311.   gcc -pthread -B /home/stabitl/miniconda3/compiler_compat -Wl,--sysroot=/ -Wsign-compare -DNDEBUG -g -fwrapv -O3 -Wall -Wstrict-prototypes -fPIC -DSPHINXBASE_EXPORTS -DPOCKETSPHINX_EXPORTS -DSPHINX_DLL -DHAVE_CONFIG_H -Ideps/sphinxbase/include -Ideps/sphinxbase/include/sphinxbase -Ideps/sphinxbase/include/android -I/home/stabitl/mycroft-core/.venv/include -I/home/stabitl/miniconda3/include/python3.7m -c deps/sphinxbase/src/libsphinxbase/util/ckd_alloc.c -o build/temp.linux-x86_64-3.7/deps/sphinxbase/src/libsphinxbase/util/ckd_alloc.o -Wno-unused-label -Wno-strict-prototypes -Wno-parentheses -Wno-unused-but-set-variable -Wno-unused-variable -Wno-unused-result -Wno-sign-compare
  312.   gcc -pthread -B /home/stabitl/miniconda3/compiler_compat -Wl,--sysroot=/ -Wsign-compare -DNDEBUG -g -fwrapv -O3 -Wall -Wstrict-prototypes -fPIC -DSPHINXBASE_EXPORTS -DPOCKETSPHINX_EXPORTS -DSPHINX_DLL -DHAVE_CONFIG_H -Ideps/sphinxbase/include -Ideps/sphinxbase/include/sphinxbase -Ideps/sphinxbase/include/android -I/home/stabitl/mycroft-core/.venv/include -I/home/stabitl/miniconda3/include/python3.7m -c deps/sphinxbase/src/libsphinxbase/util/bitarr.c -o build/temp.linux-x86_64-3.7/deps/sphinxbase/src/libsphinxbase/util/bitarr.o -Wno-unused-label -Wno-strict-prototypes -Wno-parentheses -Wno-unused-but-set-variable -Wno-unused-variable -Wno-unused-result -Wno-sign-compare
  313.   gcc -pthread -B /home/stabitl/miniconda3/compiler_compat -Wl,--sysroot=/ -Wsign-compare -DNDEBUG -g -fwrapv -O3 -Wall -Wstrict-prototypes -fPIC -DSPHINXBASE_EXPORTS -DPOCKETSPHINX_EXPORTS -DSPHINX_DLL -DHAVE_CONFIG_H -Ideps/sphinxbase/include -Ideps/sphinxbase/include/sphinxbase -Ideps/sphinxbase/include/android -I/home/stabitl/mycroft-core/.venv/include -I/home/stabitl/miniconda3/include/python3.7m -c deps/sphinxbase/src/libsphinxbase/util/slamch.c -o build/temp.linux-x86_64-3.7/deps/sphinxbase/src/libsphinxbase/util/slamch.o -Wno-unused-label -Wno-strict-prototypes -Wno-parentheses -Wno-unused-but-set-variable -Wno-unused-variable -Wno-unused-result -Wno-sign-compare
  314.   gcc -pthread -B /home/stabitl/miniconda3/compiler_compat -Wl,--sysroot=/ -Wsign-compare -DNDEBUG -g -fwrapv -O3 -Wall -Wstrict-prototypes -fPIC -DSPHINXBASE_EXPORTS -DPOCKETSPHINX_EXPORTS -DSPHINX_DLL -DHAVE_CONFIG_H -Ideps/sphinxbase/include -Ideps/sphinxbase/include/sphinxbase -Ideps/sphinxbase/include/android -I/home/stabitl/mycroft-core/.venv/include -I/home/stabitl/miniconda3/include/python3.7m -c deps/sphinxbase/src/libsphinxbase/util/cmd_ln.c -o build/temp.linux-x86_64-3.7/deps/sphinxbase/src/libsphinxbase/util/cmd_ln.o -Wno-unused-label -Wno-strict-prototypes -Wno-parentheses -Wno-unused-but-set-variable -Wno-unused-variable -Wno-unused-result -Wno-sign-compare
  315.   gcc -pthread -B /home/stabitl/miniconda3/compiler_compat -Wl,--sysroot=/ -Wsign-compare -DNDEBUG -g -fwrapv -O3 -Wall -Wstrict-prototypes -fPIC -DSPHINXBASE_EXPORTS -DPOCKETSPHINX_EXPORTS -DSPHINX_DLL -DHAVE_CONFIG_H -Ideps/sphinxbase/include -Ideps/sphinxbase/include/sphinxbase -Ideps/sphinxbase/include/android -I/home/stabitl/mycroft-core/.venv/include -I/home/stabitl/miniconda3/include/python3.7m -c deps/sphinxbase/src/libsphinxbase/util/listelem_alloc.c -o build/temp.linux-x86_64-3.7/deps/sphinxbase/src/libsphinxbase/util/listelem_alloc.o -Wno-unused-label -Wno-strict-prototypes -Wno-parentheses -Wno-unused-but-set-variable -Wno-unused-variable -Wno-unused-result -Wno-sign-compare
  316.   gcc -pthread -B /home/stabitl/miniconda3/compiler_compat -Wl,--sysroot=/ -Wsign-compare -DNDEBUG -g -fwrapv -O3 -Wall -Wstrict-prototypes -fPIC -DSPHINXBASE_EXPORTS -DPOCKETSPHINX_EXPORTS -DSPHINX_DLL -DHAVE_CONFIG_H -Ideps/sphinxbase/include -Ideps/sphinxbase/include/sphinxbase -Ideps/sphinxbase/include/android -I/home/stabitl/mycroft-core/.venv/include -I/home/stabitl/miniconda3/include/python3.7m -c deps/sphinxbase/src/libsphinxbase/util/filename.c -o build/temp.linux-x86_64-3.7/deps/sphinxbase/src/libsphinxbase/util/filename.o -Wno-unused-label -Wno-strict-prototypes -Wno-parentheses -Wno-unused-but-set-variable -Wno-unused-variable -Wno-unused-result -Wno-sign-compare
  317.   gcc -pthread -B /home/stabitl/miniconda3/compiler_compat -Wl,--sysroot=/ -Wsign-compare -DNDEBUG -g -fwrapv -O3 -Wall -Wstrict-prototypes -fPIC -DSPHINXBASE_EXPORTS -DPOCKETSPHINX_EXPORTS -DSPHINX_DLL -DHAVE_CONFIG_H -Ideps/sphinxbase/include -Ideps/sphinxbase/include/sphinxbase -Ideps/sphinxbase/include/android -I/home/stabitl/mycroft-core/.venv/include -I/home/stabitl/miniconda3/include/python3.7m -c deps/sphinxbase/src/libsphinxbase/util/profile.c -o build/temp.linux-x86_64-3.7/deps/sphinxbase/src/libsphinxbase/util/profile.o -Wno-unused-label -Wno-strict-prototypes -Wno-parentheses -Wno-unused-but-set-variable -Wno-unused-variable -Wno-unused-result -Wno-sign-compare
  318.   gcc -pthread -B /home/stabitl/miniconda3/compiler_compat -Wl,--sysroot=/ -Wsign-compare -DNDEBUG -g -fwrapv -O3 -Wall -Wstrict-prototypes -fPIC -DSPHINXBASE_EXPORTS -DPOCKETSPHINX_EXPORTS -DSPHINX_DLL -DHAVE_CONFIG_H -Ideps/sphinxbase/include -Ideps/sphinxbase/include/sphinxbase -Ideps/sphinxbase/include/android -I/home/stabitl/mycroft-core/.venv/include -I/home/stabitl/miniconda3/include/python3.7m -c deps/sphinxbase/src/libsphinxbase/util/blas_lite.c -o build/temp.linux-x86_64-3.7/deps/sphinxbase/src/libsphinxbase/util/blas_lite.o -Wno-unused-label -Wno-strict-prototypes -Wno-parentheses -Wno-unused-but-set-variable -Wno-unused-variable -Wno-unused-result -Wno-sign-compare
  319.   gcc -pthread -B /home/stabitl/miniconda3/compiler_compat -Wl,--sysroot=/ -Wsign-compare -DNDEBUG -g -fwrapv -O3 -Wall -Wstrict-prototypes -fPIC -DSPHINXBASE_EXPORTS -DPOCKETSPHINX_EXPORTS -DSPHINX_DLL -DHAVE_CONFIG_H -Ideps/sphinxbase/include -Ideps/sphinxbase/include/sphinxbase -Ideps/sphinxbase/include/android -I/home/stabitl/mycroft-core/.venv/include -I/home/stabitl/miniconda3/include/python3.7m -c deps/sphinxbase/src/libsphinxbase/util/err.c -o build/temp.linux-x86_64-3.7/deps/sphinxbase/src/libsphinxbase/util/err.o -Wno-unused-label -Wno-strict-prototypes -Wno-parentheses -Wno-unused-but-set-variable -Wno-unused-variable -Wno-unused-result -Wno-sign-compare
  320.   gcc -pthread -B /home/stabitl/miniconda3/compiler_compat -Wl,--sysroot=/ -Wsign-compare -DNDEBUG -g -fwrapv -O3 -Wall -Wstrict-prototypes -fPIC -DSPHINXBASE_EXPORTS -DPOCKETSPHINX_EXPORTS -DSPHINX_DLL -DHAVE_CONFIG_H -Ideps/sphinxbase/include -Ideps/sphinxbase/include/sphinxbase -Ideps/sphinxbase/include/android -I/home/stabitl/mycroft-core/.venv/include -I/home/stabitl/miniconda3/include/python3.7m -c deps/sphinxbase/src/libsphinxbase/util/strfuncs.c -o build/temp.linux-x86_64-3.7/deps/sphinxbase/src/libsphinxbase/util/strfuncs.o -Wno-unused-label -Wno-strict-prototypes -Wno-parentheses -Wno-unused-but-set-variable -Wno-unused-variable -Wno-unused-result -Wno-sign-compare
  321.   gcc -pthread -B /home/stabitl/miniconda3/compiler_compat -Wl,--sysroot=/ -Wsign-compare -DNDEBUG -g -fwrapv -O3 -Wall -Wstrict-prototypes -fPIC -DSPHINXBASE_EXPORTS -DPOCKETSPHINX_EXPORTS -DSPHINX_DLL -DHAVE_CONFIG_H -Ideps/sphinxbase/include -Ideps/sphinxbase/include/sphinxbase -Ideps/sphinxbase/include/android -I/home/stabitl/mycroft-core/.venv/include -I/home/stabitl/miniconda3/include/python3.7m -c deps/sphinxbase/src/libsphinxbase/util/matrix.c -o build/temp.linux-x86_64-3.7/deps/sphinxbase/src/libsphinxbase/util/matrix.o -Wno-unused-label -Wno-strict-prototypes -Wno-parentheses -Wno-unused-but-set-variable -Wno-unused-variable -Wno-unused-result -Wno-sign-compare
  322.   gcc -pthread -B /home/stabitl/miniconda3/compiler_compat -Wl,--sysroot=/ -Wsign-compare -DNDEBUG -g -fwrapv -O3 -Wall -Wstrict-prototypes -fPIC -DSPHINXBASE_EXPORTS -DPOCKETSPHINX_EXPORTS -DSPHINX_DLL -DHAVE_CONFIG_H -Ideps/sphinxbase/include -Ideps/sphinxbase/include/sphinxbase -Ideps/sphinxbase/include/android -I/home/stabitl/mycroft-core/.venv/include -I/home/stabitl/miniconda3/include/python3.7m -c deps/sphinxbase/src/libsphinxbase/util/sbthread.c -o build/temp.linux-x86_64-3.7/deps/sphinxbase/src/libsphinxbase/util/sbthread.o -Wno-unused-label -Wno-strict-prototypes -Wno-parentheses -Wno-unused-but-set-variable -Wno-unused-variable -Wno-unused-result -Wno-sign-compare
  323.   gcc -pthread -B /home/stabitl/miniconda3/compiler_compat -Wl,--sysroot=/ -Wsign-compare -DNDEBUG -g -fwrapv -O3 -Wall -Wstrict-prototypes -fPIC -DSPHINXBASE_EXPORTS -DPOCKETSPHINX_EXPORTS -DSPHINX_DLL -DHAVE_CONFIG_H -Ideps/sphinxbase/include -Ideps/sphinxbase/include/sphinxbase -Ideps/sphinxbase/include/android -I/home/stabitl/mycroft-core/.venv/include -I/home/stabitl/miniconda3/include/python3.7m -c deps/sphinxbase/src/libsphinxbase/util/mmio.c -o build/temp.linux-x86_64-3.7/deps/sphinxbase/src/libsphinxbase/util/mmio.o -Wno-unused-label -Wno-strict-prototypes -Wno-parentheses -Wno-unused-but-set-variable -Wno-unused-variable -Wno-unused-result -Wno-sign-compare
  324.   gcc -pthread -B /home/stabitl/miniconda3/compiler_compat -Wl,--sysroot=/ -Wsign-compare -DNDEBUG -g -fwrapv -O3 -Wall -Wstrict-prototypes -fPIC -DSPHINXBASE_EXPORTS -DPOCKETSPHINX_EXPORTS -DSPHINX_DLL -DHAVE_CONFIG_H -Ideps/sphinxbase/include -Ideps/sphinxbase/include/sphinxbase -Ideps/sphinxbase/include/android -I/home/stabitl/mycroft-core/.venv/include -I/home/stabitl/miniconda3/include/python3.7m -c deps/sphinxbase/src/libsphinxbase/util/dtoa.c -o build/temp.linux-x86_64-3.7/deps/sphinxbase/src/libsphinxbase/util/dtoa.o -Wno-unused-label -Wno-strict-prototypes -Wno-parentheses -Wno-unused-but-set-variable -Wno-unused-variable -Wno-unused-result -Wno-sign-compare
  325.   gcc -pthread -B /home/stabitl/miniconda3/compiler_compat -Wl,--sysroot=/ -Wsign-compare -DNDEBUG -g -fwrapv -O3 -Wall -Wstrict-prototypes -fPIC -DSPHINXBASE_EXPORTS -DPOCKETSPHINX_EXPORTS -DSPHINX_DLL -DHAVE_CONFIG_H -Ideps/sphinxbase/include -Ideps/sphinxbase/include/sphinxbase -Ideps/sphinxbase/include/android -I/home/stabitl/mycroft-core/.venv/include -I/home/stabitl/miniconda3/include/python3.7m -c deps/sphinxbase/src/libsphinxbase/fe/fe_sigproc.c -o build/temp.linux-x86_64-3.7/deps/sphinxbase/src/libsphinxbase/fe/fe_sigproc.o -Wno-unused-label -Wno-strict-prototypes -Wno-parentheses -Wno-unused-but-set-variable -Wno-unused-variable -Wno-unused-result -Wno-sign-compare
  326.   gcc -pthread -B /home/stabitl/miniconda3/compiler_compat -Wl,--sysroot=/ -Wsign-compare -DNDEBUG -g -fwrapv -O3 -Wall -Wstrict-prototypes -fPIC -DSPHINXBASE_EXPORTS -DPOCKETSPHINX_EXPORTS -DSPHINX_DLL -DHAVE_CONFIG_H -Ideps/sphinxbase/include -Ideps/sphinxbase/include/sphinxbase -Ideps/sphinxbase/include/android -I/home/stabitl/mycroft-core/.venv/include -I/home/stabitl/miniconda3/include/python3.7m -c deps/sphinxbase/src/libsphinxbase/fe/yin.c -o build/temp.linux-x86_64-3.7/deps/sphinxbase/src/libsphinxbase/fe/yin.o -Wno-unused-label -Wno-strict-prototypes -Wno-parentheses -Wno-unused-but-set-variable -Wno-unused-variable -Wno-unused-result -Wno-sign-compare
  327.   gcc -pthread -B /home/stabitl/miniconda3/compiler_compat -Wl,--sysroot=/ -Wsign-compare -DNDEBUG -g -fwrapv -O3 -Wall -Wstrict-prototypes -fPIC -DSPHINXBASE_EXPORTS -DPOCKETSPHINX_EXPORTS -DSPHINX_DLL -DHAVE_CONFIG_H -Ideps/sphinxbase/include -Ideps/sphinxbase/include/sphinxbase -Ideps/sphinxbase/include/android -I/home/stabitl/mycroft-core/.venv/include -I/home/stabitl/miniconda3/include/python3.7m -c deps/sphinxbase/src/libsphinxbase/fe/fixlog.c -o build/temp.linux-x86_64-3.7/deps/sphinxbase/src/libsphinxbase/fe/fixlog.o -Wno-unused-label -Wno-strict-prototypes -Wno-parentheses -Wno-unused-but-set-variable -Wno-unused-variable -Wno-unused-result -Wno-sign-compare
  328.   gcc -pthread -B /home/stabitl/miniconda3/compiler_compat -Wl,--sysroot=/ -Wsign-compare -DNDEBUG -g -fwrapv -O3 -Wall -Wstrict-prototypes -fPIC -DSPHINXBASE_EXPORTS -DPOCKETSPHINX_EXPORTS -DSPHINX_DLL -DHAVE_CONFIG_H -Ideps/sphinxbase/include -Ideps/sphinxbase/include/sphinxbase -Ideps/sphinxbase/include/android -I/home/stabitl/mycroft-core/.venv/include -I/home/stabitl/miniconda3/include/python3.7m -c deps/sphinxbase/src/libsphinxbase/fe/fe_warp.c -o build/temp.linux-x86_64-3.7/deps/sphinxbase/src/libsphinxbase/fe/fe_warp.o -Wno-unused-label -Wno-strict-prototypes -Wno-parentheses -Wno-unused-but-set-variable -Wno-unused-variable -Wno-unused-result -Wno-sign-compare
  329.   gcc -pthread -B /home/stabitl/miniconda3/compiler_compat -Wl,--sysroot=/ -Wsign-compare -DNDEBUG -g -fwrapv -O3 -Wall -Wstrict-prototypes -fPIC -DSPHINXBASE_EXPORTS -DPOCKETSPHINX_EXPORTS -DSPHINX_DLL -DHAVE_CONFIG_H -Ideps/sphinxbase/include -Ideps/sphinxbase/include/sphinxbase -Ideps/sphinxbase/include/android -I/home/stabitl/mycroft-core/.venv/include -I/home/stabitl/miniconda3/include/python3.7m -c deps/sphinxbase/src/libsphinxbase/fe/fe_warp_piecewise_linear.c -o build/temp.linux-x86_64-3.7/deps/sphinxbase/src/libsphinxbase/fe/fe_warp_piecewise_linear.o -Wno-unused-label -Wno-strict-prototypes -Wno-parentheses -Wno-unused-but-set-variable -Wno-unused-variable -Wno-unused-result -Wno-sign-compare
  330.   gcc -pthread -B /home/stabitl/miniconda3/compiler_compat -Wl,--sysroot=/ -Wsign-compare -DNDEBUG -g -fwrapv -O3 -Wall -Wstrict-prototypes -fPIC -DSPHINXBASE_EXPORTS -DPOCKETSPHINX_EXPORTS -DSPHINX_DLL -DHAVE_CONFIG_H -Ideps/sphinxbase/include -Ideps/sphinxbase/include/sphinxbase -Ideps/sphinxbase/include/android -I/home/stabitl/mycroft-core/.venv/include -I/home/stabitl/miniconda3/include/python3.7m -c deps/sphinxbase/src/libsphinxbase/fe/fe_warp_affine.c -o build/temp.linux-x86_64-3.7/deps/sphinxbase/src/libsphinxbase/fe/fe_warp_affine.o -Wno-unused-label -Wno-strict-prototypes -Wno-parentheses -Wno-unused-but-set-variable -Wno-unused-variable -Wno-unused-result -Wno-sign-compare
  331.   gcc -pthread -B /home/stabitl/miniconda3/compiler_compat -Wl,--sysroot=/ -Wsign-compare -DNDEBUG -g -fwrapv -O3 -Wall -Wstrict-prototypes -fPIC -DSPHINXBASE_EXPORTS -DPOCKETSPHINX_EXPORTS -DSPHINX_DLL -DHAVE_CONFIG_H -Ideps/sphinxbase/include -Ideps/sphinxbase/include/sphinxbase -Ideps/sphinxbase/include/android -I/home/stabitl/mycroft-core/.venv/include -I/home/stabitl/miniconda3/include/python3.7m -c deps/sphinxbase/src/libsphinxbase/fe/fe_noise.c -o build/temp.linux-x86_64-3.7/deps/sphinxbase/src/libsphinxbase/fe/fe_noise.o -Wno-unused-label -Wno-strict-prototypes -Wno-parentheses -Wno-unused-but-set-variable -Wno-unused-variable -Wno-unused-result -Wno-sign-compare
  332.   gcc -pthread -B /home/stabitl/miniconda3/compiler_compat -Wl,--sysroot=/ -Wsign-compare -DNDEBUG -g -fwrapv -O3 -Wall -Wstrict-prototypes -fPIC -DSPHINXBASE_EXPORTS -DPOCKETSPHINX_EXPORTS -DSPHINX_DLL -DHAVE_CONFIG_H -Ideps/sphinxbase/include -Ideps/sphinxbase/include/sphinxbase -Ideps/sphinxbase/include/android -I/home/stabitl/mycroft-core/.venv/include -I/home/stabitl/miniconda3/include/python3.7m -c deps/sphinxbase/src/libsphinxbase/fe/fe_interface.c -o build/temp.linux-x86_64-3.7/deps/sphinxbase/src/libsphinxbase/fe/fe_interface.o -Wno-unused-label -Wno-strict-prototypes -Wno-parentheses -Wno-unused-but-set-variable -Wno-unused-variable -Wno-unused-result -Wno-sign-compare
  333.   gcc -pthread -B /home/stabitl/miniconda3/compiler_compat -Wl,--sysroot=/ -Wsign-compare -DNDEBUG -g -fwrapv -O3 -Wall -Wstrict-prototypes -fPIC -DSPHINXBASE_EXPORTS -DPOCKETSPHINX_EXPORTS -DSPHINX_DLL -DHAVE_CONFIG_H -Ideps/sphinxbase/include -Ideps/sphinxbase/include/sphinxbase -Ideps/sphinxbase/include/android -I/home/stabitl/mycroft-core/.venv/include -I/home/stabitl/miniconda3/include/python3.7m -c deps/sphinxbase/src/libsphinxbase/fe/fe_prespch_buf.c -o build/temp.linux-x86_64-3.7/deps/sphinxbase/src/libsphinxbase/fe/fe_prespch_buf.o -Wno-unused-label -Wno-strict-prototypes -Wno-parentheses -Wno-unused-but-set-variable -Wno-unused-variable -Wno-unused-result -Wno-sign-compare
  334.   gcc -pthread -B /home/stabitl/miniconda3/compiler_compat -Wl,--sysroot=/ -Wsign-compare -DNDEBUG -g -fwrapv -O3 -Wall -Wstrict-prototypes -fPIC -DSPHINXBASE_EXPORTS -DPOCKETSPHINX_EXPORTS -DSPHINX_DLL -DHAVE_CONFIG_H -Ideps/sphinxbase/include -Ideps/sphinxbase/include/sphinxbase -Ideps/sphinxbase/include/android -I/home/stabitl/mycroft-core/.venv/include -I/home/stabitl/miniconda3/include/python3.7m -c deps/sphinxbase/src/libsphinxbase/fe/fe_warp_inverse_linear.c -o build/temp.linux-x86_64-3.7/deps/sphinxbase/src/libsphinxbase/fe/fe_warp_inverse_linear.o -Wno-unused-label -Wno-strict-prototypes -Wno-parentheses -Wno-unused-but-set-variable -Wno-unused-variable -Wno-unused-result -Wno-sign-compare
  335.   gcc -pthread -B /home/stabitl/miniconda3/compiler_compat -Wl,--sysroot=/ -Wsign-compare -DNDEBUG -g -fwrapv -O3 -Wall -Wstrict-prototypes -fPIC -DSPHINXBASE_EXPORTS -DPOCKETSPHINX_EXPORTS -DSPHINX_DLL -DHAVE_CONFIG_H -Ideps/sphinxbase/include -Ideps/sphinxbase/include/sphinxbase -Ideps/sphinxbase/include/android -I/home/stabitl/mycroft-core/.venv/include -I/home/stabitl/miniconda3/include/python3.7m -c deps/sphinxbase/swig/sphinxbase_wrap.c -o build/temp.linux-x86_64-3.7/deps/sphinxbase/swig/sphinxbase_wrap.o -Wno-unused-label -Wno-strict-prototypes -Wno-parentheses -Wno-unused-but-set-variable -Wno-unused-variable -Wno-unused-result -Wno-sign-compare
  336.   gcc -pthread -shared -B /home/stabitl/miniconda3/compiler_compat -L/home/stabitl/miniconda3/lib -Wl,-rpath=/home/stabitl/miniconda3/lib -Wl,--no-as-needed -Wl,--sysroot=/ build/temp.linux-x86_64-3.7/deps/sphinxbase/src/libsphinxbase/lm/ngram_model_trie.o build/temp.linux-x86_64-3.7/deps/sphinxbase/src/libsphinxbase/lm/ngram_model_set.o build/temp.linux-x86_64-3.7/deps/sphinxbase/src/libsphinxbase/lm/ngrams_raw.o build/temp.linux-x86_64-3.7/deps/sphinxbase/src/libsphinxbase/lm/lm_trie.o build/temp.linux-x86_64-3.7/deps/sphinxbase/src/libsphinxbase/lm/ngram_model.o build/temp.linux-x86_64-3.7/deps/sphinxbase/src/libsphinxbase/lm/jsgf_parser.o build/temp.linux-x86_64-3.7/deps/sphinxbase/src/libsphinxbase/lm/fsg_model.o build/temp.linux-x86_64-3.7/deps/sphinxbase/src/libsphinxbase/lm/jsgf_scanner.o build/temp.linux-x86_64-3.7/deps/sphinxbase/src/libsphinxbase/lm/jsgf.o build/temp.linux-x86_64-3.7/deps/sphinxbase/src/libsphinxbase/lm/lm_trie_quant.o build/temp.linux-x86_64-3.7/deps/sphinxbase/src/libsphinxbase/feat/feat.o build/temp.linux-x86_64-3.7/deps/sphinxbase/src/libsphinxbase/feat/lda.o build/temp.linux-x86_64-3.7/deps/sphinxbase/src/libsphinxbase/feat/cmn.o build/temp.linux-x86_64-3.7/deps/sphinxbase/src/libsphinxbase/feat/cmn_live.o build/temp.linux-x86_64-3.7/deps/sphinxbase/src/libsphinxbase/feat/agc.o build/temp.linux-x86_64-3.7/deps/sphinxbase/src/libsphinxbase/util/hash_table.o build/temp.linux-x86_64-3.7/deps/sphinxbase/src/libsphinxbase/util/case.o build/temp.linux-x86_64-3.7/deps/sphinxbase/src/libsphinxbase/util/slapack_lite.o build/temp.linux-x86_64-3.7/deps/sphinxbase/src/libsphinxbase/util/heap.o build/temp.linux-x86_64-3.7/deps/sphinxbase/src/libsphinxbase/util/pio.o build/temp.linux-x86_64-3.7/deps/sphinxbase/src/libsphinxbase/util/glist.o build/temp.linux-x86_64-3.7/deps/sphinxbase/src/libsphinxbase/util/errno.o build/temp.linux-x86_64-3.7/deps/sphinxbase/src/libsphinxbase/util/bio.o build/temp.linux-x86_64-3.7/deps/sphinxbase/src/libsphinxbase/util/priority_queue.o build/temp.linux-x86_64-3.7/deps/sphinxbase/src/libsphinxbase/util/f2c_lite.o build/temp.linux-x86_64-3.7/deps/sphinxbase/src/libsphinxbase/util/genrand.o build/temp.linux-x86_64-3.7/deps/sphinxbase/src/libsphinxbase/util/logmath.o build/temp.linux-x86_64-3.7/deps/sphinxbase/src/libsphinxbase/util/bitvec.o build/temp.linux-x86_64-3.7/deps/sphinxbase/src/libsphinxbase/util/ckd_alloc.o build/temp.linux-x86_64-3.7/deps/sphinxbase/src/libsphinxbase/util/bitarr.o build/temp.linux-x86_64-3.7/deps/sphinxbase/src/libsphinxbase/util/slamch.o build/temp.linux-x86_64-3.7/deps/sphinxbase/src/libsphinxbase/util/cmd_ln.o build/temp.linux-x86_64-3.7/deps/sphinxbase/src/libsphinxbase/util/listelem_alloc.o build/temp.linux-x86_64-3.7/deps/sphinxbase/src/libsphinxbase/util/filename.o build/temp.linux-x86_64-3.7/deps/sphinxbase/src/libsphinxbase/util/profile.o build/temp.linux-x86_64-3.7/deps/sphinxbase/src/libsphinxbase/util/blas_lite.o build/temp.linux-x86_64-3.7/deps/sphinxbase/src/libsphinxbase/util/err.o build/temp.linux-x86_64-3.7/deps/sphinxbase/src/libsphinxbase/util/strfuncs.o build/temp.linux-x86_64-3.7/deps/sphinxbase/src/libsphinxbase/util/matrix.o build/temp.linux-x86_64-3.7/deps/sphinxbase/src/libsphinxbase/util/sbthread.o build/temp.linux-x86_64-3.7/deps/sphinxbase/src/libsphinxbase/util/mmio.o build/temp.linux-x86_64-3.7/deps/sphinxbase/src/libsphinxbase/util/dtoa.o build/temp.linux-x86_64-3.7/deps/sphinxbase/src/libsphinxbase/fe/fe_sigproc.o build/temp.linux-x86_64-3.7/deps/sphinxbase/src/libsphinxbase/fe/yin.o build/temp.linux-x86_64-3.7/deps/sphinxbase/src/libsphinxbase/fe/fixlog.o build/temp.linux-x86_64-3.7/deps/sphinxbase/src/libsphinxbase/fe/fe_warp.o build/temp.linux-x86_64-3.7/deps/sphinxbase/src/libsphinxbase/fe/fe_warp_piecewise_linear.o build/temp.linux-x86_64-3.7/deps/sphinxbase/src/libsphinxbase/fe/fe_warp_affine.o build/temp.linux-x86_64-3.7/deps/sphinxbase/src/libsphinxbase/fe/fe_noise.o build/temp.linux-x86_64-3.7/deps/sphinxbase/src/libsphinxbase/fe/fe_interface.o build/temp.linux-x86_64-3.7/deps/sphinxbase/src/libsphinxbase/fe/fe_prespch_buf.o build/temp.linux-x86_64-3.7/deps/sphinxbase/src/libsphinxbase/fe/fe_warp_inverse_linear.o build/temp.linux-x86_64-3.7/deps/sphinxbase/swig/sphinxbase_wrap.o -o build/lib.linux-x86_64-3.7/sphinxbase/_sphinxbase.cpython-37m-x86_64-linux-gnu.so
  337.   /home/stabitl/miniconda3/compiler_compat/ld: build/temp.linux-x86_64-3.7/deps/sphinxbase/src/libsphinxbase/lm/ngram_model_trie.o: unable to initialize decompress status for section .debug_info
  338.   /home/stabitl/miniconda3/compiler_compat/ld: build/temp.linux-x86_64-3.7/deps/sphinxbase/src/libsphinxbase/lm/ngram_model_trie.o: unable to initialize decompress status for section .debug_info
  339.   /home/stabitl/miniconda3/compiler_compat/ld: build/temp.linux-x86_64-3.7/deps/sphinxbase/src/libsphinxbase/lm/ngram_model_trie.o: unable to initialize decompress status for section .debug_info
  340.   /home/stabitl/miniconda3/compiler_compat/ld: build/temp.linux-x86_64-3.7/deps/sphinxbase/src/libsphinxbase/lm/ngram_model_trie.o: unable to initialize decompress status for section .debug_info
  341.   build/temp.linux-x86_64-3.7/deps/sphinxbase/src/libsphinxbase/lm/ngram_model_trie.o: file not recognized: file format not recognized
  342.   collect2: error: ld returned 1 exit status
  343.   error: command 'gcc' failed with exit status 1
  344.  
  345.   ----------------------------------------
  346.   Running setup.py clean for pocketsphinx
  347.   Running setup.py bdist_wheel for fann2: started
  348.   Running setup.py bdist_wheel for fann2: finished with status 'error'
  349.   Complete output from command /home/stabitl/mycroft-core/.venv/bin/python -u -c "import setuptools, tokenize;__file__='/tmp/pip-install-ice0dklc/fann2/setup.py';f=getattr(tokenize, 'open', open)(__file__);code=f.read().replace('\r\n', '\n');f.close();exec(compile(code, __file__, 'exec'))" bdist_wheel -d /tmp/pip-wheel-cbyyjg3d --python-tag cp37:
  350.   running swig
  351.   running bdist_wheel
  352.   running build
  353.   running build_py
  354.   creating build
  355.   creating build/lib.linux-x86_64-3.7
  356.   creating build/lib.linux-x86_64-3.7/fann2
  357.   copying fann2/__init__.py -> build/lib.linux-x86_64-3.7/fann2
  358.   copying fann2/libfann.py -> build/lib.linux-x86_64-3.7/fann2
  359.   running egg_info
  360.   writing fann2.egg-info/PKG-INFO
  361.   writing dependency_links to fann2.egg-info/dependency_links.txt
  362.   writing top-level names to fann2.egg-info/top_level.txt
  363.   reading manifest file 'fann2.egg-info/SOURCES.txt'
  364.   reading manifest template 'MANIFEST.in'
  365.   writing manifest file 'fann2.egg-info/SOURCES.txt'
  366.   copying fann2/fann2.i -> build/lib.linux-x86_64-3.7/fann2
  367.   copying fann2/fann2_wrap.cxx -> build/lib.linux-x86_64-3.7/fann2
  368.   copying fann2/fann_cpp_subclass.h -> build/lib.linux-x86_64-3.7/fann2
  369.   running build_ext
  370.   building 'fann2._libfann' extension
  371.   creating build/temp.linux-x86_64-3.7
  372.   creating build/temp.linux-x86_64-3.7/fann2
  373.   gcc -pthread -B /home/stabitl/miniconda3/compiler_compat -Wl,--sysroot=/ -Wsign-compare -DNDEBUG -g -fwrapv -O3 -Wall -Wstrict-prototypes -fPIC -DSWIG_COMPILE -I./include -I../include -Iinclude -I/home/stabitl/mycroft-core/.venv/include -I/home/stabitl/miniconda3/include/python3.7m -c fann2/fann2_wrap.cxx -o build/temp.linux-x86_64-3.7/fann2/fann2_wrap.o
  374.   cc1plus: warning: command line option ‘-Wstrict-prototypes’ is valid for C/ObjC but not for C++
  375.   g++ -pthread -shared -B /home/stabitl/miniconda3/compiler_compat -L/home/stabitl/miniconda3/lib -Wl,-rpath=/home/stabitl/miniconda3/lib -Wl,--no-as-needed -Wl,--sysroot=/ build/temp.linux-x86_64-3.7/fann2/fann2_wrap.o -ldoublefann -o build/lib.linux-x86_64-3.7/fann2/_libfann.cpython-37m-x86_64-linux-gnu.so
  376.   /home/stabitl/miniconda3/compiler_compat/ld: build/temp.linux-x86_64-3.7/fann2/fann2_wrap.o: unable to initialize decompress status for section .debug_info
  377.   /home/stabitl/miniconda3/compiler_compat/ld: build/temp.linux-x86_64-3.7/fann2/fann2_wrap.o: unable to initialize decompress status for section .debug_info
  378.   /home/stabitl/miniconda3/compiler_compat/ld: build/temp.linux-x86_64-3.7/fann2/fann2_wrap.o: unable to initialize decompress status for section .debug_info
  379.   /home/stabitl/miniconda3/compiler_compat/ld: build/temp.linux-x86_64-3.7/fann2/fann2_wrap.o: unable to initialize decompress status for section .debug_info
  380.   build/temp.linux-x86_64-3.7/fann2/fann2_wrap.o: file not recognized: file format not recognized
  381.   collect2: error: ld returned 1 exit status
  382.   error: command 'g++' failed with exit status 1
  383.  
  384.   ----------------------------------------
  385.   Running setup.py clean for fann2
  386. Failed to build PyAudio pyalsaaudio psutil pocketsphinx fann2
  387. Installing collected packages: PyAudio, pyee, SpeechRecognition, tornado, websocket-client, requests-futures, pyalsaaudio, xmlrunner, pyserial, psutil, pocketsphinx, pillow, python-dateutil, casttube, protobuf, ifaddr, zeroconf, pychromecast, python-vlc, uritemplate, pyasn1, rsa, httplib2, pyasn1-modules, oauth2client, google-api-python-client, monotonic, fasteners, PyYAML, smmap2, gitdb2, GitPython, lazy, appdirs, pako, typing, msm, pyjwt, wrapt, deprecated, pygithub, msk, adapt-parser, padaos, xxhash, fann2, padatious, precise-runner, petact
  388.   Running setup.py install for PyAudio: started
  389.     Running setup.py install for PyAudio: finished with status 'error'
  390.     Complete output from command /home/stabitl/mycroft-core/.venv/bin/python -u -c "import setuptools, tokenize;__file__='/tmp/pip-install-ice0dklc/PyAudio/setup.py';f=getattr(tokenize, 'open', open)(__file__);code=f.read().replace('\r\n', '\n');f.close();exec(compile(code, __file__, 'exec'))" install --record /tmp/pip-record-qfzd4hvy/install-record.txt --single-version-externally-managed --compile --install-headers /home/stabitl/mycroft-core/.venv/include/site/python3.7/PyAudio:
  391.     running install
  392.     running build
  393.     running build_py
  394.     creating build
  395.     creating build/lib.linux-x86_64-3.7
  396.     copying src/pyaudio.py -> build/lib.linux-x86_64-3.7
  397.     running build_ext
  398.     building '_portaudio' extension
  399.     creating build/temp.linux-x86_64-3.7
  400.     creating build/temp.linux-x86_64-3.7/src
  401.     gcc -pthread -B /home/stabitl/miniconda3/compiler_compat -Wl,--sysroot=/ -Wsign-compare -DNDEBUG -g -fwrapv -O3 -Wall -Wstrict-prototypes -fPIC -I/home/stabitl/mycroft-core/.venv/include -I/home/stabitl/miniconda3/include/python3.7m -c src/_portaudiomodule.c -o build/temp.linux-x86_64-3.7/src/_portaudiomodule.o
  402.     gcc -pthread -shared -B /home/stabitl/miniconda3/compiler_compat -L/home/stabitl/miniconda3/lib -Wl,-rpath=/home/stabitl/miniconda3/lib -Wl,--no-as-needed -Wl,--sysroot=/ build/temp.linux-x86_64-3.7/src/_portaudiomodule.o -lportaudio -o build/lib.linux-x86_64-3.7/_portaudio.cpython-37m-x86_64-linux-gnu.so
  403.     /home/stabitl/miniconda3/compiler_compat/ld: build/temp.linux-x86_64-3.7/src/_portaudiomodule.o: unable to initialize decompress status for section .debug_info
  404.     /home/stabitl/miniconda3/compiler_compat/ld: build/temp.linux-x86_64-3.7/src/_portaudiomodule.o: unable to initialize decompress status for section .debug_info
  405.     /home/stabitl/miniconda3/compiler_compat/ld: build/temp.linux-x86_64-3.7/src/_portaudiomodule.o: unable to initialize decompress status for section .debug_info
  406.     /home/stabitl/miniconda3/compiler_compat/ld: build/temp.linux-x86_64-3.7/src/_portaudiomodule.o: unable to initialize decompress status for section .debug_info
  407.     build/temp.linux-x86_64-3.7/src/_portaudiomodule.o: file not recognized: file format not recognized
  408.     collect2: error: ld returned 1 exit status
  409.     error: command 'gcc' failed with exit status 1
  410.    
  411.     ----------------------------------------
  412. Warning: Failed to install all requirements. Continue? y/N
  413. Requirement already satisfied: pycodestyle===2.5.0 in ./.venv/lib/python3.7/site-packages (from -r test-requirements.txt (line 1)) (2.5.0)
  414. Requirement already satisfied: coveralls==1.5.0 in ./.venv/lib/python3.7/site-packages (from -r test-requirements.txt (line 2)) (1.5.0)
  415. Requirement already satisfied: pytest==3.5.0 in ./.venv/lib/python3.7/site-packages (from -r test-requirements.txt (line 3)) (3.5.0)
  416. Requirement already satisfied: pytest-cov==2.5.1 in ./.venv/lib/python3.7/site-packages (from -r test-requirements.txt (line 4)) (2.5.1)
  417. Requirement already satisfied: cov-core==1.15.0 in ./.venv/lib/python3.7/site-packages (from -r test-requirements.txt (line 5)) (1.15.0)
  418. Requirement already satisfied: sphinx==1.8.2 in ./.venv/lib/python3.7/site-packages (from -r test-requirements.txt (line 6)) (1.8.2)
  419. Requirement already satisfied: sphinx-rtd-theme==0.4.2 in ./.venv/lib/python3.7/site-packages (from -r test-requirements.txt (line 7)) (0.4.2)
  420. Requirement already satisfied: docopt>=0.6.1 in ./.venv/lib/python3.7/site-packages (from coveralls==1.5.0->-r test-requirements.txt (line 2)) (0.6.2)
  421. Requirement already satisfied: requests>=1.0.0 in ./.venv/lib/python3.7/site-packages (from coveralls==1.5.0->-r test-requirements.txt (line 2)) (2.20.0)
  422. Requirement already satisfied: coverage>=3.6 in ./.venv/lib/python3.7/site-packages (from coveralls==1.5.0->-r test-requirements.txt (line 2)) (4.5.4)
  423. Requirement already satisfied: py>=1.5.0 in ./.venv/lib/python3.7/site-packages (from pytest==3.5.0->-r test-requirements.txt (line 3)) (1.8.0)
  424. Requirement already satisfied: attrs>=17.4.0 in ./.venv/lib/python3.7/site-packages (from pytest==3.5.0->-r test-requirements.txt (line 3)) (19.3.0)
  425. Requirement already satisfied: more-itertools>=4.0.0 in ./.venv/lib/python3.7/site-packages (from pytest==3.5.0->-r test-requirements.txt (line 3)) (7.2.0)
  426. Requirement already satisfied: setuptools in ./.venv/lib/python3.7/site-packages (from pytest==3.5.0->-r test-requirements.txt (line 3)) (41.6.0)
  427. Requirement already satisfied: pluggy<0.7,>=0.5 in ./.venv/lib/python3.7/site-packages (from pytest==3.5.0->-r test-requirements.txt (line 3)) (0.6.0)
  428. Requirement already satisfied: six>=1.10.0 in ./.venv/lib/python3.7/site-packages (from pytest==3.5.0->-r test-requirements.txt (line 3)) (1.10.0)
  429. Requirement already satisfied: snowballstemmer>=1.1 in ./.venv/lib/python3.7/site-packages (from sphinx==1.8.2->-r test-requirements.txt (line 6)) (2.0.0)
  430. Requirement already satisfied: Pygments>=2.0 in ./.venv/lib/python3.7/site-packages (from sphinx==1.8.2->-r test-requirements.txt (line 6)) (2.4.2)
  431. Requirement already satisfied: babel!=2.0,>=1.3 in ./.venv/lib/python3.7/site-packages (from sphinx==1.8.2->-r test-requirements.txt (line 6)) (2.7.0)
  432. Requirement already satisfied: packaging in ./.venv/lib/python3.7/site-packages (from sphinx==1.8.2->-r test-requirements.txt (line 6)) (19.2)
  433. Requirement already satisfied: imagesize in ./.venv/lib/python3.7/site-packages (from sphinx==1.8.2->-r test-requirements.txt (line 6)) (1.1.0)
  434. Requirement already satisfied: docutils>=0.11 in ./.venv/lib/python3.7/site-packages (from sphinx==1.8.2->-r test-requirements.txt (line 6)) (0.15.2)
  435. Requirement already satisfied: alabaster<0.8,>=0.7 in ./.venv/lib/python3.7/site-packages (from sphinx==1.8.2->-r test-requirements.txt (line 6)) (0.7.12)
  436. Requirement already satisfied: Jinja2>=2.3 in ./.venv/lib/python3.7/site-packages (from sphinx==1.8.2->-r test-requirements.txt (line 6)) (2.10.3)
  437. Requirement already satisfied: sphinxcontrib-websupport in ./.venv/lib/python3.7/site-packages (from sphinx==1.8.2->-r test-requirements.txt (line 6)) (1.1.2)
  438. Requirement already satisfied: idna<2.8,>=2.5 in ./.venv/lib/python3.7/site-packages (from requests>=1.0.0->coveralls==1.5.0->-r test-requirements.txt (line 2)) (2.7)
  439. Requirement already satisfied: certifi>=2017.4.17 in ./.venv/lib/python3.7/site-packages (from requests>=1.0.0->coveralls==1.5.0->-r test-requirements.txt (line 2)) (2019.9.11)
  440. Requirement already satisfied: chardet<3.1.0,>=3.0.2 in ./.venv/lib/python3.7/site-packages (from requests>=1.0.0->coveralls==1.5.0->-r test-requirements.txt (line 2)) (3.0.4)
  441. Requirement already satisfied: urllib3<1.25,>=1.21.1 in ./.venv/lib/python3.7/site-packages (from requests>=1.0.0->coveralls==1.5.0->-r test-requirements.txt (line 2)) (1.24.3)
  442. Requirement already satisfied: pytz>=2015.7 in ./.venv/lib/python3.7/site-packages (from babel!=2.0,>=1.3->sphinx==1.8.2->-r test-requirements.txt (line 6)) (2019.3)
  443. Requirement already satisfied: pyparsing>=2.0.2 in ./.venv/lib/python3.7/site-packages (from packaging->sphinx==1.8.2->-r test-requirements.txt (line 6)) (2.4.5)
  444. Requirement already satisfied: MarkupSafe>=0.23 in ./.venv/lib/python3.7/site-packages (from Jinja2>=2.3->sphinx==1.8.2->-r test-requirements.txt (line 6)) (1.1.1)
  445. Building with 4 cores.
  446. Skipping mimic build.
RAW Paste Data
We use cookies for various purposes including analytics. By continuing to use Pastebin, you agree to our use of cookies as described in the Cookies Policy. OK, I Understand
Top