Ledger Nano X - The secure hardware wallet
SHARE
TWEET

Untitled

a guest Dec 5th, 2019 19 Never
Not a member of Pastebin yet? Sign Up, it unlocks many cool features!
  1. DKMS make.log for veeamsnap-3.0.2.1185 for kernel 5.4.1-050401-generic (x86_64)
  2. Thu Dec  5 21:59:25 CET 2019
  3. make: Entering directory '/usr/src/linux-headers-5.4.1-050401-generic'
  4.   AR      /var/lib/dkms/veeamsnap/3.0.2.1185/build/built-in.a
  5.   CC [M]  /var/lib/dkms/veeamsnap/3.0.2.1185/build/log.o
  6. In file included from <command-line>:0:0:
  7. ./arch/x86/include/asm/page_64.h: In function ‘clear_page’:
  8. ././include/linux/compiler_types.h:210:24: error: expected ‘(’ before ‘__inline’
  9.  #define asm_inline asm __inline
  10.                         ^
  11. ./arch/x86/include/asm/alternative.h:256:2: note: in expansion of macro ‘asm_inline’
  12.   asm_inline volatile (ALTERNATIVE_2("call %P[old]", "call %P[new1]", feature1,\
  13.   ^
  14. ./arch/x86/include/asm/page_64.h:49:2: note: in expansion of macro ‘alternative_call_2’
  15.   alternative_call_2(clear_page_orig,
  16.   ^
  17. In file included from ./arch/x86/include/asm/barrier.h:5:0,
  18.                  from ./include/linux/compiler.h:256,
  19.                  from ./include/linux/init.h:5,
  20.                  from /var/lib/dkms/veeamsnap/3.0.2.1185/build/stdafx.h:4,
  21.                  from /var/lib/dkms/veeamsnap/3.0.2.1185/build/log.c:1:
  22. ./arch/x86/include/asm/alternative.h:128:2: error: expected identifier or ‘(’ before string constant
  23.   "# ALT: oldinstr2\n"         \
  24.   ^
  25. ./arch/x86/include/asm/alternative.h:168:2: note: in expansion of macro ‘OLDINSTR_2’
  26.   OLDINSTR_2(oldinstr, 1, 2)     \
  27.   ^
  28. ./arch/x86/include/asm/alternative.h:256:23: note: in expansion of macro ‘ALTERNATIVE_2’
  29.   asm_inline volatile (ALTERNATIVE_2("call %P[old]", "call %P[new1]", feature1,\
  30.                        ^
  31. ./arch/x86/include/asm/page_64.h:49:2: note: in expansion of macro ‘alternative_call_2’
  32.   alternative_call_2(clear_page_orig,
  33.   ^
  34. In file included from <command-line>:0:0:
  35. ././include/linux/compiler_types.h:210:24: warning: ISO C90 forbids mixed declarations and code [-Wdeclaration-after-statement]
  36.  #define asm_inline asm __inline
  37.                         ^
  38. ./arch/x86/include/asm/alternative.h:256:2: note: in expansion of macro ‘asm_inline’
  39.   asm_inline volatile (ALTERNATIVE_2("call %P[old]", "call %P[new1]", feature1,\
  40.   ^
  41. ./arch/x86/include/asm/page_64.h:49:2: note: in expansion of macro ‘alternative_call_2’
  42.   alternative_call_2(clear_page_orig,
  43.   ^
  44. ./arch/x86/include/asm/segment.h: In function ‘vdso_read_cpunode’:
  45. ././include/linux/compiler_types.h:210:24: error: expected ‘(’ before ‘__inline’
  46.  #define asm_inline asm __inline
  47.                         ^
  48. ./arch/x86/include/asm/alternative.h:240:2: note: in expansion of macro ‘asm_inline’
  49.   asm_inline volatile (ALTERNATIVE(oldinstr, newinstr, feature) \
  50.   ^
  51. ./arch/x86/include/asm/segment.h:266:2: note: in expansion of macro ‘alternative_io’
  52.   alternative_io ("lsl %[seg],%[p]",
  53.   ^
  54. In file included from ./arch/x86/include/asm/barrier.h:5:0,
  55.                  from ./include/linux/compiler.h:256,
  56.                  from ./include/linux/init.h:5,
  57.                  from /var/lib/dkms/veeamsnap/3.0.2.1185/build/stdafx.h:4,
  58.                  from /var/lib/dkms/veeamsnap/3.0.2.1185/build/log.c:1:
  59. ./arch/x86/include/asm/alternative.h:108:2: error: expected identifier or ‘(’ before string constant
  60.   "# ALT: oldnstr\n"      \
  61.   ^
  62. ./arch/x86/include/asm/alternative.h:159:2: note: in expansion of macro ‘OLDINSTR’
  63.   OLDINSTR(oldinstr, 1)      \
  64.   ^
  65. ./arch/x86/include/asm/alternative.h:240:23: note: in expansion of macro ‘ALTERNATIVE’
  66.   asm_inline volatile (ALTERNATIVE(oldinstr, newinstr, feature) \
  67.                        ^
  68. ./arch/x86/include/asm/segment.h:266:2: note: in expansion of macro ‘alternative_io’
  69.   alternative_io ("lsl %[seg],%[p]",
  70.   ^
  71. In file included from <command-line>:0:0:
  72. ././include/linux/compiler_types.h:210:24: warning: ISO C90 forbids mixed declarations and code [-Wdeclaration-after-statement]
  73.  #define asm_inline asm __inline
  74.                         ^
  75. ./arch/x86/include/asm/alternative.h:240:2: note: in expansion of macro ‘asm_inline’
  76.   asm_inline volatile (ALTERNATIVE(oldinstr, newinstr, feature) \
  77.   ^
  78. ./arch/x86/include/asm/segment.h:266:2: note: in expansion of macro ‘alternative_io’
  79.   alternative_io ("lsl %[seg],%[p]",
  80.   ^
  81. ./arch/x86/include/asm/special_insns.h: In function ‘clflushopt’:
  82. ././include/linux/compiler_types.h:210:24: error: expected ‘(’ before ‘__inline’
  83.  #define asm_inline asm __inline
  84.                         ^
  85. ./arch/x86/include/asm/alternative.h:240:2: note: in expansion of macro ‘asm_inline’
  86.   asm_inline volatile (ALTERNATIVE(oldinstr, newinstr, feature) \
  87.   ^
  88. ./arch/x86/include/asm/special_insns.h:205:2: note: in expansion of macro ‘alternative_io’
  89.   alternative_io(".byte " __stringify(NOP_DS_PREFIX) "; clflush %P0",
  90.   ^
  91. In file included from ./arch/x86/include/asm/barrier.h:5:0,
  92.                  from ./include/linux/compiler.h:256,
  93.                  from ./include/linux/init.h:5,
  94.                  from /var/lib/dkms/veeamsnap/3.0.2.1185/build/stdafx.h:4,
  95.                  from /var/lib/dkms/veeamsnap/3.0.2.1185/build/log.c:1:
  96. ./arch/x86/include/asm/alternative.h:108:2: error: expected identifier or ‘(’ before string constant
  97.   "# ALT: oldnstr\n"      \
  98.   ^
  99. ./arch/x86/include/asm/alternative.h:159:2: note: in expansion of macro ‘OLDINSTR’
  100.   OLDINSTR(oldinstr, 1)      \
  101.   ^
  102. ./arch/x86/include/asm/alternative.h:240:23: note: in expansion of macro ‘ALTERNATIVE’
  103.   asm_inline volatile (ALTERNATIVE(oldinstr, newinstr, feature) \
  104.                        ^
  105. ./arch/x86/include/asm/special_insns.h:205:2: note: in expansion of macro ‘alternative_io’
  106.   alternative_io(".byte " __stringify(NOP_DS_PREFIX) "; clflush %P0",
  107.   ^
  108. In file included from <command-line>:0:0:
  109. ././include/linux/compiler_types.h:210:24: warning: ISO C90 forbids mixed declarations and code [-Wdeclaration-after-statement]
  110.  #define asm_inline asm __inline
  111.                         ^
  112. ./arch/x86/include/asm/alternative.h:240:2: note: in expansion of macro ‘asm_inline’
  113.   asm_inline volatile (ALTERNATIVE(oldinstr, newinstr, feature) \
  114.   ^
  115. ./arch/x86/include/asm/special_insns.h:205:2: note: in expansion of macro ‘alternative_io’
  116.   alternative_io(".byte " __stringify(NOP_DS_PREFIX) "; clflush %P0",
  117.   ^
  118. ./arch/x86/include/asm/processor.h: In function ‘prefetch’:
  119. ././include/linux/compiler_types.h:210:24: error: expected ‘(’ before ‘__inline’
  120.  #define asm_inline asm __inline
  121.                         ^
  122. ./arch/x86/include/asm/alternative.h:221:2: note: in expansion of macro ‘asm_inline’
  123.   asm_inline volatile (ALTERNATIVE(oldinstr, newinstr, feature) \
  124.   ^
  125. ./arch/x86/include/asm/processor.h:795:2: note: in expansion of macro ‘alternative_input’
  126.   alternative_input(BASE_PREFETCH, "prefetchnta %P1",
  127.   ^
  128. In file included from ./arch/x86/include/asm/barrier.h:5:0,
  129.                  from ./include/linux/compiler.h:256,
  130.                  from ./include/linux/init.h:5,
  131.                  from /var/lib/dkms/veeamsnap/3.0.2.1185/build/stdafx.h:4,
  132.                  from /var/lib/dkms/veeamsnap/3.0.2.1185/build/log.c:1:
  133. ./arch/x86/include/asm/alternative.h:108:2: error: expected identifier or ‘(’ before string constant
  134.   "# ALT: oldnstr\n"      \
  135.   ^
  136. ./arch/x86/include/asm/alternative.h:159:2: note: in expansion of macro ‘OLDINSTR’
  137.   OLDINSTR(oldinstr, 1)      \
  138.   ^
  139. ./arch/x86/include/asm/alternative.h:221:23: note: in expansion of macro ‘ALTERNATIVE’
  140.   asm_inline volatile (ALTERNATIVE(oldinstr, newinstr, feature) \
  141.                        ^
  142. ./arch/x86/include/asm/processor.h:795:2: note: in expansion of macro ‘alternative_input’
  143.   alternative_input(BASE_PREFETCH, "prefetchnta %P1",
  144.   ^
  145. In file included from <command-line>:0:0:
  146. ././include/linux/compiler_types.h:210:24: warning: ISO C90 forbids mixed declarations and code [-Wdeclaration-after-statement]
  147.  #define asm_inline asm __inline
  148.                         ^
  149. ./arch/x86/include/asm/alternative.h:221:2: note: in expansion of macro ‘asm_inline’
  150.   asm_inline volatile (ALTERNATIVE(oldinstr, newinstr, feature) \
  151.   ^
  152. ./arch/x86/include/asm/processor.h:795:2: note: in expansion of macro ‘alternative_input’
  153.   alternative_input(BASE_PREFETCH, "prefetchnta %P1",
  154.   ^
  155. ./arch/x86/include/asm/processor.h: In function ‘prefetchw’:
  156. ././include/linux/compiler_types.h:210:24: error: expected ‘(’ before ‘__inline’
  157.  #define asm_inline asm __inline
  158.                         ^
  159. ./arch/x86/include/asm/alternative.h:221:2: note: in expansion of macro ‘asm_inline’
  160.   asm_inline volatile (ALTERNATIVE(oldinstr, newinstr, feature) \
  161.   ^
  162. ./arch/x86/include/asm/processor.h:807:2: note: in expansion of macro ‘alternative_input’
  163.   alternative_input(BASE_PREFETCH, "prefetchw %P1",
  164.   ^
  165. In file included from ./arch/x86/include/asm/barrier.h:5:0,
  166.                  from ./include/linux/compiler.h:256,
  167.                  from ./include/linux/init.h:5,
  168.                  from /var/lib/dkms/veeamsnap/3.0.2.1185/build/stdafx.h:4,
  169.                  from /var/lib/dkms/veeamsnap/3.0.2.1185/build/log.c:1:
  170. ./arch/x86/include/asm/alternative.h:108:2: error: expected identifier or ‘(’ before string constant
  171.   "# ALT: oldnstr\n"      \
  172.   ^
  173. ./arch/x86/include/asm/alternative.h:159:2: note: in expansion of macro ‘OLDINSTR’
  174.   OLDINSTR(oldinstr, 1)      \
  175.   ^
  176. ./arch/x86/include/asm/alternative.h:221:23: note: in expansion of macro ‘ALTERNATIVE’
  177.   asm_inline volatile (ALTERNATIVE(oldinstr, newinstr, feature) \
  178.                        ^
  179. ./arch/x86/include/asm/processor.h:807:2: note: in expansion of macro ‘alternative_input’
  180.   alternative_input(BASE_PREFETCH, "prefetchw %P1",
  181.   ^
  182. In file included from <command-line>:0:0:
  183. ././include/linux/compiler_types.h:210:24: warning: ISO C90 forbids mixed declarations and code [-Wdeclaration-after-statement]
  184.  #define asm_inline asm __inline
  185.                         ^
  186. ./arch/x86/include/asm/alternative.h:221:2: note: in expansion of macro ‘asm_inline’
  187.   asm_inline volatile (ALTERNATIVE(oldinstr, newinstr, feature) \
  188.   ^
  189. ./arch/x86/include/asm/processor.h:807:2: note: in expansion of macro ‘alternative_input’
  190.   alternative_input(BASE_PREFETCH, "prefetchw %P1",
  191.   ^
  192. ./include/linux/thread_info.h: In function ‘copy_overflow’:
  193. ././include/linux/compiler_types.h:210:24: error: expected ‘(’ before ‘__inline’
  194.  #define asm_inline asm __inline
  195.                         ^
  196. ./arch/x86/include/asm/bug.h:35:2: note: in expansion of macro ‘asm_inline’
  197.   asm_inline volatile("1:\t" ins "\n"    \
  198.   ^
  199. ./arch/x86/include/asm/bug.h:79:2: note: in expansion of macro ‘_BUG_FLAGS’
  200.   _BUG_FLAGS(ASM_UD2, BUGFLAG_WARNING|(flags));  \
  201.   ^
  202. ./include/asm-generic/bug.h:93:3: note: in expansion of macro ‘__WARN_FLAGS’
  203.    __WARN_FLAGS(BUGFLAG_NO_CUT_HERE | BUGFLAG_TAINT(taint));\
  204.    ^
  205. ./include/asm-generic/bug.h:124:3: note: in expansion of macro ‘__WARN_printf’
  206.    __WARN_printf(TAINT_WARN, format);   \
  207.    ^
  208. ./include/linux/thread_info.h:134:2: note: in expansion of macro ‘WARN’
  209.   WARN(1, "Buffer overflow detected (%d < %lu)!\n", size, count);
  210.   ^
  211. In file included from ./include/linux/bug.h:5:0,
  212.                  from ./include/linux/thread_info.h:12,
  213.                  from ./arch/x86/include/asm/preempt.h:7,
  214.                  from ./include/linux/preempt.h:78,
  215.                  from ./include/linux/spinlock.h:51,
  216.                  from ./include/linux/seqlock.h:36,
  217.                  from ./include/linux/time.h:6,
  218.                  from ./include/linux/stat.h:19,
  219.                  from ./include/linux/module.h:10,
  220.                  from /var/lib/dkms/veeamsnap/3.0.2.1185/build/stdafx.h:5,
  221.                  from /var/lib/dkms/veeamsnap/3.0.2.1185/build/log.c:1:
  222. ./arch/x86/include/asm/bug.h:35:22: error: expected identifier or ‘(’ before string constant
  223.   asm_inline volatile("1:\t" ins "\n"    \
  224.                       ^
  225. ./arch/x86/include/asm/bug.h:79:2: note: in expansion of macro ‘_BUG_FLAGS’
  226.   _BUG_FLAGS(ASM_UD2, BUGFLAG_WARNING|(flags));  \
  227.   ^
  228. ./include/asm-generic/bug.h:93:3: note: in expansion of macro ‘__WARN_FLAGS’
  229.    __WARN_FLAGS(BUGFLAG_NO_CUT_HERE | BUGFLAG_TAINT(taint));\
  230.    ^
  231. ./include/asm-generic/bug.h:124:3: note: in expansion of macro ‘__WARN_printf’
  232.    __WARN_printf(TAINT_WARN, format);   \
  233.    ^
  234. ./include/linux/thread_info.h:134:2: note: in expansion of macro ‘WARN’
  235.   WARN(1, "Buffer overflow detected (%d < %lu)!\n", size, count);
  236.   ^
  237. In file included from <command-line>:0:0:
  238. ././include/linux/compiler_types.h:210:24: warning: ISO C90 forbids mixed declarations and code [-Wdeclaration-after-statement]
  239.  #define asm_inline asm __inline
  240.                         ^
  241. ./arch/x86/include/asm/bug.h:35:2: note: in expansion of macro ‘asm_inline’
  242.   asm_inline volatile("1:\t" ins "\n"    \
  243.   ^
  244. ./arch/x86/include/asm/bug.h:79:2: note: in expansion of macro ‘_BUG_FLAGS’
  245.   _BUG_FLAGS(ASM_UD2, BUGFLAG_WARNING|(flags));  \
  246.   ^
  247. ./include/asm-generic/bug.h:93:3: note: in expansion of macro ‘__WARN_FLAGS’
  248.    __WARN_FLAGS(BUGFLAG_NO_CUT_HERE | BUGFLAG_TAINT(taint));\
  249.    ^
  250. ./include/asm-generic/bug.h:124:3: note: in expansion of macro ‘__WARN_printf’
  251.    __WARN_printf(TAINT_WARN, format);   \
  252.    ^
  253. ./include/linux/thread_info.h:134:2: note: in expansion of macro ‘WARN’
  254.   WARN(1, "Buffer overflow detected (%d < %lu)!\n", size, count);
  255.   ^
  256. In file included from <command-line>:0:0:
  257. ./include/linux/rcupdate.h: In function ‘rcu_head_after_call_rcu’:
  258. ././include/linux/compiler_types.h:210:24: error: expected ‘(’ before ‘__inline’
  259.  #define asm_inline asm __inline
  260.                         ^
  261. ./arch/x86/include/asm/bug.h:35:2: note: in expansion of macro ‘asm_inline’
  262.   asm_inline volatile("1:\t" ins "\n"    \
  263.   ^
  264. ./arch/x86/include/asm/bug.h:79:2: note: in expansion of macro ‘_BUG_FLAGS’
  265.   _BUG_FLAGS(ASM_UD2, BUGFLAG_WARNING|(flags));  \
  266.   ^
  267. ./include/asm-generic/bug.h:98:3: note: in expansion of macro ‘__WARN_FLAGS’
  268.    __WARN_FLAGS(BUGFLAG_ONCE |   \
  269.    ^
  270. ./include/linux/rcupdate.h:893:2: note: in expansion of macro ‘WARN_ON_ONCE’
  271.   WARN_ON_ONCE(func != (rcu_callback_t)~0L);
  272.   ^
  273. In file included from ./include/linux/bug.h:5:0,
  274.                  from ./include/linux/thread_info.h:12,
  275.                  from ./arch/x86/include/asm/preempt.h:7,
  276.                  from ./include/linux/preempt.h:78,
  277.                  from ./include/linux/spinlock.h:51,
  278.                  from ./include/linux/seqlock.h:36,
  279.                  from ./include/linux/time.h:6,
  280.                  from ./include/linux/stat.h:19,
  281.                  from ./include/linux/module.h:10,
  282.                  from /var/lib/dkms/veeamsnap/3.0.2.1185/build/stdafx.h:5,
  283.                  from /var/lib/dkms/veeamsnap/3.0.2.1185/build/log.c:1:
  284. ./arch/x86/include/asm/bug.h:35:22: error: expected identifier or ‘(’ before string constant
  285.   asm_inline volatile("1:\t" ins "\n"    \
  286.                       ^
  287. ./arch/x86/include/asm/bug.h:79:2: note: in expansion of macro ‘_BUG_FLAGS’
  288.   _BUG_FLAGS(ASM_UD2, BUGFLAG_WARNING|(flags));  \
  289.   ^
  290. ./include/asm-generic/bug.h:98:3: note: in expansion of macro ‘__WARN_FLAGS’
  291.    __WARN_FLAGS(BUGFLAG_ONCE |   \
  292.    ^
  293. ./include/linux/rcupdate.h:893:2: note: in expansion of macro ‘WARN_ON_ONCE’
  294.   WARN_ON_ONCE(func != (rcu_callback_t)~0L);
  295.   ^
  296. In file included from <command-line>:0:0:
  297. ././include/linux/compiler_types.h:210:24: warning: ISO C90 forbids mixed declarations and code [-Wdeclaration-after-statement]
  298.  #define asm_inline asm __inline
  299.                         ^
  300. ./arch/x86/include/asm/bug.h:35:2: note: in expansion of macro ‘asm_inline’
  301.   asm_inline volatile("1:\t" ins "\n"    \
  302.   ^
  303. ./arch/x86/include/asm/bug.h:79:2: note: in expansion of macro ‘_BUG_FLAGS’
  304.   _BUG_FLAGS(ASM_UD2, BUGFLAG_WARNING|(flags));  \
  305.   ^
  306. ./include/asm-generic/bug.h:98:3: note: in expansion of macro ‘__WARN_FLAGS’
  307.    __WARN_FLAGS(BUGFLAG_ONCE |   \
  308.    ^
  309. ./include/linux/rcupdate.h:893:2: note: in expansion of macro ‘WARN_ON_ONCE’
  310.   WARN_ON_ONCE(func != (rcu_callback_t)~0L);
  311.   ^
  312. ./include/linux/ktime.h: In function ‘ktime_divns’:
  313. ././include/linux/compiler_types.h:210:24: error: expected ‘(’ before ‘__inline’
  314.  #define asm_inline asm __inline
  315.                         ^
  316. ./arch/x86/include/asm/bug.h:35:2: note: in expansion of macro ‘asm_inline’
  317.   asm_inline volatile("1:\t" ins "\n"    \
  318.   ^
  319. ./arch/x86/include/asm/bug.h:79:2: note: in expansion of macro ‘_BUG_FLAGS’
  320.   _BUG_FLAGS(ASM_UD2, BUGFLAG_WARNING|(flags));  \
  321.   ^
  322. ./include/asm-generic/bug.h:90:19: note: in expansion of macro ‘__WARN_FLAGS’
  323.  #define __WARN()  __WARN_FLAGS(BUGFLAG_TAINT(TAINT_WARN))
  324.                    ^
  325. ./include/asm-generic/bug.h:115:3: note: in expansion of macro ‘__WARN’
  326.    __WARN();      \
  327.    ^
  328. ./include/linux/ktime.h:171:2: note: in expansion of macro ‘WARN_ON’
  329.   WARN_ON(div < 0);
  330.   ^
  331. In file included from ./include/linux/bug.h:5:0,
  332.                  from ./include/linux/thread_info.h:12,
  333.                  from ./arch/x86/include/asm/preempt.h:7,
  334.                  from ./include/linux/preempt.h:78,
  335.                  from ./include/linux/spinlock.h:51,
  336.                  from ./include/linux/seqlock.h:36,
  337.                  from ./include/linux/time.h:6,
  338.                  from ./include/linux/stat.h:19,
  339.                  from ./include/linux/module.h:10,
  340.                  from /var/lib/dkms/veeamsnap/3.0.2.1185/build/stdafx.h:5,
  341.                  from /var/lib/dkms/veeamsnap/3.0.2.1185/build/log.c:1:
  342. ./arch/x86/include/asm/bug.h:35:22: error: expected identifier or ‘(’ before string constant
  343.   asm_inline volatile("1:\t" ins "\n"    \
  344.                       ^
  345. ./arch/x86/include/asm/bug.h:79:2: note: in expansion of macro ‘_BUG_FLAGS’
  346.   _BUG_FLAGS(ASM_UD2, BUGFLAG_WARNING|(flags));  \
  347.   ^
  348. ./include/asm-generic/bug.h:90:19: note: in expansion of macro ‘__WARN_FLAGS’
  349.  #define __WARN()  __WARN_FLAGS(BUGFLAG_TAINT(TAINT_WARN))
  350.                    ^
  351. ./include/asm-generic/bug.h:115:3: note: in expansion of macro ‘__WARN’
  352.    __WARN();      \
  353.    ^
  354. ./include/linux/ktime.h:171:2: note: in expansion of macro ‘WARN_ON’
  355.   WARN_ON(div < 0);
  356.   ^
  357. In file included from <command-line>:0:0:
  358. ././include/linux/compiler_types.h:210:24: warning: ISO C90 forbids mixed declarations and code [-Wdeclaration-after-statement]
  359.  #define asm_inline asm __inline
  360.                         ^
  361. ./arch/x86/include/asm/bug.h:35:2: note: in expansion of macro ‘asm_inline’
  362.   asm_inline volatile("1:\t" ins "\n"    \
  363.   ^
  364. ./arch/x86/include/asm/bug.h:79:2: note: in expansion of macro ‘_BUG_FLAGS’
  365.   _BUG_FLAGS(ASM_UD2, BUGFLAG_WARNING|(flags));  \
  366.   ^
  367. ./include/asm-generic/bug.h:90:19: note: in expansion of macro ‘__WARN_FLAGS’
  368.  #define __WARN()  __WARN_FLAGS(BUGFLAG_TAINT(TAINT_WARN))
  369.                    ^
  370. ./include/asm-generic/bug.h:115:3: note: in expansion of macro ‘__WARN’
  371.    __WARN();      \
  372.    ^
  373. ./include/linux/ktime.h:171:2: note: in expansion of macro ‘WARN_ON’
  374.   WARN_ON(div < 0);
  375.   ^
  376. ./include/linux/srcu.h: In function ‘srcu_read_unlock’:
  377. ././include/linux/compiler_types.h:210:24: error: expected ‘(’ before ‘__inline’
  378.  #define asm_inline asm __inline
  379.                         ^
  380. ./arch/x86/include/asm/bug.h:35:2: note: in expansion of macro ‘asm_inline’
  381.   asm_inline volatile("1:\t" ins "\n"    \
  382.   ^
  383. ./arch/x86/include/asm/bug.h:79:2: note: in expansion of macro ‘_BUG_FLAGS’
  384.   _BUG_FLAGS(ASM_UD2, BUGFLAG_WARNING|(flags));  \
  385.   ^
  386. ./include/asm-generic/bug.h:98:3: note: in expansion of macro ‘__WARN_FLAGS’
  387.    __WARN_FLAGS(BUGFLAG_ONCE |   \
  388.    ^
  389. ./include/linux/srcu.h:179:2: note: in expansion of macro ‘WARN_ON_ONCE’
  390.   WARN_ON_ONCE(idx & ~0x1);
  391.   ^
  392. In file included from ./include/linux/bug.h:5:0,
  393.                  from ./include/linux/thread_info.h:12,
  394.                  from ./arch/x86/include/asm/preempt.h:7,
  395.                  from ./include/linux/preempt.h:78,
  396.                  from ./include/linux/spinlock.h:51,
  397.                  from ./include/linux/seqlock.h:36,
  398.                  from ./include/linux/time.h:6,
  399.                  from ./include/linux/stat.h:19,
  400.                  from ./include/linux/module.h:10,
  401.                  from /var/lib/dkms/veeamsnap/3.0.2.1185/build/stdafx.h:5,
  402.                  from /var/lib/dkms/veeamsnap/3.0.2.1185/build/log.c:1:
  403. ./arch/x86/include/asm/bug.h:35:22: error: expected identifier or ‘(’ before string constant
  404.   asm_inline volatile("1:\t" ins "\n"    \
  405.                       ^
  406. ./arch/x86/include/asm/bug.h:79:2: note: in expansion of macro ‘_BUG_FLAGS’
  407.   _BUG_FLAGS(ASM_UD2, BUGFLAG_WARNING|(flags));  \
  408.   ^
  409. ./include/asm-generic/bug.h:98:3: note: in expansion of macro ‘__WARN_FLAGS’
  410.    __WARN_FLAGS(BUGFLAG_ONCE |   \
  411.    ^
  412. ./include/linux/srcu.h:179:2: note: in expansion of macro ‘WARN_ON_ONCE’
  413.   WARN_ON_ONCE(idx & ~0x1);
  414.   ^
  415. In file included from <command-line>:0:0:
  416. ././include/linux/compiler_types.h:210:24: warning: ISO C90 forbids mixed declarations and code [-Wdeclaration-after-statement]
  417.  #define asm_inline asm __inline
  418.                         ^
  419. ./arch/x86/include/asm/bug.h:35:2: note: in expansion of macro ‘asm_inline’
  420.   asm_inline volatile("1:\t" ins "\n"    \
  421.   ^
  422. ./arch/x86/include/asm/bug.h:79:2: note: in expansion of macro ‘_BUG_FLAGS’
  423.   _BUG_FLAGS(ASM_UD2, BUGFLAG_WARNING|(flags));  \
  424.   ^
  425. ./include/asm-generic/bug.h:98:3: note: in expansion of macro ‘__WARN_FLAGS’
  426.    __WARN_FLAGS(BUGFLAG_ONCE |   \
  427.    ^
  428. ./include/linux/srcu.h:179:2: note: in expansion of macro ‘WARN_ON_ONCE’
  429.   WARN_ON_ONCE(idx & ~0x1);
  430.   ^
  431. ./include/linux/page-flags.h: In function ‘ClearPageCompound’:
  432. ././include/linux/compiler_types.h:210:24: error: expected ‘(’ before ‘__inline’
  433.  #define asm_inline asm __inline
  434.                         ^
  435. ./arch/x86/include/asm/bug.h:35:2: note: in expansion of macro ‘asm_inline’
  436.   asm_inline volatile("1:\t" ins "\n"    \
  437.   ^
  438. ./arch/x86/include/asm/bug.h:73:2: note: in expansion of macro ‘_BUG_FLAGS’
  439.   _BUG_FLAGS(ASM_UD2, 0);     \
  440.   ^
  441. ./include/asm-generic/bug.h:62:57: note: in expansion of macro ‘BUG’
  442.  #define BUG_ON(condition) do { if (unlikely(condition)) BUG(); } while (0)
  443.                                                          ^
  444. ./include/linux/page-flags.h:565:2: note: in expansion of macro ‘BUG_ON’
  445.   BUG_ON(!PageHead(page));
  446.   ^
  447. In file included from ./include/linux/bug.h:5:0,
  448.                  from ./include/linux/thread_info.h:12,
  449.                  from ./arch/x86/include/asm/preempt.h:7,
  450.                  from ./include/linux/preempt.h:78,
  451.                  from ./include/linux/spinlock.h:51,
  452.                  from ./include/linux/seqlock.h:36,
  453.                  from ./include/linux/time.h:6,
  454.                  from ./include/linux/stat.h:19,
  455.                  from ./include/linux/module.h:10,
  456.                  from /var/lib/dkms/veeamsnap/3.0.2.1185/build/stdafx.h:5,
  457.                  from /var/lib/dkms/veeamsnap/3.0.2.1185/build/log.c:1:
  458. ./arch/x86/include/asm/bug.h:35:22: error: expected identifier or ‘(’ before string constant
  459.   asm_inline volatile("1:\t" ins "\n"    \
  460.                       ^
  461. ./arch/x86/include/asm/bug.h:73:2: note: in expansion of macro ‘_BUG_FLAGS’
  462.   _BUG_FLAGS(ASM_UD2, 0);     \
  463.   ^
  464. ./include/asm-generic/bug.h:62:57: note: in expansion of macro ‘BUG’
  465.  #define BUG_ON(condition) do { if (unlikely(condition)) BUG(); } while (0)
  466.                                                          ^
  467. ./include/linux/page-flags.h:565:2: note: in expansion of macro ‘BUG_ON’
  468.   BUG_ON(!PageHead(page));
  469.   ^
  470. In file included from <command-line>:0:0:
  471. ././include/linux/compiler_types.h:210:24: warning: ISO C90 forbids mixed declarations and code [-Wdeclaration-after-statement]
  472.  #define asm_inline asm __inline
  473.                         ^
  474. ./arch/x86/include/asm/bug.h:35:2: note: in expansion of macro ‘asm_inline’
  475.   asm_inline volatile("1:\t" ins "\n"    \
  476.   ^
  477. ./arch/x86/include/asm/bug.h:73:2: note: in expansion of macro ‘_BUG_FLAGS’
  478.   _BUG_FLAGS(ASM_UD2, 0);     \
  479.   ^
  480. ./include/asm-generic/bug.h:62:57: note: in expansion of macro ‘BUG’
  481.  #define BUG_ON(condition) do { if (unlikely(condition)) BUG(); } while (0)
  482.                                                          ^
  483. ./include/linux/page-flags.h:565:2: note: in expansion of macro ‘BUG_ON’
  484.   BUG_ON(!PageHead(page));
  485.   ^
  486. ./include/asm-generic/fixmap.h: In function ‘virt_to_fix’:
  487. ././include/linux/compiler_types.h:210:24: error: expected ‘(’ before ‘__inline’
  488.  #define asm_inline asm __inline
  489.                         ^
  490. ./arch/x86/include/asm/bug.h:35:2: note: in expansion of macro ‘asm_inline’
  491.   asm_inline volatile("1:\t" ins "\n"    \
  492.   ^
  493. ./arch/x86/include/asm/bug.h:73:2: note: in expansion of macro ‘_BUG_FLAGS’
  494.   _BUG_FLAGS(ASM_UD2, 0);     \
  495.   ^
  496. ./include/asm-generic/bug.h:62:57: note: in expansion of macro ‘BUG’
  497.  #define BUG_ON(condition) do { if (unlikely(condition)) BUG(); } while (0)
  498.                                                          ^
  499. ./include/asm-generic/fixmap.h:38:2: note: in expansion of macro ‘BUG_ON’
  500.   BUG_ON(vaddr >= FIXADDR_TOP || vaddr < FIXADDR_START);
  501.   ^
  502. In file included from ./include/linux/bug.h:5:0,
  503.                  from ./include/linux/thread_info.h:12,
  504.                  from ./arch/x86/include/asm/preempt.h:7,
  505.                  from ./include/linux/preempt.h:78,
  506.                  from ./include/linux/spinlock.h:51,
  507.                  from ./include/linux/seqlock.h:36,
  508.                  from ./include/linux/time.h:6,
  509.                  from ./include/linux/stat.h:19,
  510.                  from ./include/linux/module.h:10,
  511.                  from /var/lib/dkms/veeamsnap/3.0.2.1185/build/stdafx.h:5,
  512.                  from /var/lib/dkms/veeamsnap/3.0.2.1185/build/log.c:1:
  513. ./arch/x86/include/asm/bug.h:35:22: error: expected identifier or ‘(’ before string constant
  514.   asm_inline volatile("1:\t" ins "\n"    \
  515.                       ^
  516. ./arch/x86/include/asm/bug.h:73:2: note: in expansion of macro ‘_BUG_FLAGS’
  517.   _BUG_FLAGS(ASM_UD2, 0);     \
  518.   ^
  519. ./include/asm-generic/bug.h:62:57: note: in expansion of macro ‘BUG’
  520.  #define BUG_ON(condition) do { if (unlikely(condition)) BUG(); } while (0)
  521.                                                          ^
  522. ./include/asm-generic/fixmap.h:38:2: note: in expansion of macro ‘BUG_ON’
  523.   BUG_ON(vaddr >= FIXADDR_TOP || vaddr < FIXADDR_START);
  524.   ^
  525. In file included from <command-line>:0:0:
  526. ././include/linux/compiler_types.h:210:24: warning: ISO C90 forbids mixed declarations and code [-Wdeclaration-after-statement]
  527.  #define asm_inline asm __inline
  528.                         ^
  529. ./arch/x86/include/asm/bug.h:35:2: note: in expansion of macro ‘asm_inline’
  530.   asm_inline volatile("1:\t" ins "\n"    \
  531.   ^
  532. ./arch/x86/include/asm/bug.h:73:2: note: in expansion of macro ‘_BUG_FLAGS’
  533.   _BUG_FLAGS(ASM_UD2, 0);     \
  534.   ^
  535. ./include/asm-generic/bug.h:62:57: note: in expansion of macro ‘BUG’
  536.  #define BUG_ON(condition) do { if (unlikely(condition)) BUG(); } while (0)
  537.                                                          ^
  538. ./include/asm-generic/fixmap.h:38:2: note: in expansion of macro ‘BUG_ON’
  539.   BUG_ON(vaddr >= FIXADDR_TOP || vaddr < FIXADDR_START);
  540.   ^
  541. ./arch/x86/include/asm/apic.h: In function ‘native_apic_mem_write’:
  542. ././include/linux/compiler_types.h:210:24: error: expected ‘(’ before ‘__inline’
  543.  #define asm_inline asm __inline
  544.                         ^
  545. ./arch/x86/include/asm/alternative.h:240:2: note: in expansion of macro ‘asm_inline’
  546.   asm_inline volatile (ALTERNATIVE(oldinstr, newinstr, feature) \
  547.   ^
  548. ./arch/x86/include/asm/apic.h:107:2: note: in expansion of macro ‘alternative_io’
  549.   alternative_io("movl %0, %P1", "xchgl %0, %P1", X86_BUG_11AP,
  550.   ^
  551. In file included from ./arch/x86/include/asm/barrier.h:5:0,
  552.                  from ./include/linux/compiler.h:256,
  553.                  from ./include/linux/init.h:5,
  554.                  from /var/lib/dkms/veeamsnap/3.0.2.1185/build/stdafx.h:4,
  555.                  from /var/lib/dkms/veeamsnap/3.0.2.1185/build/log.c:1:
  556. ./arch/x86/include/asm/alternative.h:108:2: error: expected identifier or ‘(’ before string constant
  557.   "# ALT: oldnstr\n"      \
  558.   ^
  559. ./arch/x86/include/asm/alternative.h:159:2: note: in expansion of macro ‘OLDINSTR’
  560.   OLDINSTR(oldinstr, 1)      \
  561.   ^
  562. ./arch/x86/include/asm/alternative.h:240:23: note: in expansion of macro ‘ALTERNATIVE’
  563.   asm_inline volatile (ALTERNATIVE(oldinstr, newinstr, feature) \
  564.                        ^
  565. ./arch/x86/include/asm/apic.h:107:2: note: in expansion of macro ‘alternative_io’
  566.   alternative_io("movl %0, %P1", "xchgl %0, %P1", X86_BUG_11AP,
  567.   ^
  568. In file included from <command-line>:0:0:
  569. ././include/linux/compiler_types.h:210:24: warning: ISO C90 forbids mixed declarations and code [-Wdeclaration-after-statement]
  570.  #define asm_inline asm __inline
  571.                         ^
  572. ./arch/x86/include/asm/alternative.h:240:2: note: in expansion of macro ‘asm_inline’
  573.   asm_inline volatile (ALTERNATIVE(oldinstr, newinstr, feature) \
  574.   ^
  575. ./arch/x86/include/asm/apic.h:107:2: note: in expansion of macro ‘alternative_io’
  576.   alternative_io("movl %0, %P1", "xchgl %0, %P1", X86_BUG_11AP,
  577.   ^
  578. In file included from ./arch/x86/include/asm/smp.h:13:0,
  579.                  from ./arch/x86/include/asm/mmzone_64.h:11,
  580.                  from ./arch/x86/include/asm/mmzone.h:5,
  581.                  from ./include/linux/mmzone.h:972,
  582.                  from ./include/linux/gfp.h:6,
  583.                  from ./include/linux/umh.h:4,
  584.                  from ./include/linux/kmod.h:9,
  585.                  from ./include/linux/module.h:13,
  586.                  from /var/lib/dkms/veeamsnap/3.0.2.1185/build/stdafx.h:5,
  587.                  from /var/lib/dkms/veeamsnap/3.0.2.1185/build/log.c:1:
  588. ./arch/x86/include/asm/apic.h:105:16: warning: unused variable ‘addr’ [-Wunused-variable]
  589.   volatile u32 *addr = (volatile u32 *)(APIC_BASE + reg);
  590.                 ^
  591. In file included from <command-line>:0:0:
  592. ./include/linux/xarray.h: In function ‘xa_mk_value’:
  593. ././include/linux/compiler_types.h:210:24: error: expected ‘(’ before ‘__inline’
  594.  #define asm_inline asm __inline
  595.                         ^
  596. ./arch/x86/include/asm/bug.h:35:2: note: in expansion of macro ‘asm_inline’
  597.   asm_inline volatile("1:\t" ins "\n"    \
  598.   ^
  599. ./arch/x86/include/asm/bug.h:79:2: note: in expansion of macro ‘_BUG_FLAGS’
  600.   _BUG_FLAGS(ASM_UD2, BUGFLAG_WARNING|(flags));  \
  601.   ^
  602. ./include/asm-generic/bug.h:90:19: note: in expansion of macro ‘__WARN_FLAGS’
  603.  #define __WARN()  __WARN_FLAGS(BUGFLAG_TAINT(TAINT_WARN))
  604.                    ^
  605. ./include/asm-generic/bug.h:115:3: note: in expansion of macro ‘__WARN’
  606.    __WARN();      \
  607.    ^
  608. ./include/linux/xarray.h:54:2: note: in expansion of macro ‘WARN_ON’
  609.   WARN_ON((long)v < 0);
  610.   ^
  611. In file included from ./include/linux/bug.h:5:0,
  612.                  from ./include/linux/thread_info.h:12,
  613.                  from ./arch/x86/include/asm/preempt.h:7,
  614.                  from ./include/linux/preempt.h:78,
  615.                  from ./include/linux/spinlock.h:51,
  616.                  from ./include/linux/seqlock.h:36,
  617.                  from ./include/linux/time.h:6,
  618.                  from ./include/linux/stat.h:19,
  619.                  from ./include/linux/module.h:10,
  620.                  from /var/lib/dkms/veeamsnap/3.0.2.1185/build/stdafx.h:5,
  621.                  from /var/lib/dkms/veeamsnap/3.0.2.1185/build/log.c:1:
  622. ./arch/x86/include/asm/bug.h:35:22: error: expected identifier or ‘(’ before string constant
  623.   asm_inline volatile("1:\t" ins "\n"    \
  624.                       ^
  625. ./arch/x86/include/asm/bug.h:79:2: note: in expansion of macro ‘_BUG_FLAGS’
  626.   _BUG_FLAGS(ASM_UD2, BUGFLAG_WARNING|(flags));  \
  627.   ^
  628. ./include/asm-generic/bug.h:90:19: note: in expansion of macro ‘__WARN_FLAGS’
  629.  #define __WARN()  __WARN_FLAGS(BUGFLAG_TAINT(TAINT_WARN))
  630.                    ^
  631. ./include/asm-generic/bug.h:115:3: note: in expansion of macro ‘__WARN’
  632.    __WARN();      \
  633.    ^
  634. ./include/linux/xarray.h:54:2: note: in expansion of macro ‘WARN_ON’
  635.   WARN_ON((long)v < 0);
  636.   ^
  637. In file included from <command-line>:0:0:
  638. ././include/linux/compiler_types.h:210:24: warning: ISO C90 forbids mixed declarations and code [-Wdeclaration-after-statement]
  639.  #define asm_inline asm __inline
  640.                         ^
  641. ./arch/x86/include/asm/bug.h:35:2: note: in expansion of macro ‘asm_inline’
  642.   asm_inline volatile("1:\t" ins "\n"    \
  643.   ^
  644. ./arch/x86/include/asm/bug.h:79:2: note: in expansion of macro ‘_BUG_FLAGS’
  645.   _BUG_FLAGS(ASM_UD2, BUGFLAG_WARNING|(flags));  \
  646.   ^
  647. ./include/asm-generic/bug.h:90:19: note: in expansion of macro ‘__WARN_FLAGS’
  648.  #define __WARN()  __WARN_FLAGS(BUGFLAG_TAINT(TAINT_WARN))
  649.                    ^
  650. ./include/asm-generic/bug.h:115:3: note: in expansion of macro ‘__WARN’
  651.    __WARN();      \
  652.    ^
  653. ./include/linux/xarray.h:54:2: note: in expansion of macro ‘WARN_ON’
  654.   WARN_ON((long)v < 0);
  655.   ^
  656. ./include/linux/kernfs.h: In function ‘kernfs_enable_ns’:
  657. ././include/linux/compiler_types.h:210:24: error: expected ‘(’ before ‘__inline’
  658.  #define asm_inline asm __inline
  659.                         ^
  660. ./arch/x86/include/asm/bug.h:35:2: note: in expansion of macro ‘asm_inline’
  661.   asm_inline volatile("1:\t" ins "\n"    \
  662.   ^
  663. ./arch/x86/include/asm/bug.h:79:2: note: in expansion of macro ‘_BUG_FLAGS’
  664.   _BUG_FLAGS(ASM_UD2, BUGFLAG_WARNING|(flags));  \
  665.   ^
  666. ./include/asm-generic/bug.h:98:3: note: in expansion of macro ‘__WARN_FLAGS’
  667.    __WARN_FLAGS(BUGFLAG_ONCE |   \
  668.    ^
  669. ./include/linux/kernfs.h:304:2: note: in expansion of macro ‘WARN_ON_ONCE’
  670.   WARN_ON_ONCE(kernfs_type(kn) != KERNFS_DIR);
  671.   ^
  672. In file included from ./include/linux/bug.h:5:0,
  673.                  from ./include/linux/thread_info.h:12,
  674.                  from ./arch/x86/include/asm/preempt.h:7,
  675.                  from ./include/linux/preempt.h:78,
  676.                  from ./include/linux/spinlock.h:51,
  677.                  from ./include/linux/seqlock.h:36,
  678.                  from ./include/linux/time.h:6,
  679.                  from ./include/linux/stat.h:19,
  680.                  from ./include/linux/module.h:10,
  681.                  from /var/lib/dkms/veeamsnap/3.0.2.1185/build/stdafx.h:5,
  682.                  from /var/lib/dkms/veeamsnap/3.0.2.1185/build/log.c:1:
  683. ./arch/x86/include/asm/bug.h:35:22: error: expected identifier or ‘(’ before string constant
  684.   asm_inline volatile("1:\t" ins "\n"    \
  685.                       ^
  686. ./arch/x86/include/asm/bug.h:79:2: note: in expansion of macro ‘_BUG_FLAGS’
  687.   _BUG_FLAGS(ASM_UD2, BUGFLAG_WARNING|(flags));  \
  688.   ^
  689. ./include/asm-generic/bug.h:98:3: note: in expansion of macro ‘__WARN_FLAGS’
  690.    __WARN_FLAGS(BUGFLAG_ONCE |   \
  691.    ^
  692. ./include/linux/kernfs.h:304:2: note: in expansion of macro ‘WARN_ON_ONCE’
  693.   WARN_ON_ONCE(kernfs_type(kn) != KERNFS_DIR);
  694.   ^
  695. In file included from <command-line>:0:0:
  696. ././include/linux/compiler_types.h:210:24: warning: ISO C90 forbids mixed declarations and code [-Wdeclaration-after-statement]
  697.  #define asm_inline asm __inline
  698.                         ^
  699. ./arch/x86/include/asm/bug.h:35:2: note: in expansion of macro ‘asm_inline’
  700.   asm_inline volatile("1:\t" ins "\n"    \
  701.   ^
  702. ./arch/x86/include/asm/bug.h:79:2: note: in expansion of macro ‘_BUG_FLAGS’
  703.   _BUG_FLAGS(ASM_UD2, BUGFLAG_WARNING|(flags));  \
  704.   ^
  705. ./include/asm-generic/bug.h:98:3: note: in expansion of macro ‘__WARN_FLAGS’
  706.    __WARN_FLAGS(BUGFLAG_ONCE |   \
  707.    ^
  708. ./include/linux/kernfs.h:304:2: note: in expansion of macro ‘WARN_ON_ONCE’
  709.   WARN_ON_ONCE(kernfs_type(kn) != KERNFS_DIR);
  710.   ^
  711. ././include/linux/compiler_types.h:210:24: error: expected ‘(’ before ‘__inline’
  712.  #define asm_inline asm __inline
  713.                         ^
  714. ./arch/x86/include/asm/bug.h:35:2: note: in expansion of macro ‘asm_inline’
  715.   asm_inline volatile("1:\t" ins "\n"    \
  716.   ^
  717. ./arch/x86/include/asm/bug.h:79:2: note: in expansion of macro ‘_BUG_FLAGS’
  718.   _BUG_FLAGS(ASM_UD2, BUGFLAG_WARNING|(flags));  \
  719.   ^
  720. ./include/asm-generic/bug.h:98:3: note: in expansion of macro ‘__WARN_FLAGS’
  721.    __WARN_FLAGS(BUGFLAG_ONCE |   \
  722.    ^
  723. ./include/linux/kernfs.h:305:2: note: in expansion of macro ‘WARN_ON_ONCE’
  724.   WARN_ON_ONCE(!RB_EMPTY_ROOT(&kn->dir.children));
  725.   ^
  726. In file included from ./include/linux/bug.h:5:0,
  727.                  from ./include/linux/thread_info.h:12,
  728.                  from ./arch/x86/include/asm/preempt.h:7,
  729.                  from ./include/linux/preempt.h:78,
  730.                  from ./include/linux/spinlock.h:51,
  731.                  from ./include/linux/seqlock.h:36,
  732.                  from ./include/linux/time.h:6,
  733.                  from ./include/linux/stat.h:19,
  734.                  from ./include/linux/module.h:10,
  735.                  from /var/lib/dkms/veeamsnap/3.0.2.1185/build/stdafx.h:5,
  736.                  from /var/lib/dkms/veeamsnap/3.0.2.1185/build/log.c:1:
  737. ./arch/x86/include/asm/bug.h:35:22: error: expected identifier or ‘(’ before string constant
  738.   asm_inline volatile("1:\t" ins "\n"    \
  739.                       ^
  740. ./arch/x86/include/asm/bug.h:79:2: note: in expansion of macro ‘_BUG_FLAGS’
  741.   _BUG_FLAGS(ASM_UD2, BUGFLAG_WARNING|(flags));  \
  742.   ^
  743. ./include/asm-generic/bug.h:98:3: note: in expansion of macro ‘__WARN_FLAGS’
  744.    __WARN_FLAGS(BUGFLAG_ONCE |   \
  745.    ^
  746. ./include/linux/kernfs.h:305:2: note: in expansion of macro ‘WARN_ON_ONCE’
  747.   WARN_ON_ONCE(!RB_EMPTY_ROOT(&kn->dir.children));
  748.   ^
  749. In file included from <command-line>:0:0:
  750. ././include/linux/compiler_types.h:210:24: warning: ISO C90 forbids mixed declarations and code [-Wdeclaration-after-statement]
  751.  #define asm_inline asm __inline
  752.                         ^
  753. ./arch/x86/include/asm/bug.h:35:2: note: in expansion of macro ‘asm_inline’
  754.   asm_inline volatile("1:\t" ins "\n"    \
  755.   ^
  756. ./arch/x86/include/asm/bug.h:79:2: note: in expansion of macro ‘_BUG_FLAGS’
  757.   _BUG_FLAGS(ASM_UD2, BUGFLAG_WARNING|(flags));  \
  758.   ^
  759. ./include/asm-generic/bug.h:98:3: note: in expansion of macro ‘__WARN_FLAGS’
  760.    __WARN_FLAGS(BUGFLAG_ONCE |   \
  761.    ^
  762. ./include/linux/kernfs.h:305:2: note: in expansion of macro ‘WARN_ON_ONCE’
  763.   WARN_ON_ONCE(!RB_EMPTY_ROOT(&kn->dir.children));
  764.   ^
  765. ./include/linux/kobject.h: In function ‘kobject_has_children’:
  766. ././include/linux/compiler_types.h:210:24: error: expected ‘(’ before ‘__inline’
  767.  #define asm_inline asm __inline
  768.                         ^
  769. ./arch/x86/include/asm/bug.h:35:2: note: in expansion of macro ‘asm_inline’
  770.   asm_inline volatile("1:\t" ins "\n"    \
  771.   ^
  772. ./arch/x86/include/asm/bug.h:79:2: note: in expansion of macro ‘_BUG_FLAGS’
  773.   _BUG_FLAGS(ASM_UD2, BUGFLAG_WARNING|(flags));  \
  774.   ^
  775. ./include/asm-generic/bug.h:98:3: note: in expansion of macro ‘__WARN_FLAGS’
  776.    __WARN_FLAGS(BUGFLAG_ONCE |   \
  777.    ^
  778. ./include/linux/kobject.h:134:2: note: in expansion of macro ‘WARN_ON_ONCE’
  779.   WARN_ON_ONCE(kref_read(&kobj->kref) == 0);
  780.   ^
  781. In file included from ./include/linux/bug.h:5:0,
  782.                  from ./include/linux/thread_info.h:12,
  783.                  from ./arch/x86/include/asm/preempt.h:7,
  784.                  from ./include/linux/preempt.h:78,
  785.                  from ./include/linux/spinlock.h:51,
  786.                  from ./include/linux/seqlock.h:36,
  787.                  from ./include/linux/time.h:6,
  788.                  from ./include/linux/stat.h:19,
  789.                  from ./include/linux/module.h:10,
  790.                  from /var/lib/dkms/veeamsnap/3.0.2.1185/build/stdafx.h:5,
  791.                  from /var/lib/dkms/veeamsnap/3.0.2.1185/build/log.c:1:
  792. ./arch/x86/include/asm/bug.h:35:22: error: expected identifier or ‘(’ before string constant
  793.   asm_inline volatile("1:\t" ins "\n"    \
  794.                       ^
  795. ./arch/x86/include/asm/bug.h:79:2: note: in expansion of macro ‘_BUG_FLAGS’
  796.   _BUG_FLAGS(ASM_UD2, BUGFLAG_WARNING|(flags));  \
  797.   ^
  798. ./include/asm-generic/bug.h:98:3: note: in expansion of macro ‘__WARN_FLAGS’
  799.    __WARN_FLAGS(BUGFLAG_ONCE |   \
  800.    ^
  801. ./include/linux/kobject.h:134:2: note: in expansion of macro ‘WARN_ON_ONCE’
  802.   WARN_ON_ONCE(kref_read(&kobj->kref) == 0);
  803.   ^
  804. In file included from <command-line>:0:0:
  805. ././include/linux/compiler_types.h:210:24: warning: ISO C90 forbids mixed declarations and code [-Wdeclaration-after-statement]
  806.  #define asm_inline asm __inline
  807.                         ^
  808. ./arch/x86/include/asm/bug.h:35:2: note: in expansion of macro ‘asm_inline’
  809.   asm_inline volatile("1:\t" ins "\n"    \
  810.   ^
  811. ./arch/x86/include/asm/bug.h:79:2: note: in expansion of macro ‘_BUG_FLAGS’
  812.   _BUG_FLAGS(ASM_UD2, BUGFLAG_WARNING|(flags));  \
  813.   ^
  814. ./include/asm-generic/bug.h:98:3: note: in expansion of macro ‘__WARN_FLAGS’
  815.    __WARN_FLAGS(BUGFLAG_ONCE |   \
  816.    ^
  817. ./include/linux/kobject.h:134:2: note: in expansion of macro ‘WARN_ON_ONCE’
  818.   WARN_ON_ONCE(kref_read(&kobj->kref) == 0);
  819.   ^
  820. ./include/linux/iocontext.h: In function ‘get_io_context_active’:
  821. ././include/linux/compiler_types.h:210:24: error: expected ‘(’ before ‘__inline’
  822.  #define asm_inline asm __inline
  823.                         ^
  824. ./arch/x86/include/asm/bug.h:35:2: note: in expansion of macro ‘asm_inline’
  825.   asm_inline volatile("1:\t" ins "\n"    \
  826.   ^
  827. ./arch/x86/include/asm/bug.h:79:2: note: in expansion of macro ‘_BUG_FLAGS’
  828.   _BUG_FLAGS(ASM_UD2, BUGFLAG_WARNING|(flags));  \
  829.   ^
  830. ./include/asm-generic/bug.h:98:3: note: in expansion of macro ‘__WARN_FLAGS’
  831.    __WARN_FLAGS(BUGFLAG_ONCE |   \
  832.    ^
  833. ./include/linux/iocontext.h:131:2: note: in expansion of macro ‘WARN_ON_ONCE’
  834.   WARN_ON_ONCE(atomic_long_read(&ioc->refcount) <= 0);
  835.   ^
  836. In file included from ./include/linux/bug.h:5:0,
  837.                  from ./include/linux/thread_info.h:12,
  838.                  from ./arch/x86/include/asm/preempt.h:7,
  839.                  from ./include/linux/preempt.h:78,
  840.                  from ./include/linux/spinlock.h:51,
  841.                  from ./include/linux/seqlock.h:36,
  842.                  from ./include/linux/time.h:6,
  843.                  from ./include/linux/stat.h:19,
  844.                  from ./include/linux/module.h:10,
  845.                  from /var/lib/dkms/veeamsnap/3.0.2.1185/build/stdafx.h:5,
  846.                  from /var/lib/dkms/veeamsnap/3.0.2.1185/build/log.c:1:
  847. ./arch/x86/include/asm/bug.h:35:22: error: expected identifier or ‘(’ before string constant
  848.   asm_inline volatile("1:\t" ins "\n"    \
  849.                       ^
  850. ./arch/x86/include/asm/bug.h:79:2: note: in expansion of macro ‘_BUG_FLAGS’
  851.   _BUG_FLAGS(ASM_UD2, BUGFLAG_WARNING|(flags));  \
  852.   ^
  853. ./include/asm-generic/bug.h:98:3: note: in expansion of macro ‘__WARN_FLAGS’
  854.    __WARN_FLAGS(BUGFLAG_ONCE |   \
  855.    ^
  856. ./include/linux/iocontext.h:131:2: note: in expansion of macro ‘WARN_ON_ONCE’
  857.   WARN_ON_ONCE(atomic_long_read(&ioc->refcount) <= 0);
  858.   ^
  859. In file included from <command-line>:0:0:
  860. ././include/linux/compiler_types.h:210:24: warning: ISO C90 forbids mixed declarations and code [-Wdeclaration-after-statement]
  861.  #define asm_inline asm __inline
  862.                         ^
  863. ./arch/x86/include/asm/bug.h:35:2: note: in expansion of macro ‘asm_inline’
  864.   asm_inline volatile("1:\t" ins "\n"    \
  865.   ^
  866. ./arch/x86/include/asm/bug.h:79:2: note: in expansion of macro ‘_BUG_FLAGS’
  867.   _BUG_FLAGS(ASM_UD2, BUGFLAG_WARNING|(flags));  \
  868.   ^
  869. ./include/asm-generic/bug.h:98:3: note: in expansion of macro ‘__WARN_FLAGS’
  870.    __WARN_FLAGS(BUGFLAG_ONCE |   \
  871.    ^
  872. ./include/linux/iocontext.h:131:2: note: in expansion of macro ‘WARN_ON_ONCE’
  873.   WARN_ON_ONCE(atomic_long_read(&ioc->refcount) <= 0);
  874.   ^
  875. ././include/linux/compiler_types.h:210:24: error: expected ‘(’ before ‘__inline’
  876.  #define asm_inline asm __inline
  877.                         ^
  878. ./arch/x86/include/asm/bug.h:35:2: note: in expansion of macro ‘asm_inline’
  879.   asm_inline volatile("1:\t" ins "\n"    \
  880.   ^
  881. ./arch/x86/include/asm/bug.h:79:2: note: in expansion of macro ‘_BUG_FLAGS’
  882.   _BUG_FLAGS(ASM_UD2, BUGFLAG_WARNING|(flags));  \
  883.   ^
  884. ./include/asm-generic/bug.h:98:3: note: in expansion of macro ‘__WARN_FLAGS’
  885.    __WARN_FLAGS(BUGFLAG_ONCE |   \
  886.    ^
  887. ./include/linux/iocontext.h:132:2: note: in expansion of macro ‘WARN_ON_ONCE’
  888.   WARN_ON_ONCE(atomic_read(&ioc->active_ref) <= 0);
  889.   ^
  890. In file included from ./include/linux/bug.h:5:0,
  891.                  from ./include/linux/thread_info.h:12,
  892.                  from ./arch/x86/include/asm/preempt.h:7,
  893.                  from ./include/linux/preempt.h:78,
  894.                  from ./include/linux/spinlock.h:51,
  895.                  from ./include/linux/seqlock.h:36,
  896.                  from ./include/linux/time.h:6,
  897.                  from ./include/linux/stat.h:19,
  898.                  from ./include/linux/module.h:10,
  899.                  from /var/lib/dkms/veeamsnap/3.0.2.1185/build/stdafx.h:5,
  900.                  from /var/lib/dkms/veeamsnap/3.0.2.1185/build/log.c:1:
  901. ./arch/x86/include/asm/bug.h:35:22: error: expected identifier or ‘(’ before string constant
  902.   asm_inline volatile("1:\t" ins "\n"    \
  903.                       ^
  904. ./arch/x86/include/asm/bug.h:79:2: note: in expansion of macro ‘_BUG_FLAGS’
  905.   _BUG_FLAGS(ASM_UD2, BUGFLAG_WARNING|(flags));  \
  906.   ^
  907. ./include/asm-generic/bug.h:98:3: note: in expansion of macro ‘__WARN_FLAGS’
  908.    __WARN_FLAGS(BUGFLAG_ONCE |   \
  909.    ^
  910. ./include/linux/iocontext.h:132:2: note: in expansion of macro ‘WARN_ON_ONCE’
  911.   WARN_ON_ONCE(atomic_read(&ioc->active_ref) <= 0);
  912.   ^
  913. In file included from <command-line>:0:0:
  914. ././include/linux/compiler_types.h:210:24: warning: ISO C90 forbids mixed declarations and code [-Wdeclaration-after-statement]
  915.  #define asm_inline asm __inline
  916.                         ^
  917. ./arch/x86/include/asm/bug.h:35:2: note: in expansion of macro ‘asm_inline’
  918.   asm_inline volatile("1:\t" ins "\n"    \
  919.   ^
  920. ./arch/x86/include/asm/bug.h:79:2: note: in expansion of macro ‘_BUG_FLAGS’
  921.   _BUG_FLAGS(ASM_UD2, BUGFLAG_WARNING|(flags));  \
  922.   ^
  923. ./include/asm-generic/bug.h:98:3: note: in expansion of macro ‘__WARN_FLAGS’
  924.    __WARN_FLAGS(BUGFLAG_ONCE |   \
  925.    ^
  926. ./include/linux/iocontext.h:132:2: note: in expansion of macro ‘WARN_ON_ONCE’
  927.   WARN_ON_ONCE(atomic_read(&ioc->active_ref) <= 0);
  928.   ^
  929. ./include/linux/iocontext.h: In function ‘ioc_task_link’:
  930. ././include/linux/compiler_types.h:210:24: error: expected ‘(’ before ‘__inline’
  931.  #define asm_inline asm __inline
  932.                         ^
  933. ./arch/x86/include/asm/bug.h:35:2: note: in expansion of macro ‘asm_inline’
  934.   asm_inline volatile("1:\t" ins "\n"    \
  935.   ^
  936. ./arch/x86/include/asm/bug.h:79:2: note: in expansion of macro ‘_BUG_FLAGS’
  937.   _BUG_FLAGS(ASM_UD2, BUGFLAG_WARNING|(flags));  \
  938.   ^
  939. ./include/asm-generic/bug.h:98:3: note: in expansion of macro ‘__WARN_FLAGS’
  940.    __WARN_FLAGS(BUGFLAG_ONCE |   \
  941.    ^
  942. ./include/linux/iocontext.h:141:2: note: in expansion of macro ‘WARN_ON_ONCE’
  943.   WARN_ON_ONCE(atomic_read(&ioc->nr_tasks) <= 0);
  944.   ^
  945. In file included from ./include/linux/bug.h:5:0,
  946.                  from ./include/linux/thread_info.h:12,
  947.                  from ./arch/x86/include/asm/preempt.h:7,
  948.                  from ./include/linux/preempt.h:78,
  949.                  from ./include/linux/spinlock.h:51,
  950.                  from ./include/linux/seqlock.h:36,
  951.                  from ./include/linux/time.h:6,
  952.                  from ./include/linux/stat.h:19,
  953.                  from ./include/linux/module.h:10,
  954.                  from /var/lib/dkms/veeamsnap/3.0.2.1185/build/stdafx.h:5,
  955.                  from /var/lib/dkms/veeamsnap/3.0.2.1185/build/log.c:1:
  956. ./arch/x86/include/asm/bug.h:35:22: error: expected identifier or ‘(’ before string constant
  957.   asm_inline volatile("1:\t" ins "\n"    \
  958.                       ^
  959. ./arch/x86/include/asm/bug.h:79:2: note: in expansion of macro ‘_BUG_FLAGS’
  960.   _BUG_FLAGS(ASM_UD2, BUGFLAG_WARNING|(flags));  \
  961.   ^
  962. ./include/asm-generic/bug.h:98:3: note: in expansion of macro ‘__WARN_FLAGS’
  963.    __WARN_FLAGS(BUGFLAG_ONCE |   \
  964.    ^
  965. ./include/linux/iocontext.h:141:2: note: in expansion of macro ‘WARN_ON_ONCE’
  966.   WARN_ON_ONCE(atomic_read(&ioc->nr_tasks) <= 0);
  967.   ^
  968. In file included from <command-line>:0:0:
  969. ././include/linux/compiler_types.h:210:24: warning: ISO C90 forbids mixed declarations and code [-Wdeclaration-after-statement]
  970.  #define asm_inline asm __inline
  971.                         ^
  972. ./arch/x86/include/asm/bug.h:35:2: note: in expansion of macro ‘asm_inline’
  973.   asm_inline volatile("1:\t" ins "\n"    \
  974.   ^
  975. ./arch/x86/include/asm/bug.h:79:2: note: in expansion of macro ‘_BUG_FLAGS’
  976.   _BUG_FLAGS(ASM_UD2, BUGFLAG_WARNING|(flags));  \
  977.   ^
  978. ./include/asm-generic/bug.h:98:3: note: in expansion of macro ‘__WARN_FLAGS’
  979.    __WARN_FLAGS(BUGFLAG_ONCE |   \
  980.    ^
  981. ./include/linux/iocontext.h:141:2: note: in expansion of macro ‘WARN_ON_ONCE’
  982.   WARN_ON_ONCE(atomic_read(&ioc->nr_tasks) <= 0);
  983.   ^
  984. ./include/linux/quota.h: In function ‘make_kqid’:
  985. ././include/linux/compiler_types.h:210:24: error: expected ‘(’ before ‘__inline’
  986.  #define asm_inline asm __inline
  987.                         ^
  988. ./arch/x86/include/asm/bug.h:35:2: note: in expansion of macro ‘asm_inline’
  989.   asm_inline volatile("1:\t" ins "\n"    \
  990.   ^
  991. ./arch/x86/include/asm/bug.h:73:2: note: in expansion of macro ‘_BUG_FLAGS’
  992.   _BUG_FLAGS(ASM_UD2, 0);     \
  993.   ^
  994. ./include/linux/quota.h:114:3: note: in expansion of macro ‘BUG’
  995.    BUG();
  996.    ^
  997. In file included from ./include/linux/bug.h:5:0,
  998.                  from ./include/linux/thread_info.h:12,
  999.                  from ./arch/x86/include/asm/preempt.h:7,
  1000.                  from ./include/linux/preempt.h:78,
  1001.                  from ./include/linux/spinlock.h:51,
  1002.                  from ./include/linux/seqlock.h:36,
  1003.                  from ./include/linux/time.h:6,
  1004.                  from ./include/linux/stat.h:19,
  1005.                  from ./include/linux/module.h:10,
  1006.                  from /var/lib/dkms/veeamsnap/3.0.2.1185/build/stdafx.h:5,
  1007.                  from /var/lib/dkms/veeamsnap/3.0.2.1185/build/log.c:1:
  1008. ./arch/x86/include/asm/bug.h:35:22: error: expected identifier or ‘(’ before string constant
  1009.   asm_inline volatile("1:\t" ins "\n"    \
  1010.                       ^
  1011. ./arch/x86/include/asm/bug.h:73:2: note: in expansion of macro ‘_BUG_FLAGS’
  1012.   _BUG_FLAGS(ASM_UD2, 0);     \
  1013.   ^
  1014. ./include/linux/quota.h:114:3: note: in expansion of macro ‘BUG’
  1015.    BUG();
  1016.    ^
  1017. In file included from <command-line>:0:0:
  1018. ././include/linux/compiler_types.h:210:24: warning: ISO C90 forbids mixed declarations and code [-Wdeclaration-after-statement]
  1019.  #define asm_inline asm __inline
  1020.                         ^
  1021. ./arch/x86/include/asm/bug.h:35:2: note: in expansion of macro ‘asm_inline’
  1022.   asm_inline volatile("1:\t" ins "\n"    \
  1023.   ^
  1024. ./arch/x86/include/asm/bug.h:73:2: note: in expansion of macro ‘_BUG_FLAGS’
  1025.   _BUG_FLAGS(ASM_UD2, 0);     \
  1026.   ^
  1027. ./include/linux/quota.h:114:3: note: in expansion of macro ‘BUG’
  1028.    BUG();
  1029.    ^
  1030. ./include/linux/quota.h: In function ‘make_kqid_invalid’:
  1031. ././include/linux/compiler_types.h:210:24: error: expected ‘(’ before ‘__inline’
  1032.  #define asm_inline asm __inline
  1033.                         ^
  1034. ./arch/x86/include/asm/bug.h:35:2: note: in expansion of macro ‘asm_inline’
  1035.   asm_inline volatile("1:\t" ins "\n"    \
  1036.   ^
  1037. ./arch/x86/include/asm/bug.h:73:2: note: in expansion of macro ‘_BUG_FLAGS’
  1038.   _BUG_FLAGS(ASM_UD2, 0);     \
  1039.   ^
  1040. ./include/linux/quota.h:141:3: note: in expansion of macro ‘BUG’
  1041.    BUG();
  1042.    ^
  1043. In file included from ./include/linux/bug.h:5:0,
  1044.                  from ./include/linux/thread_info.h:12,
  1045.                  from ./arch/x86/include/asm/preempt.h:7,
  1046.                  from ./include/linux/preempt.h:78,
  1047.                  from ./include/linux/spinlock.h:51,
  1048.                  from ./include/linux/seqlock.h:36,
  1049.                  from ./include/linux/time.h:6,
  1050.                  from ./include/linux/stat.h:19,
  1051.                  from ./include/linux/module.h:10,
  1052.                  from /var/lib/dkms/veeamsnap/3.0.2.1185/build/stdafx.h:5,
  1053.                  from /var/lib/dkms/veeamsnap/3.0.2.1185/build/log.c:1:
  1054. ./arch/x86/include/asm/bug.h:35:22: error: expected identifier or ‘(’ before string constant
  1055.   asm_inline volatile("1:\t" ins "\n"    \
  1056.                       ^
  1057. ./arch/x86/include/asm/bug.h:73:2: note: in expansion of macro ‘_BUG_FLAGS’
  1058.   _BUG_FLAGS(ASM_UD2, 0);     \
  1059.   ^
  1060. ./include/linux/quota.h:141:3: note: in expansion of macro ‘BUG’
  1061.    BUG();
  1062.    ^
  1063. In file included from <command-line>:0:0:
  1064. ././include/linux/compiler_types.h:210:24: warning: ISO C90 forbids mixed declarations and code [-Wdeclaration-after-statement]
  1065.  #define asm_inline asm __inline
  1066.                         ^
  1067. ./arch/x86/include/asm/bug.h:35:2: note: in expansion of macro ‘asm_inline’
  1068.   asm_inline volatile("1:\t" ins "\n"    \
  1069.   ^
  1070. ./arch/x86/include/asm/bug.h:73:2: note: in expansion of macro ‘_BUG_FLAGS’
  1071.   _BUG_FLAGS(ASM_UD2, 0);     \
  1072.   ^
  1073. ./include/linux/quota.h:141:3: note: in expansion of macro ‘BUG’
  1074.    BUG();
  1075.    ^
  1076. ./include/linux/fs.h: In function ‘filemap_nr_thps_inc’:
  1077. ././include/linux/compiler_types.h:210:24: error: expected ‘(’ before ‘__inline’
  1078.  #define asm_inline asm __inline
  1079.                         ^
  1080. ./arch/x86/include/asm/bug.h:35:2: note: in expansion of macro ‘asm_inline’
  1081.   asm_inline volatile("1:\t" ins "\n"    \
  1082.   ^
  1083. ./arch/x86/include/asm/bug.h:79:2: note: in expansion of macro ‘_BUG_FLAGS’
  1084.   _BUG_FLAGS(ASM_UD2, BUGFLAG_WARNING|(flags));  \
  1085.   ^
  1086. ./include/asm-generic/bug.h:98:3: note: in expansion of macro ‘__WARN_FLAGS’
  1087.    __WARN_FLAGS(BUGFLAG_ONCE |   \
  1088.    ^
  1089. ./include/linux/fs.h:2825:2: note: in expansion of macro ‘WARN_ON_ONCE’
  1090.   WARN_ON_ONCE(1);
  1091.   ^
  1092. In file included from ./include/linux/bug.h:5:0,
  1093.                  from ./include/linux/thread_info.h:12,
  1094.                  from ./arch/x86/include/asm/preempt.h:7,
  1095.                  from ./include/linux/preempt.h:78,
  1096.                  from ./include/linux/spinlock.h:51,
  1097.                  from ./include/linux/seqlock.h:36,
  1098.                  from ./include/linux/time.h:6,
  1099.                  from ./include/linux/stat.h:19,
  1100.                  from ./include/linux/module.h:10,
  1101.                  from /var/lib/dkms/veeamsnap/3.0.2.1185/build/stdafx.h:5,
  1102.                  from /var/lib/dkms/veeamsnap/3.0.2.1185/build/log.c:1:
  1103. ./arch/x86/include/asm/bug.h:35:22: error: expected identifier or ‘(’ before string constant
  1104.   asm_inline volatile("1:\t" ins "\n"    \
  1105.                       ^
  1106. ./arch/x86/include/asm/bug.h:79:2: note: in expansion of macro ‘_BUG_FLAGS’
  1107.   _BUG_FLAGS(ASM_UD2, BUGFLAG_WARNING|(flags));  \
  1108.   ^
  1109. ./include/asm-generic/bug.h:98:3: note: in expansion of macro ‘__WARN_FLAGS’
  1110.    __WARN_FLAGS(BUGFLAG_ONCE |   \
  1111.    ^
  1112. ./include/linux/fs.h:2825:2: note: in expansion of macro ‘WARN_ON_ONCE’
  1113.   WARN_ON_ONCE(1);
  1114.   ^
  1115. In file included from <command-line>:0:0:
  1116. ././include/linux/compiler_types.h:210:24: warning: ISO C90 forbids mixed declarations and code [-Wdeclaration-after-statement]
  1117.  #define asm_inline asm __inline
  1118.                         ^
  1119. ./arch/x86/include/asm/bug.h:35:2: note: in expansion of macro ‘asm_inline’
  1120.   asm_inline volatile("1:\t" ins "\n"    \
  1121.   ^
  1122. ./arch/x86/include/asm/bug.h:79:2: note: in expansion of macro ‘_BUG_FLAGS’
  1123.   _BUG_FLAGS(ASM_UD2, BUGFLAG_WARNING|(flags));  \
  1124.   ^
  1125. ./include/asm-generic/bug.h:98:3: note: in expansion of macro ‘__WARN_FLAGS’
  1126.    __WARN_FLAGS(BUGFLAG_ONCE |   \
  1127.    ^
  1128. ./include/linux/fs.h:2825:2: note: in expansion of macro ‘WARN_ON_ONCE’
  1129.   WARN_ON_ONCE(1);
  1130.   ^
  1131. ./include/linux/fs.h: In function ‘filemap_nr_thps_dec’:
  1132. ././include/linux/compiler_types.h:210:24: error: expected ‘(’ before ‘__inline’
  1133.  #define asm_inline asm __inline
  1134.                         ^
  1135. ./arch/x86/include/asm/bug.h:35:2: note: in expansion of macro ‘asm_inline’
  1136.   asm_inline volatile("1:\t" ins "\n"    \
  1137.   ^
  1138. ./arch/x86/include/asm/bug.h:79:2: note: in expansion of macro ‘_BUG_FLAGS’
  1139.   _BUG_FLAGS(ASM_UD2, BUGFLAG_WARNING|(flags));  \
  1140.   ^
  1141. ./include/asm-generic/bug.h:98:3: note: in expansion of macro ‘__WARN_FLAGS’
  1142.    __WARN_FLAGS(BUGFLAG_ONCE |   \
  1143.    ^
  1144. ./include/linux/fs.h:2834:2: note: in expansion of macro ‘WARN_ON_ONCE’
  1145.   WARN_ON_ONCE(1);
  1146.   ^
  1147. In file included from ./include/linux/bug.h:5:0,
  1148.                  from ./include/linux/thread_info.h:12,
  1149.                  from ./arch/x86/include/asm/preempt.h:7,
  1150.                  from ./include/linux/preempt.h:78,
  1151.                  from ./include/linux/spinlock.h:51,
  1152.                  from ./include/linux/seqlock.h:36,
  1153.                  from ./include/linux/time.h:6,
  1154.                  from ./include/linux/stat.h:19,
  1155.                  from ./include/linux/module.h:10,
  1156.                  from /var/lib/dkms/veeamsnap/3.0.2.1185/build/stdafx.h:5,
  1157.                  from /var/lib/dkms/veeamsnap/3.0.2.1185/build/log.c:1:
  1158. ./arch/x86/include/asm/bug.h:35:22: error: expected identifier or ‘(’ before string constant
  1159.   asm_inline volatile("1:\t" ins "\n"    \
  1160.                       ^
  1161. ./arch/x86/include/asm/bug.h:79:2: note: in expansion of macro ‘_BUG_FLAGS’
  1162.   _BUG_FLAGS(ASM_UD2, BUGFLAG_WARNING|(flags));  \
  1163.   ^
  1164. ./include/asm-generic/bug.h:98:3: note: in expansion of macro ‘__WARN_FLAGS’
  1165.    __WARN_FLAGS(BUGFLAG_ONCE |   \
  1166.    ^
  1167. ./include/linux/fs.h:2834:2: note: in expansion of macro ‘WARN_ON_ONCE’
  1168.   WARN_ON_ONCE(1);
  1169.   ^
  1170. In file included from <command-line>:0:0:
  1171. ././include/linux/compiler_types.h:210:24: warning: ISO C90 forbids mixed declarations and code [-Wdeclaration-after-statement]
  1172.  #define asm_inline asm __inline
  1173.                         ^
  1174. ./arch/x86/include/asm/bug.h:35:2: note: in expansion of macro ‘asm_inline’
  1175.   asm_inline volatile("1:\t" ins "\n"    \
  1176.   ^
  1177. ./arch/x86/include/asm/bug.h:79:2: note: in expansion of macro ‘_BUG_FLAGS’
  1178.   _BUG_FLAGS(ASM_UD2, BUGFLAG_WARNING|(flags));  \
  1179.   ^
  1180. ./include/asm-generic/bug.h:98:3: note: in expansion of macro ‘__WARN_FLAGS’
  1181.    __WARN_FLAGS(BUGFLAG_ONCE |   \
  1182.    ^
  1183. ./include/linux/fs.h:2834:2: note: in expansion of macro ‘WARN_ON_ONCE’
  1184.   WARN_ON_ONCE(1);
  1185.   ^
  1186. ./include/linux/fs.h: In function ‘i_readcount_dec’:
  1187. ././include/linux/compiler_types.h:210:24: error: expected ‘(’ before ‘__inline’
  1188.  #define asm_inline asm __inline
  1189.                         ^
  1190. ./arch/x86/include/asm/bug.h:35:2: note: in expansion of macro ‘asm_inline’
  1191.   asm_inline volatile("1:\t" ins "\n"    \
  1192.   ^
  1193. ./arch/x86/include/asm/bug.h:73:2: note: in expansion of macro ‘_BUG_FLAGS’
  1194.   _BUG_FLAGS(ASM_UD2, 0);     \
  1195.   ^
  1196. ./include/asm-generic/bug.h:62:57: note: in expansion of macro ‘BUG’
  1197.  #define BUG_ON(condition) do { if (unlikely(condition)) BUG(); } while (0)
  1198.                                                          ^
  1199. ./include/linux/fs.h:2941:2: note: in expansion of macro ‘BUG_ON’
  1200.   BUG_ON(!atomic_read(&inode->i_readcount));
  1201.   ^
  1202. In file included from ./include/linux/bug.h:5:0,
  1203.                  from ./include/linux/thread_info.h:12,
  1204.                  from ./arch/x86/include/asm/preempt.h:7,
  1205.                  from ./include/linux/preempt.h:78,
  1206.                  from ./include/linux/spinlock.h:51,
  1207.                  from ./include/linux/seqlock.h:36,
  1208.                  from ./include/linux/time.h:6,
  1209.                  from ./include/linux/stat.h:19,
  1210.                  from ./include/linux/module.h:10,
  1211.                  from /var/lib/dkms/veeamsnap/3.0.2.1185/build/stdafx.h:5,
  1212.                  from /var/lib/dkms/veeamsnap/3.0.2.1185/build/log.c:1:
  1213. ./arch/x86/include/asm/bug.h:35:22: error: expected identifier or ‘(’ before string constant
  1214.   asm_inline volatile("1:\t" ins "\n"    \
  1215.                       ^
  1216. ./arch/x86/include/asm/bug.h:73:2: note: in expansion of macro ‘_BUG_FLAGS’
  1217.   _BUG_FLAGS(ASM_UD2, 0);     \
  1218.   ^
  1219. ./include/asm-generic/bug.h:62:57: note: in expansion of macro ‘BUG’
  1220.  #define BUG_ON(condition) do { if (unlikely(condition)) BUG(); } while (0)
  1221.                                                          ^
  1222. ./include/linux/fs.h:2941:2: note: in expansion of macro ‘BUG_ON’
  1223.   BUG_ON(!atomic_read(&inode->i_readcount));
  1224.   ^
  1225. In file included from <command-line>:0:0:
  1226. ././include/linux/compiler_types.h:210:24: warning: ISO C90 forbids mixed declarations and code [-Wdeclaration-after-statement]
  1227.  #define asm_inline asm __inline
  1228.                         ^
  1229. ./arch/x86/include/asm/bug.h:35:2: note: in expansion of macro ‘asm_inline’
  1230.   asm_inline volatile("1:\t" ins "\n"    \
  1231.   ^
  1232. ./arch/x86/include/asm/bug.h:73:2: note: in expansion of macro ‘_BUG_FLAGS’
  1233.   _BUG_FLAGS(ASM_UD2, 0);     \
  1234.   ^
  1235. ./include/asm-generic/bug.h:62:57: note: in expansion of macro ‘BUG’
  1236.  #define BUG_ON(condition) do { if (unlikely(condition)) BUG(); } while (0)
  1237.                                                          ^
  1238. ./include/linux/fs.h:2941:2: note: in expansion of macro ‘BUG_ON’
  1239.   BUG_ON(!atomic_read(&inode->i_readcount));
  1240.   ^
  1241. ./include/linux/slab.h: In function ‘kmalloc_index’:
  1242. ././include/linux/compiler_types.h:210:24: error: expected ‘(’ before ‘__inline’
  1243.  #define asm_inline asm __inline
  1244.                         ^
  1245. ./arch/x86/include/asm/bug.h:35:2: note: in expansion of macro ‘asm_inline’
  1246.   asm_inline volatile("1:\t" ins "\n"    \
  1247.   ^
  1248. ./arch/x86/include/asm/bug.h:73:2: note: in expansion of macro ‘_BUG_FLAGS’
  1249.   _BUG_FLAGS(ASM_UD2, 0);     \
  1250.   ^
  1251. ./include/linux/slab.h:386:2: note: in expansion of macro ‘BUG’
  1252.   BUG();
  1253.   ^
  1254. In file included from ./include/linux/bug.h:5:0,
  1255.                  from ./include/linux/thread_info.h:12,
  1256.                  from ./arch/x86/include/asm/preempt.h:7,
  1257.                  from ./include/linux/preempt.h:78,
  1258.                  from ./include/linux/spinlock.h:51,
  1259.                  from ./include/linux/seqlock.h:36,
  1260.                  from ./include/linux/time.h:6,
  1261.                  from ./include/linux/stat.h:19,
  1262.                  from ./include/linux/module.h:10,
  1263.                  from /var/lib/dkms/veeamsnap/3.0.2.1185/build/stdafx.h:5,
  1264.                  from /var/lib/dkms/veeamsnap/3.0.2.1185/build/log.c:1:
  1265. ./arch/x86/include/asm/bug.h:35:22: error: expected identifier or ‘(’ before string constant
  1266.   asm_inline volatile("1:\t" ins "\n"    \
  1267.                       ^
  1268. ./arch/x86/include/asm/bug.h:73:2: note: in expansion of macro ‘_BUG_FLAGS’
  1269.   _BUG_FLAGS(ASM_UD2, 0);     \
  1270.   ^
  1271. ./include/linux/slab.h:386:2: note: in expansion of macro ‘BUG’
  1272.   BUG();
  1273.   ^
  1274. In file included from <command-line>:0:0:
  1275. ././include/linux/compiler_types.h:210:24: warning: ISO C90 forbids mixed declarations and code [-Wdeclaration-after-statement]
  1276.  #define asm_inline asm __inline
  1277.                         ^
  1278. ./arch/x86/include/asm/bug.h:35:2: note: in expansion of macro ‘asm_inline’
  1279.   asm_inline volatile("1:\t" ins "\n"    \
  1280.   ^
  1281. ./arch/x86/include/asm/bug.h:73:2: note: in expansion of macro ‘_BUG_FLAGS’
  1282.   _BUG_FLAGS(ASM_UD2, 0);     \
  1283.   ^
  1284. ./include/linux/slab.h:386:2: note: in expansion of macro ‘BUG’
  1285.   BUG();
  1286.   ^
  1287. ./arch/x86/include/asm/smap.h: In function ‘clac’:
  1288. ././include/linux/compiler_types.h:210:24: error: expected ‘(’ before ‘__inline’
  1289.  #define asm_inline asm __inline
  1290.                         ^
  1291. ./arch/x86/include/asm/alternative.h:204:2: note: in expansion of macro ‘asm_inline’
  1292.   asm_inline volatile (ALTERNATIVE(oldinstr, newinstr, feature) : : : "memory")
  1293.   ^
  1294. ./arch/x86/include/asm/smap.h:47:2: note: in expansion of macro ‘alternative’
  1295.   alternative("", __ASM_CLAC, X86_FEATURE_SMAP);
  1296.   ^
  1297. In file included from ./arch/x86/include/asm/barrier.h:5:0,
  1298.                  from ./include/linux/compiler.h:256,
  1299.                  from ./include/linux/init.h:5,
  1300.                  from /var/lib/dkms/veeamsnap/3.0.2.1185/build/stdafx.h:4,
  1301.                  from /var/lib/dkms/veeamsnap/3.0.2.1185/build/log.c:1:
  1302. ./arch/x86/include/asm/alternative.h:108:2: error: expected identifier or ‘(’ before string constant
  1303.   "# ALT: oldnstr\n"      \
  1304.   ^
  1305. ./arch/x86/include/asm/alternative.h:159:2: note: in expansion of macro ‘OLDINSTR’
  1306.   OLDINSTR(oldinstr, 1)      \
  1307.   ^
  1308. ./arch/x86/include/asm/alternative.h:204:23: note: in expansion of macro ‘ALTERNATIVE’
  1309.   asm_inline volatile (ALTERNATIVE(oldinstr, newinstr, feature) : : : "memory")
  1310.                        ^
  1311. ./arch/x86/include/asm/smap.h:47:2: note: in expansion of macro ‘alternative’
  1312.   alternative("", __ASM_CLAC, X86_FEATURE_SMAP);
  1313.   ^
  1314. In file included from <command-line>:0:0:
  1315. ././include/linux/compiler_types.h:210:24: warning: ISO C90 forbids mixed declarations and code [-Wdeclaration-after-statement]
  1316.  #define asm_inline asm __inline
  1317.                         ^
  1318. ./arch/x86/include/asm/alternative.h:204:2: note: in expansion of macro ‘asm_inline’
  1319.   asm_inline volatile (ALTERNATIVE(oldinstr, newinstr, feature) : : : "memory")
  1320.   ^
  1321. ./arch/x86/include/asm/smap.h:47:2: note: in expansion of macro ‘alternative’
  1322.   alternative("", __ASM_CLAC, X86_FEATURE_SMAP);
  1323.   ^
  1324. ./arch/x86/include/asm/smap.h: In function ‘stac’:
  1325. ././include/linux/compiler_types.h:210:24: error: expected ‘(’ before ‘__inline’
  1326.  #define asm_inline asm __inline
  1327.                         ^
  1328. ./arch/x86/include/asm/alternative.h:204:2: note: in expansion of macro ‘asm_inline’
  1329.   asm_inline volatile (ALTERNATIVE(oldinstr, newinstr, feature) : : : "memory")
  1330.   ^
  1331. ./arch/x86/include/asm/smap.h:53:2: note: in expansion of macro ‘alternative’
  1332.   alternative("", __ASM_STAC, X86_FEATURE_SMAP);
  1333.   ^
  1334. In file included from ./arch/x86/include/asm/barrier.h:5:0,
  1335.                  from ./include/linux/compiler.h:256,
  1336.                  from ./include/linux/init.h:5,
  1337.                  from /var/lib/dkms/veeamsnap/3.0.2.1185/build/stdafx.h:4,
  1338.                  from /var/lib/dkms/veeamsnap/3.0.2.1185/build/log.c:1:
  1339. ./arch/x86/include/asm/alternative.h:108:2: error: expected identifier or ‘(’ before string constant
  1340.   "# ALT: oldnstr\n"      \
  1341.   ^
  1342. ./arch/x86/include/asm/alternative.h:159:2: note: in expansion of macro ‘OLDINSTR’
  1343.   OLDINSTR(oldinstr, 1)      \
  1344.   ^
  1345. ./arch/x86/include/asm/alternative.h:204:23: note: in expansion of macro ‘ALTERNATIVE’
  1346.   asm_inline volatile (ALTERNATIVE(oldinstr, newinstr, feature) : : : "memory")
  1347.                        ^
  1348. ./arch/x86/include/asm/smap.h:53:2: note: in expansion of macro ‘alternative’
  1349.   alternative("", __ASM_STAC, X86_FEATURE_SMAP);
  1350.   ^
  1351. In file included from <command-line>:0:0:
  1352. ././include/linux/compiler_types.h:210:24: warning: ISO C90 forbids mixed declarations and code [-Wdeclaration-after-statement]
  1353.  #define asm_inline asm __inline
  1354.                         ^
  1355. ./arch/x86/include/asm/alternative.h:204:2: note: in expansion of macro ‘asm_inline’
  1356.   asm_inline volatile (ALTERNATIVE(oldinstr, newinstr, feature) : : : "memory")
  1357.   ^
  1358. ./arch/x86/include/asm/smap.h:53:2: note: in expansion of macro ‘alternative’
  1359.   alternative("", __ASM_STAC, X86_FEATURE_SMAP);
  1360.   ^
  1361. ./arch/x86/include/asm/uaccess_64.h: In function ‘copy_user_generic’:
  1362. ././include/linux/compiler_types.h:210:24: error: expected ‘(’ before ‘__inline’
  1363.  #define asm_inline asm __inline
  1364.                         ^
  1365. ./arch/x86/include/asm/alternative.h:256:2: note: in expansion of macro ‘asm_inline’
  1366.   asm_inline volatile (ALTERNATIVE_2("call %P[old]", "call %P[new1]", feature1,\
  1367.   ^
  1368. ./arch/x86/include/asm/uaccess_64.h:37:2: note: in expansion of macro ‘alternative_call_2’
  1369.   alternative_call_2(copy_user_generic_unrolled,
  1370.   ^
  1371. In file included from ./arch/x86/include/asm/barrier.h:5:0,
  1372.                  from ./include/linux/compiler.h:256,
  1373.                  from ./include/linux/init.h:5,
  1374.                  from /var/lib/dkms/veeamsnap/3.0.2.1185/build/stdafx.h:4,
  1375.                  from /var/lib/dkms/veeamsnap/3.0.2.1185/build/log.c:1:
  1376. ./arch/x86/include/asm/alternative.h:128:2: error: expected identifier or ‘(’ before string constant
  1377.   "# ALT: oldinstr2\n"         \
  1378.   ^
  1379. ./arch/x86/include/asm/alternative.h:168:2: note: in expansion of macro ‘OLDINSTR_2’
  1380.   OLDINSTR_2(oldinstr, 1, 2)     \
  1381.   ^
  1382. ./arch/x86/include/asm/alternative.h:256:23: note: in expansion of macro ‘ALTERNATIVE_2’
  1383.   asm_inline volatile (ALTERNATIVE_2("call %P[old]", "call %P[new1]", feature1,\
  1384.                        ^
  1385. ./arch/x86/include/asm/uaccess_64.h:37:2: note: in expansion of macro ‘alternative_call_2’
  1386.   alternative_call_2(copy_user_generic_unrolled,
  1387.   ^
  1388. In file included from <command-line>:0:0:
  1389. ././include/linux/compiler_types.h:210:24: warning: ISO C90 forbids mixed declarations and code [-Wdeclaration-after-statement]
  1390.  #define asm_inline asm __inline
  1391.                         ^
  1392. ./arch/x86/include/asm/alternative.h:256:2: note: in expansion of macro ‘asm_inline’
  1393.   asm_inline volatile (ALTERNATIVE_2("call %P[old]", "call %P[new1]", feature1,\
  1394.   ^
  1395. ./arch/x86/include/asm/uaccess_64.h:37:2: note: in expansion of macro ‘alternative_call_2’
  1396.   alternative_call_2(copy_user_generic_unrolled,
  1397.   ^
  1398. ./arch/x86/include/asm/uaccess_64.h: In function ‘raw_copy_from_user’:
  1399. ././include/linux/compiler_types.h:210:24: error: expected ‘(’ before ‘__inline’
  1400.  #define asm_inline asm __inline
  1401.                         ^
  1402. ./arch/x86/include/asm/alternative.h:204:2: note: in expansion of macro ‘asm_inline’
  1403.   asm_inline volatile (ALTERNATIVE(oldinstr, newinstr, feature) : : : "memory")
  1404.   ^
  1405. ./arch/x86/include/asm/barrier.h:52:26: note: in expansion of macro ‘alternative’
  1406.  #define barrier_nospec() alternative("", "lfence", X86_FEATURE_LFENCE_RDTSC)
  1407.                           ^
  1408. ./arch/x86/include/asm/uaccess.h:125:2: note: in expansion of macro ‘barrier_nospec’
  1409.   barrier_nospec();  \
  1410.   ^
  1411. ./arch/x86/include/asm/uaccess_64.h:74:3: note: in expansion of macro ‘__uaccess_begin_nospec’
  1412.    __uaccess_begin_nospec();
  1413.    ^
  1414. In file included from ./arch/x86/include/asm/barrier.h:5:0,
  1415.                  from ./include/linux/compiler.h:256,
  1416.                  from ./include/linux/init.h:5,
  1417.                  from /var/lib/dkms/veeamsnap/3.0.2.1185/build/stdafx.h:4,
  1418.                  from /var/lib/dkms/veeamsnap/3.0.2.1185/build/log.c:1:
  1419. ./arch/x86/include/asm/alternative.h:108:2: error: expected identifier or ‘(’ before string constant
  1420.   "# ALT: oldnstr\n"      \
  1421.   ^
  1422. ./arch/x86/include/asm/alternative.h:159:2: note: in expansion of macro ‘OLDINSTR’
  1423.   OLDINSTR(oldinstr, 1)      \
  1424.   ^
  1425. ./arch/x86/include/asm/alternative.h:204:23: note: in expansion of macro ‘ALTERNATIVE’
  1426.   asm_inline volatile (ALTERNATIVE(oldinstr, newinstr, feature) : : : "memory")
  1427.                        ^
  1428. ./arch/x86/include/asm/barrier.h:52:26: note: in expansion of macro ‘alternative’
  1429.  #define barrier_nospec() alternative("", "lfence", X86_FEATURE_LFENCE_RDTSC)
  1430.                           ^
  1431. ./arch/x86/include/asm/uaccess.h:125:2: note: in expansion of macro ‘barrier_nospec’
  1432.   barrier_nospec();  \
  1433.   ^
  1434. ./arch/x86/include/asm/uaccess_64.h:74:3: note: in expansion of macro ‘__uaccess_begin_nospec’
  1435.    __uaccess_begin_nospec();
  1436.    ^
  1437. In file included from <command-line>:0:0:
  1438. ././include/linux/compiler_types.h:210:24: warning: ISO C90 forbids mixed declarations and code [-Wdeclaration-after-statement]
  1439.  #define asm_inline asm __inline
  1440.                         ^
  1441. ./arch/x86/include/asm/alternative.h:204:2: note: in expansion of macro ‘asm_inline’
  1442.   asm_inline volatile (ALTERNATIVE(oldinstr, newinstr, feature) : : : "memory")
  1443.   ^
  1444. ./arch/x86/include/asm/barrier.h:52:26: note: in expansion of macro ‘alternative’
  1445.  #define barrier_nospec() alternative("", "lfence", X86_FEATURE_LFENCE_RDTSC)
  1446.                           ^
  1447. ./arch/x86/include/asm/uaccess.h:125:2: note: in expansion of macro ‘barrier_nospec’
  1448.   barrier_nospec();  \
  1449.   ^
  1450. ./arch/x86/include/asm/uaccess_64.h:74:3: note: in expansion of macro ‘__uaccess_begin_nospec’
  1451.    __uaccess_begin_nospec();
  1452.    ^
  1453. ././include/linux/compiler_types.h:210:24: error: expected ‘(’ before ‘__inline’
  1454.  #define asm_inline asm __inline
  1455.                         ^
  1456. ./arch/x86/include/asm/alternative.h:204:2: note: in expansion of macro ‘asm_inline’
  1457.   asm_inline volatile (ALTERNATIVE(oldinstr, newinstr, feature) : : : "memory")
  1458.   ^
  1459. ./arch/x86/include/asm/barrier.h:52:26: note: in expansion of macro ‘alternative’
  1460.  #define barrier_nospec() alternative("", "lfence", X86_FEATURE_LFENCE_RDTSC)
  1461.                           ^
  1462. ./arch/x86/include/asm/uaccess.h:125:2: note: in expansion of macro ‘barrier_nospec’
  1463.   barrier_nospec();  \
  1464.   ^
  1465. ./arch/x86/include/asm/uaccess_64.h:80:3: note: in expansion of macro ‘__uaccess_begin_nospec’
  1466.    __uaccess_begin_nospec();
  1467.    ^
  1468. In file included from ./arch/x86/include/asm/barrier.h:5:0,
  1469.                  from ./include/linux/compiler.h:256,
  1470.                  from ./include/linux/init.h:5,
  1471.                  from /var/lib/dkms/veeamsnap/3.0.2.1185/build/stdafx.h:4,
  1472.                  from /var/lib/dkms/veeamsnap/3.0.2.1185/build/log.c:1:
  1473. ./arch/x86/include/asm/alternative.h:108:2: error: expected identifier or ‘(’ before string constant
  1474.   "# ALT: oldnstr\n"      \
  1475.   ^
  1476. ./arch/x86/include/asm/alternative.h:159:2: note: in expansion of macro ‘OLDINSTR’
  1477.   OLDINSTR(oldinstr, 1)      \
  1478.   ^
  1479. ./arch/x86/include/asm/alternative.h:204:23: note: in expansion of macro ‘ALTERNATIVE’
  1480.   asm_inline volatile (ALTERNATIVE(oldinstr, newinstr, feature) : : : "memory")
  1481.                        ^
  1482. ./arch/x86/include/asm/barrier.h:52:26: note: in expansion of macro ‘alternative’
  1483.  #define barrier_nospec() alternative("", "lfence", X86_FEATURE_LFENCE_RDTSC)
  1484.                           ^
  1485. ./arch/x86/include/asm/uaccess.h:125:2: note: in expansion of macro ‘barrier_nospec’
  1486.   barrier_nospec();  \
  1487.   ^
  1488. ./arch/x86/include/asm/uaccess_64.h:80:3: note: in expansion of macro ‘__uaccess_begin_nospec’
  1489.    __uaccess_begin_nospec();
  1490.    ^
  1491. In file included from <command-line>:0:0:
  1492. ././include/linux/compiler_types.h:210:24: warning: ISO C90 forbids mixed declarations and code [-Wdeclaration-after-statement]
  1493.  #define asm_inline asm __inline
  1494.                         ^
  1495. ./arch/x86/include/asm/alternative.h:204:2: note: in expansion of macro ‘asm_inline’
  1496.   asm_inline volatile (ALTERNATIVE(oldinstr, newinstr, feature) : : : "memory")
  1497.   ^
  1498. ./arch/x86/include/asm/barrier.h:52:26: note: in expansion of macro ‘alternative’
  1499.  #define barrier_nospec() alternative("", "lfence", X86_FEATURE_LFENCE_RDTSC)
  1500.                           ^
  1501. ./arch/x86/include/asm/uaccess.h:125:2: note: in expansion of macro ‘barrier_nospec’
  1502.   barrier_nospec();  \
  1503.   ^
  1504. ./arch/x86/include/asm/uaccess_64.h:80:3: note: in expansion of macro ‘__uaccess_begin_nospec’
  1505.    __uaccess_begin_nospec();
  1506.    ^
  1507. ././include/linux/compiler_types.h:210:24: error: expected ‘(’ before ‘__inline’
  1508.  #define asm_inline asm __inline
  1509.                         ^
  1510. ./arch/x86/include/asm/alternative.h:204:2: note: in expansion of macro ‘asm_inline’
  1511.   asm_inline volatile (ALTERNATIVE(oldinstr, newinstr, feature) : : : "memory")
  1512.   ^
  1513. ./arch/x86/include/asm/barrier.h:52:26: note: in expansion of macro ‘alternative’
  1514.  #define barrier_nospec() alternative("", "lfence", X86_FEATURE_LFENCE_RDTSC)
  1515.                           ^
  1516. ./arch/x86/include/asm/uaccess.h:125:2: note: in expansion of macro ‘barrier_nospec’
  1517.   barrier_nospec();  \
  1518.   ^
  1519. ./arch/x86/include/asm/uaccess_64.h:86:3: note: in expansion of macro ‘__uaccess_begin_nospec’
  1520.    __uaccess_begin_nospec();
  1521.    ^
  1522. In file included from ./arch/x86/include/asm/barrier.h:5:0,
  1523.                  from ./include/linux/compiler.h:256,
  1524.                  from ./include/linux/init.h:5,
  1525.                  from /var/lib/dkms/veeamsnap/3.0.2.1185/build/stdafx.h:4,
  1526.                  from /var/lib/dkms/veeamsnap/3.0.2.1185/build/log.c:1:
  1527. ./arch/x86/include/asm/alternative.h:108:2: error: expected identifier or ‘(’ before string constant
  1528.   "# ALT: oldnstr\n"      \
  1529.   ^
  1530. ./arch/x86/include/asm/alternative.h:159:2: note: in expansion of macro ‘OLDINSTR’
  1531.   OLDINSTR(oldinstr, 1)      \
  1532.   ^
  1533. ./arch/x86/include/asm/alternative.h:204:23: note: in expansion of macro ‘ALTERNATIVE’
  1534.   asm_inline volatile (ALTERNATIVE(oldinstr, newinstr, feature) : : : "memory")
  1535.                        ^
  1536. ./arch/x86/include/asm/barrier.h:52:26: note: in expansion of macro ‘alternative’
  1537.  #define barrier_nospec() alternative("", "lfence", X86_FEATURE_LFENCE_RDTSC)
  1538.                           ^
  1539. ./arch/x86/include/asm/uaccess.h:125:2: note: in expansion of macro ‘barrier_nospec’
  1540.   barrier_nospec();  \
  1541.   ^
  1542. ./arch/x86/include/asm/uaccess_64.h:86:3: note: in expansion of macro ‘__uaccess_begin_nospec’
  1543.    __uaccess_begin_nospec();
  1544.    ^
  1545. In file included from <command-line>:0:0:
  1546. ././include/linux/compiler_types.h:210:24: warning: ISO C90 forbids mixed declarations and code [-Wdeclaration-after-statement]
  1547.  #define asm_inline asm __inline
  1548.                         ^
  1549. ./arch/x86/include/asm/alternative.h:204:2: note: in expansion of macro ‘asm_inline’
  1550.   asm_inline volatile (ALTERNATIVE(oldinstr, newinstr, feature) : : : "memory")
  1551.   ^
  1552. ./arch/x86/include/asm/barrier.h:52:26: note: in expansion of macro ‘alternative’
  1553.  #define barrier_nospec() alternative("", "lfence", X86_FEATURE_LFENCE_RDTSC)
  1554.                           ^
  1555. ./arch/x86/include/asm/uaccess.h:125:2: note: in expansion of macro ‘barrier_nospec’
  1556.   barrier_nospec();  \
  1557.   ^
  1558. ./arch/x86/include/asm/uaccess_64.h:86:3: note: in expansion of macro ‘__uaccess_begin_nospec’
  1559.    __uaccess_begin_nospec();
  1560.    ^
  1561. ././include/linux/compiler_types.h:210:24: error: expected ‘(’ before ‘__inline’
  1562.  #define asm_inline asm __inline
  1563.                         ^
  1564. ./arch/x86/include/asm/alternative.h:204:2: note: in expansion of macro ‘asm_inline’
  1565.   asm_inline volatile (ALTERNATIVE(oldinstr, newinstr, feature) : : : "memory")
  1566.   ^
  1567. ./arch/x86/include/asm/barrier.h:52:26: note: in expansion of macro ‘alternative’
  1568.  #define barrier_nospec() alternative("", "lfence", X86_FEATURE_LFENCE_RDTSC)
  1569.                           ^
  1570. ./arch/x86/include/asm/uaccess.h:125:2: note: in expansion of macro ‘barrier_nospec’
  1571.   barrier_nospec();  \
  1572.   ^
  1573. ./arch/x86/include/asm/uaccess_64.h:92:3: note: in expansion of macro ‘__uaccess_begin_nospec’
  1574.    __uaccess_begin_nospec();
  1575.    ^
  1576. In file included from ./arch/x86/include/asm/barrier.h:5:0,
  1577.                  from ./include/linux/compiler.h:256,
  1578.                  from ./include/linux/init.h:5,
  1579.                  from /var/lib/dkms/veeamsnap/3.0.2.1185/build/stdafx.h:4,
  1580.                  from /var/lib/dkms/veeamsnap/3.0.2.1185/build/log.c:1:
  1581. ./arch/x86/include/asm/alternative.h:108:2: error: expected identifier or ‘(’ before string constant
  1582.   "# ALT: oldnstr\n"      \
  1583.   ^
  1584. ./arch/x86/include/asm/alternative.h:159:2: note: in expansion of macro ‘OLDINSTR’
  1585.   OLDINSTR(oldinstr, 1)      \
  1586.   ^
  1587. ./arch/x86/include/asm/alternative.h:204:23: note: in expansion of macro ‘ALTERNATIVE’
  1588.   asm_inline volatile (ALTERNATIVE(oldinstr, newinstr, feature) : : : "memory")
  1589.                        ^
  1590. ./arch/x86/include/asm/barrier.h:52:26: note: in expansion of macro ‘alternative’
  1591.  #define barrier_nospec() alternative("", "lfence", X86_FEATURE_LFENCE_RDTSC)
  1592.                           ^
  1593. ./arch/x86/include/asm/uaccess.h:125:2: note: in expansion of macro ‘barrier_nospec’
  1594.   barrier_nospec();  \
  1595.   ^
  1596. ./arch/x86/include/asm/uaccess_64.h:92:3: note: in expansion of macro ‘__uaccess_begin_nospec’
  1597.    __uaccess_begin_nospec();
  1598.    ^
  1599. In file included from <command-line>:0:0:
  1600. ././include/linux/compiler_types.h:210:24: warning: ISO C90 forbids mixed declarations and code [-Wdeclaration-after-statement]
  1601.  #define asm_inline asm __inline
  1602.                         ^
  1603. ./arch/x86/include/asm/alternative.h:204:2: note: in expansion of macro ‘asm_inline’
  1604.   asm_inline volatile (ALTERNATIVE(oldinstr, newinstr, feature) : : : "memory")
  1605.   ^
  1606. ./arch/x86/include/asm/barrier.h:52:26: note: in expansion of macro ‘alternative’
  1607.  #define barrier_nospec() alternative("", "lfence", X86_FEATURE_LFENCE_RDTSC)
  1608.                           ^
  1609. ./arch/x86/include/asm/uaccess.h:125:2: note: in expansion of macro ‘barrier_nospec’
  1610.   barrier_nospec();  \
  1611.   ^
  1612. ./arch/x86/include/asm/uaccess_64.h:92:3: note: in expansion of macro ‘__uaccess_begin_nospec’
  1613.    __uaccess_begin_nospec();
  1614.    ^
  1615. ././include/linux/compiler_types.h:210:24: error: expected ‘(’ before ‘__inline’
  1616.  #define asm_inline asm __inline
  1617.                         ^
  1618. ./arch/x86/include/asm/alternative.h:204:2: note: in expansion of macro ‘asm_inline’
  1619.   asm_inline volatile (ALTERNATIVE(oldinstr, newinstr, feature) : : : "memory")
  1620.   ^
  1621. ./arch/x86/include/asm/barrier.h:52:26: note: in expansion of macro ‘alternative’
  1622.  #define barrier_nospec() alternative("", "lfence", X86_FEATURE_LFENCE_RDTSC)
  1623.                           ^
  1624. ./arch/x86/include/asm/uaccess.h:125:2: note: in expansion of macro ‘barrier_nospec’
  1625.   barrier_nospec();  \
  1626.   ^
  1627. ./arch/x86/include/asm/uaccess_64.h:98:3: note: in expansion of macro ‘__uaccess_begin_nospec’
  1628.    __uaccess_begin_nospec();
  1629.    ^
  1630. In file included from ./arch/x86/include/asm/barrier.h:5:0,
  1631.                  from ./include/linux/compiler.h:256,
  1632.                  from ./include/linux/init.h:5,
  1633.                  from /var/lib/dkms/veeamsnap/3.0.2.1185/build/stdafx.h:4,
  1634.                  from /var/lib/dkms/veeamsnap/3.0.2.1185/build/log.c:1:
  1635. ./arch/x86/include/asm/alternative.h:108:2: error: expected identifier or ‘(’ before string constant
  1636.   "# ALT: oldnstr\n"      \
  1637.   ^
  1638. ./arch/x86/include/asm/alternative.h:159:2: note: in expansion of macro ‘OLDINSTR’
  1639.   OLDINSTR(oldinstr, 1)      \
  1640.   ^
  1641. ./arch/x86/include/asm/alternative.h:204:23: note: in expansion of macro ‘ALTERNATIVE’
  1642.   asm_inline volatile (ALTERNATIVE(oldinstr, newinstr, feature) : : : "memory")
  1643.                        ^
  1644. ./arch/x86/include/asm/barrier.h:52:26: note: in expansion of macro ‘alternative’
  1645.  #define barrier_nospec() alternative("", "lfence", X86_FEATURE_LFENCE_RDTSC)
  1646.                           ^
  1647. ./arch/x86/include/asm/uaccess.h:125:2: note: in expansion of macro ‘barrier_nospec’
  1648.   barrier_nospec();  \
  1649.   ^
  1650. ./arch/x86/include/asm/uaccess_64.h:98:3: note: in expansion of macro ‘__uaccess_begin_nospec’
  1651.    __uaccess_begin_nospec();
  1652.    ^
  1653. In file included from <command-line>:0:0:
  1654. ././include/linux/compiler_types.h:210:24: warning: ISO C90 forbids mixed declarations and code [-Wdeclaration-after-statement]
  1655.  #define asm_inline asm __inline
  1656.                         ^
  1657. ./arch/x86/include/asm/alternative.h:204:2: note: in expansion of macro ‘asm_inline’
  1658.   asm_inline volatile (ALTERNATIVE(oldinstr, newinstr, feature) : : : "memory")
  1659.   ^
  1660. ./arch/x86/include/asm/barrier.h:52:26: note: in expansion of macro ‘alternative’
  1661.  #define barrier_nospec() alternative("", "lfence", X86_FEATURE_LFENCE_RDTSC)
  1662.                           ^
  1663. ./arch/x86/include/asm/uaccess.h:125:2: note: in expansion of macro ‘barrier_nospec’
  1664.   barrier_nospec();  \
  1665.   ^
  1666. ./arch/x86/include/asm/uaccess_64.h:98:3: note: in expansion of macro ‘__uaccess_begin_nospec’
  1667.    __uaccess_begin_nospec();
  1668.    ^
  1669. ././include/linux/compiler_types.h:210:24: error: expected ‘(’ before ‘__inline’
  1670.  #define asm_inline asm __inline
  1671.                         ^
  1672. ./arch/x86/include/asm/alternative.h:204:2: note: in expansion of macro ‘asm_inline’
  1673.   asm_inline volatile (ALTERNATIVE(oldinstr, newinstr, feature) : : : "memory")
  1674.   ^
  1675. ./arch/x86/include/asm/barrier.h:52:26: note: in expansion of macro ‘alternative’
  1676.  #define barrier_nospec() alternative("", "lfence", X86_FEATURE_LFENCE_RDTSC)
  1677.                           ^
  1678. ./arch/x86/include/asm/uaccess.h:125:2: note: in expansion of macro ‘barrier_nospec’
  1679.   barrier_nospec();  \
  1680.   ^
  1681. ./arch/x86/include/asm/uaccess_64.h:108:3: note: in expansion of macro ‘__uaccess_begin_nospec’
  1682.    __uaccess_begin_nospec();
  1683.    ^
  1684. In file included from ./arch/x86/include/asm/barrier.h:5:0,
  1685.                  from ./include/linux/compiler.h:256,
  1686.                  from ./include/linux/init.h:5,
  1687.                  from /var/lib/dkms/veeamsnap/3.0.2.1185/build/stdafx.h:4,
  1688.                  from /var/lib/dkms/veeamsnap/3.0.2.1185/build/log.c:1:
  1689. ./arch/x86/include/asm/alternative.h:108:2: error: expected identifier or ‘(’ before string constant
  1690.   "# ALT: oldnstr\n"      \
  1691.   ^
  1692. ./arch/x86/include/asm/alternative.h:159:2: note: in expansion of macro ‘OLDINSTR’
  1693.   OLDINSTR(oldinstr, 1)      \
  1694.   ^
  1695. ./arch/x86/include/asm/alternative.h:204:23: note: in expansion of macro ‘ALTERNATIVE’
  1696.   asm_inline volatile (ALTERNATIVE(oldinstr, newinstr, feature) : : : "memory")
  1697.                        ^
  1698. ./arch/x86/include/asm/barrier.h:52:26: note: in expansion of macro ‘alternative’
  1699.  #define barrier_nospec() alternative("", "lfence", X86_FEATURE_LFENCE_RDTSC)
  1700.                           ^
  1701. ./arch/x86/include/asm/uaccess.h:125:2: note: in expansion of macro ‘barrier_nospec’
  1702.   barrier_nospec();  \
  1703.   ^
  1704. ./arch/x86/include/asm/uaccess_64.h:108:3: note: in expansion of macro ‘__uaccess_begin_nospec’
  1705.    __uaccess_begin_nospec();
  1706.    ^
  1707. In file included from <command-line>:0:0:
  1708. ././include/linux/compiler_types.h:210:24: warning: ISO C90 forbids mixed declarations and code [-Wdeclaration-after-statement]
  1709.  #define asm_inline asm __inline
  1710.                         ^
  1711. ./arch/x86/include/asm/alternative.h:204:2: note: in expansion of macro ‘asm_inline’
  1712.   asm_inline volatile (ALTERNATIVE(oldinstr, newinstr, feature) : : : "memory")
  1713.   ^
  1714. ./arch/x86/include/asm/barrier.h:52:26: note: in expansion of macro ‘alternative’
  1715.  #define barrier_nospec() alternative("", "lfence", X86_FEATURE_LFENCE_RDTSC)
  1716.                           ^
  1717. ./arch/x86/include/asm/uaccess.h:125:2: note: in expansion of macro ‘barrier_nospec’
  1718.   barrier_nospec();  \
  1719.   ^
  1720. ./arch/x86/include/asm/uaccess_64.h:108:3: note: in expansion of macro ‘__uaccess_begin_nospec’
  1721.    __uaccess_begin_nospec();
  1722.    ^
  1723. ./arch/x86/include/asm/uaccess.h: In function ‘user_access_begin’:
  1724. ././include/linux/compiler_types.h:210:24: error: expected ‘(’ before ‘__inline’
  1725.  #define asm_inline asm __inline
  1726.                         ^
  1727. ./arch/x86/include/asm/alternative.h:204:2: note: in expansion of macro ‘asm_inline’
  1728.   asm_inline volatile (ALTERNATIVE(oldinstr, newinstr, feature) : : : "memory")
  1729.   ^
  1730. ./arch/x86/include/asm/barrier.h:52:26: note: in expansion of macro ‘alternative’
  1731.  #define barrier_nospec() alternative("", "lfence", X86_FEATURE_LFENCE_RDTSC)
  1732.                           ^
  1733. ./arch/x86/include/asm/uaccess.h:125:2: note: in expansion of macro ‘barrier_nospec’
  1734.   barrier_nospec();  \
  1735.   ^
  1736. ./arch/x86/include/asm/uaccess.h:716:2: note: in expansion of macro ‘__uaccess_begin_nospec’
  1737.   __uaccess_begin_nospec();
  1738.   ^
  1739. In file included from ./arch/x86/include/asm/barrier.h:5:0,
  1740.                  from ./include/linux/compiler.h:256,
  1741.                  from ./include/linux/init.h:5,
  1742.                  from /var/lib/dkms/veeamsnap/3.0.2.1185/build/stdafx.h:4,
  1743.                  from /var/lib/dkms/veeamsnap/3.0.2.1185/build/log.c:1:
  1744. ./arch/x86/include/asm/alternative.h:108:2: error: expected identifier or ‘(’ before string constant
  1745.   "# ALT: oldnstr\n"      \
  1746.   ^
  1747. ./arch/x86/include/asm/alternative.h:159:2: note: in expansion of macro ‘OLDINSTR’
  1748.   OLDINSTR(oldinstr, 1)      \
  1749.   ^
  1750. ./arch/x86/include/asm/alternative.h:204:23: note: in expansion of macro ‘ALTERNATIVE’
  1751.   asm_inline volatile (ALTERNATIVE(oldinstr, newinstr, feature) : : : "memory")
  1752.                        ^
  1753. ./arch/x86/include/asm/barrier.h:52:26: note: in expansion of macro ‘alternative’
  1754.  #define barrier_nospec() alternative("", "lfence", X86_FEATURE_LFENCE_RDTSC)
  1755.                           ^
  1756. ./arch/x86/include/asm/uaccess.h:125:2: note: in expansion of macro ‘barrier_nospec’
  1757.   barrier_nospec();  \
  1758.   ^
  1759. ./arch/x86/include/asm/uaccess.h:716:2: note: in expansion of macro ‘__uaccess_begin_nospec’
  1760.   __uaccess_begin_nospec();
  1761.   ^
  1762. In file included from <command-line>:0:0:
  1763. ././include/linux/compiler_types.h:210:24: warning: ISO C90 forbids mixed declarations and code [-Wdeclaration-after-statement]
  1764.  #define asm_inline asm __inline
  1765.                         ^
  1766. ./arch/x86/include/asm/alternative.h:204:2: note: in expansion of macro ‘asm_inline’
  1767.   asm_inline volatile (ALTERNATIVE(oldinstr, newinstr, feature) : : : "memory")
  1768.   ^
  1769. ./arch/x86/include/asm/barrier.h:52:26: note: in expansion of macro ‘alternative’
  1770.  #define barrier_nospec() alternative("", "lfence", X86_FEATURE_LFENCE_RDTSC)
  1771.                           ^
  1772. ./arch/x86/include/asm/uaccess.h:125:2: note: in expansion of macro ‘barrier_nospec’
  1773.   barrier_nospec();  \
  1774.   ^
  1775. ./arch/x86/include/asm/uaccess.h:716:2: note: in expansion of macro ‘__uaccess_begin_nospec’
  1776.   __uaccess_begin_nospec();
  1777.   ^
  1778. ./include/linux/mm.h: In function ‘try_get_page’:
  1779. ././include/linux/compiler_types.h:210:24: error: expected ‘(’ before ‘__inline’
  1780.  #define asm_inline asm __inline
  1781.                         ^
  1782. ./arch/x86/include/asm/bug.h:35:2: note: in expansion of macro ‘asm_inline’
  1783.   asm_inline volatile("1:\t" ins "\n"    \
  1784.   ^
  1785. ./arch/x86/include/asm/bug.h:79:2: note: in expansion of macro ‘_BUG_FLAGS’
  1786.   _BUG_FLAGS(ASM_UD2, BUGFLAG_WARNING|(flags));  \
  1787.   ^
  1788. ./include/asm-generic/bug.h:98:3: note: in expansion of macro ‘__WARN_FLAGS’
  1789.    __WARN_FLAGS(BUGFLAG_ONCE |   \
  1790.    ^
  1791. ./include/linux/mm.h:1030:6: note: in expansion of macro ‘WARN_ON_ONCE’
  1792.   if (WARN_ON_ONCE(page_ref_count(page) <= 0))
  1793.       ^
  1794. In file included from ./include/linux/bug.h:5:0,
  1795.                  from ./include/linux/thread_info.h:12,
  1796.                  from ./arch/x86/include/asm/preempt.h:7,
  1797.                  from ./include/linux/preempt.h:78,
  1798.                  from ./include/linux/spinlock.h:51,
  1799.                  from ./include/linux/seqlock.h:36,
  1800.                  from ./include/linux/time.h:6,
  1801.                  from ./include/linux/stat.h:19,
  1802.                  from ./include/linux/module.h:10,
  1803.                  from /var/lib/dkms/veeamsnap/3.0.2.1185/build/stdafx.h:5,
  1804.                  from /var/lib/dkms/veeamsnap/3.0.2.1185/build/log.c:1:
  1805. ./arch/x86/include/asm/bug.h:35:22: error: expected identifier or ‘(’ before string constant
  1806.   asm_inline volatile("1:\t" ins "\n"    \
  1807.                       ^
  1808. ./arch/x86/include/asm/bug.h:79:2: note: in expansion of macro ‘_BUG_FLAGS’
  1809.   _BUG_FLAGS(ASM_UD2, BUGFLAG_WARNING|(flags));  \
  1810.   ^
  1811. ./include/asm-generic/bug.h:98:3: note: in expansion of macro ‘__WARN_FLAGS’
  1812.    __WARN_FLAGS(BUGFLAG_ONCE |   \
  1813.    ^
  1814. ./include/linux/mm.h:1030:6: note: in expansion of macro ‘WARN_ON_ONCE’
  1815.   if (WARN_ON_ONCE(page_ref_count(page) <= 0))
  1816.       ^
  1817. In file included from <command-line>:0:0:
  1818. ././include/linux/compiler_types.h:210:24: warning: ISO C90 forbids mixed declarations and code [-Wdeclaration-after-statement]
  1819.  #define asm_inline asm __inline
  1820.                         ^
  1821. ./arch/x86/include/asm/bug.h:35:2: note: in expansion of macro ‘asm_inline’
  1822.   asm_inline volatile("1:\t" ins "\n"    \
  1823.   ^
  1824. ./arch/x86/include/asm/bug.h:79:2: note: in expansion of macro ‘_BUG_FLAGS’
  1825.   _BUG_FLAGS(ASM_UD2, BUGFLAG_WARNING|(flags));  \
  1826.   ^
  1827. ./include/asm-generic/bug.h:98:3: note: in expansion of macro ‘__WARN_FLAGS’
  1828.    __WARN_FLAGS(BUGFLAG_ONCE |   \
  1829.    ^
  1830. ./include/linux/mm.h:1030:6: note: in expansion of macro ‘WARN_ON_ONCE’
  1831.   if (WARN_ON_ONCE(page_ref_count(page) <= 0))
  1832.       ^
  1833. ./include/linux/mm.h: In function ‘page_memcg_rcu’:
  1834. ././include/linux/compiler_types.h:210:24: error: expected ‘(’ before ‘__inline’
  1835.  #define asm_inline asm __inline
  1836.                         ^
  1837. ./arch/x86/include/asm/bug.h:35:2: note: in expansion of macro ‘asm_inline’
  1838.   asm_inline volatile("1:\t" ins "\n"    \
  1839.   ^
  1840. ./arch/x86/include/asm/bug.h:79:2: note: in expansion of macro ‘_BUG_FLAGS’
  1841.   _BUG_FLAGS(ASM_UD2, BUGFLAG_WARNING|(flags));  \
  1842.   ^
  1843. ./include/asm-generic/bug.h:98:3: note: in expansion of macro ‘__WARN_FLAGS’
  1844.    __WARN_FLAGS(BUGFLAG_ONCE |   \
  1845.    ^
  1846. ./include/linux/mm.h:1294:2: note: in expansion of macro ‘WARN_ON_ONCE’
  1847.   WARN_ON_ONCE(!rcu_read_lock_held());
  1848.   ^
  1849. In file included from ./include/linux/bug.h:5:0,
  1850.                  from ./include/linux/thread_info.h:12,
  1851.                  from ./arch/x86/include/asm/preempt.h:7,
  1852.                  from ./include/linux/preempt.h:78,
  1853.                  from ./include/linux/spinlock.h:51,
  1854.                  from ./include/linux/seqlock.h:36,
  1855.                  from ./include/linux/time.h:6,
  1856.                  from ./include/linux/stat.h:19,
  1857.                  from ./include/linux/module.h:10,
  1858.                  from /var/lib/dkms/veeamsnap/3.0.2.1185/build/stdafx.h:5,
  1859.                  from /var/lib/dkms/veeamsnap/3.0.2.1185/build/log.c:1:
  1860. ./arch/x86/include/asm/bug.h:35:22: error: expected identifier or ‘(’ before string constant
  1861.   asm_inline volatile("1:\t" ins "\n"    \
  1862.                       ^
  1863. ./arch/x86/include/asm/bug.h:79:2: note: in expansion of macro ‘_BUG_FLAGS’
  1864.   _BUG_FLAGS(ASM_UD2, BUGFLAG_WARNING|(flags));  \
  1865.   ^
  1866. ./include/asm-generic/bug.h:98:3: note: in expansion of macro ‘__WARN_FLAGS’
  1867.    __WARN_FLAGS(BUGFLAG_ONCE |   \
  1868.    ^
  1869. ./include/linux/mm.h:1294:2: note: in expansion of macro ‘WARN_ON_ONCE’
  1870.   WARN_ON_ONCE(!rcu_read_lock_held());
  1871.   ^
  1872. In file included from <command-line>:0:0:
  1873. ././include/linux/compiler_types.h:210:24: warning: ISO C90 forbids mixed declarations and code [-Wdeclaration-after-statement]
  1874.  #define asm_inline asm __inline
  1875.                         ^
  1876. ./arch/x86/include/asm/bug.h:35:2: note: in expansion of macro ‘asm_inline’
  1877.   asm_inline volatile("1:\t" ins "\n"    \
  1878.   ^
  1879. ./arch/x86/include/asm/bug.h:79:2: note: in expansion of macro ‘_BUG_FLAGS’
  1880.   _BUG_FLAGS(ASM_UD2, BUGFLAG_WARNING|(flags));  \
  1881.   ^
  1882. ./include/asm-generic/bug.h:98:3: note: in expansion of macro ‘__WARN_FLAGS’
  1883.    __WARN_FLAGS(BUGFLAG_ONCE |   \
  1884.    ^
  1885. ./include/linux/mm.h:1294:2: note: in expansion of macro ‘WARN_ON_ONCE’
  1886.   WARN_ON_ONCE(!rcu_read_lock_held());
  1887.   ^
  1888. ./include/linux/bvec.h: In function ‘bvec_iter_advance’:
  1889. ././include/linux/compiler_types.h:210:24: error: expected ‘(’ before ‘__inline’
  1890.  #define asm_inline asm __inline
  1891.                         ^
  1892. ./arch/x86/include/asm/bug.h:35:2: note: in expansion of macro ‘asm_inline’
  1893.   asm_inline volatile("1:\t" ins "\n"    \
  1894.   ^
  1895. ./arch/x86/include/asm/bug.h:79:2: note: in expansion of macro ‘_BUG_FLAGS’
  1896.   _BUG_FLAGS(ASM_UD2, BUGFLAG_WARNING|(flags));  \
  1897.   ^
  1898. ./include/asm-generic/bug.h:93:3: note: in expansion of macro ‘__WARN_FLAGS’
  1899.    __WARN_FLAGS(BUGFLAG_NO_CUT_HERE | BUGFLAG_TAINT(taint));\
  1900.    ^
  1901. ./include/asm-generic/bug.h:124:3: note: in expansion of macro ‘__WARN_printf’
  1902.    __WARN_printf(TAINT_WARN, format);   \
  1903.    ^
  1904. ./include/asm-generic/bug.h:155:3: note: in expansion of macro ‘WARN’
  1905.    WARN(1, format);    \
  1906.    ^
  1907. ./include/linux/bvec.h:90:6: note: in expansion of macro ‘WARN_ONCE’
  1908.   if (WARN_ONCE(bytes > iter->bi_size,
  1909.       ^
  1910. In file included from ./include/linux/bug.h:5:0,
  1911.                  from ./include/linux/thread_info.h:12,
  1912.                  from ./arch/x86/include/asm/preempt.h:7,
  1913.                  from ./include/linux/preempt.h:78,
  1914.                  from ./include/linux/spinlock.h:51,
  1915.                  from ./include/linux/seqlock.h:36,
  1916.                  from ./include/linux/time.h:6,
  1917.                  from ./include/linux/stat.h:19,
  1918.                  from ./include/linux/module.h:10,
  1919.                  from /var/lib/dkms/veeamsnap/3.0.2.1185/build/stdafx.h:5,
  1920.                  from /var/lib/dkms/veeamsnap/3.0.2.1185/build/log.c:1:
  1921. ./arch/x86/include/asm/bug.h:35:22: error: expected identifier or ‘(’ before string constant
  1922.   asm_inline volatile("1:\t" ins "\n"    \
  1923.                       ^
  1924. ./arch/x86/include/asm/bug.h:79:2: note: in expansion of macro ‘_BUG_FLAGS’
  1925.   _BUG_FLAGS(ASM_UD2, BUGFLAG_WARNING|(flags));  \
  1926.   ^
  1927. ./include/asm-generic/bug.h:93:3: note: in expansion of macro ‘__WARN_FLAGS’
  1928.    __WARN_FLAGS(BUGFLAG_NO_CUT_HERE | BUGFLAG_TAINT(taint));\
  1929.    ^
  1930. ./include/asm-generic/bug.h:124:3: note: in expansion of macro ‘__WARN_printf’
  1931.    __WARN_printf(TAINT_WARN, format);   \
  1932.    ^
  1933. ./include/asm-generic/bug.h:155:3: note: in expansion of macro ‘WARN’
  1934.    WARN(1, format);    \
  1935.    ^
  1936. ./include/linux/bvec.h:90:6: note: in expansion of macro ‘WARN_ONCE’
  1937.   if (WARN_ONCE(bytes > iter->bi_size,
  1938.       ^
  1939. In file included from <command-line>:0:0:
  1940. ././include/linux/compiler_types.h:210:24: warning: ISO C90 forbids mixed declarations and code [-Wdeclaration-after-statement]
  1941.  #define asm_inline asm __inline
  1942.                         ^
  1943. ./arch/x86/include/asm/bug.h:35:2: note: in expansion of macro ‘asm_inline’
  1944.   asm_inline volatile("1:\t" ins "\n"    \
  1945.   ^
  1946. ./arch/x86/include/asm/bug.h:79:2: note: in expansion of macro ‘_BUG_FLAGS’
  1947.   _BUG_FLAGS(ASM_UD2, BUGFLAG_WARNING|(flags));  \
  1948.   ^
  1949. ./include/asm-generic/bug.h:93:3: note: in expansion of macro ‘__WARN_FLAGS’
  1950.    __WARN_FLAGS(BUGFLAG_NO_CUT_HERE | BUGFLAG_TAINT(taint));\
  1951.    ^
  1952. ./include/asm-generic/bug.h:124:3: note: in expansion of macro ‘__WARN_printf’
  1953.    __WARN_printf(TAINT_WARN, format);   \
  1954.    ^
  1955. ./include/asm-generic/bug.h:155:3: note: in expansion of macro ‘WARN’
  1956.    WARN(1, format);    \
  1957.    ^
  1958. ./include/linux/bvec.h:90:6: note: in expansion of macro ‘WARN_ONCE’
  1959.   if (WARN_ONCE(bytes > iter->bi_size,
  1960.       ^
  1961. ./include/linux/highmem.h: In function ‘zero_user_segments’:
  1962. ././include/linux/compiler_types.h:210:24: error: expected ‘(’ before ‘__inline’
  1963.  #define asm_inline asm __inline
  1964.                         ^
  1965. ./arch/x86/include/asm/bug.h:35:2: note: in expansion of macro ‘asm_inline’
  1966.   asm_inline volatile("1:\t" ins "\n"    \
  1967.   ^
  1968. ./arch/x86/include/asm/bug.h:73:2: note: in expansion of macro ‘_BUG_FLAGS’
  1969.   _BUG_FLAGS(ASM_UD2, 0);     \
  1970.   ^
  1971. ./include/asm-generic/bug.h:62:57: note: in expansion of macro ‘BUG’
  1972.  #define BUG_ON(condition) do { if (unlikely(condition)) BUG(); } while (0)
  1973.                                                          ^
  1974. ./include/linux/highmem.h:224:2: note: in expansion of macro ‘BUG_ON’
  1975.   BUG_ON(end1 > PAGE_SIZE || end2 > PAGE_SIZE);
  1976.   ^
  1977. In file included from ./include/linux/bug.h:5:0,
  1978.                  from ./include/linux/thread_info.h:12,
  1979.                  from ./arch/x86/include/asm/preempt.h:7,
  1980.                  from ./include/linux/preempt.h:78,
  1981.                  from ./include/linux/spinlock.h:51,
  1982.                  from ./include/linux/seqlock.h:36,
  1983.                  from ./include/linux/time.h:6,
  1984.                  from ./include/linux/stat.h:19,
  1985.                  from ./include/linux/module.h:10,
  1986.                  from /var/lib/dkms/veeamsnap/3.0.2.1185/build/stdafx.h:5,
  1987.                  from /var/lib/dkms/veeamsnap/3.0.2.1185/build/log.c:1:
  1988. ./arch/x86/include/asm/bug.h:35:22: error: expected identifier or ‘(’ before string constant
  1989.   asm_inline volatile("1:\t" ins "\n"    \
  1990.                       ^
  1991. ./arch/x86/include/asm/bug.h:73:2: note: in expansion of macro ‘_BUG_FLAGS’
  1992.   _BUG_FLAGS(ASM_UD2, 0);     \
  1993.   ^
  1994. ./include/asm-generic/bug.h:62:57: note: in expansion of macro ‘BUG’
  1995.  #define BUG_ON(condition) do { if (unlikely(condition)) BUG(); } while (0)
  1996.                                                          ^
  1997. ./include/linux/highmem.h:224:2: note: in expansion of macro ‘BUG_ON’
  1998.   BUG_ON(end1 > PAGE_SIZE || end2 > PAGE_SIZE);
  1999.   ^
  2000. In file included from <command-line>:0:0:
  2001. ././include/linux/compiler_types.h:210:24: warning: ISO C90 forbids mixed declarations and code [-Wdeclaration-after-statement]
  2002.  #define asm_inline asm __inline
  2003.                         ^
  2004. ./arch/x86/include/asm/bug.h:35:2: note: in expansion of macro ‘asm_inline’
  2005.   asm_inline volatile("1:\t" ins "\n"    \
  2006.   ^
  2007. ./arch/x86/include/asm/bug.h:73:2: note: in expansion of macro ‘_BUG_FLAGS’
  2008.   _BUG_FLAGS(ASM_UD2, 0);     \
  2009.   ^
  2010. ./include/asm-generic/bug.h:62:57: note: in expansion of macro ‘BUG’
  2011.  #define BUG_ON(condition) do { if (unlikely(condition)) BUG(); } while (0)
  2012.                                                          ^
  2013. ./include/linux/highmem.h:224:2: note: in expansion of macro ‘BUG_ON’
  2014.   BUG_ON(end1 > PAGE_SIZE || end2 > PAGE_SIZE);
  2015.   ^
  2016. In file included from ./include/linux/init.h:5:0,
  2017.                  from /var/lib/dkms/veeamsnap/3.0.2.1185/build/stdafx.h:4,
  2018.                  from /var/lib/dkms/veeamsnap/3.0.2.1185/build/log.c:1:
  2019. ./include/linux/pagemap.h: In function ‘fault_in_pages_readable’:
  2020. ././include/linux/compiler_types.h:210:24: error: expected ‘(’ before ‘__inline’
  2021.  #define asm_inline asm __inline
  2022.                         ^
  2023. ./include/linux/compiler.h:78:42: note: in definition of macro ‘unlikely’
  2024.  # define unlikely(x) __builtin_expect(!!(x), 0)
  2025.                                           ^
  2026. ./arch/x86/include/asm/alternative.h:204:2: note: in expansion of macro ‘asm_inline’
  2027.   asm_inline volatile (ALTERNATIVE(oldinstr, newinstr, feature) : : : "memory")
  2028.   ^
  2029. ./arch/x86/include/asm/barrier.h:52:26: note: in expansion of macro ‘alternative’
  2030.  #define barrier_nospec() alternative("", "lfence", X86_FEATURE_LFENCE_RDTSC)
  2031.                           ^
  2032. ./arch/x86/include/asm/uaccess.h:125:2: note: in expansion of macro ‘barrier_nospec’
  2033.   barrier_nospec();  \
  2034.   ^
  2035. ./arch/x86/include/asm/uaccess.h:449:2: note: in expansion of macro ‘__uaccess_begin_nospec’
  2036.   __uaccess_begin_nospec();     \
  2037.   ^
  2038. ./arch/x86/include/asm/uaccess.h:529:2: note: in expansion of macro ‘__get_user_nocheck’
  2039.   __get_user_nocheck((x), (ptr), sizeof(*(ptr)))
  2040.   ^
  2041. ./include/linux/pagemap.h:592:16: note: in expansion of macro ‘__get_user’
  2042.    if (unlikely(__get_user(c, uaddr) != 0))
  2043.                 ^
  2044. ./arch/x86/include/asm/alternative.h:108:2: error: expected identifier or ‘(’ before string constant
  2045.   "# ALT: oldnstr\n"      \
  2046.   ^
  2047. ./include/linux/compiler.h:78:42: note: in definition of macro ‘unlikely’
  2048.  # define unlikely(x) __builtin_expect(!!(x), 0)
  2049.                                           ^
  2050. ./arch/x86/include/asm/alternative.h:159:2: note: in expansion of macro ‘OLDINSTR’
  2051.   OLDINSTR(oldinstr, 1)      \
  2052.   ^
  2053. ./arch/x86/include/asm/alternative.h:204:23: note: in expansion of macro ‘ALTERNATIVE’
  2054.   asm_inline volatile (ALTERNATIVE(oldinstr, newinstr, feature) : : : "memory")
  2055.                        ^
  2056. ./arch/x86/include/asm/barrier.h:52:26: note: in expansion of macro ‘alternative’
  2057.  #define barrier_nospec() alternative("", "lfence", X86_FEATURE_LFENCE_RDTSC)
  2058.                           ^
  2059. ./arch/x86/include/asm/uaccess.h:125:2: note: in expansion of macro ‘barrier_nospec’
  2060.   barrier_nospec();  \
  2061.   ^
  2062. ./arch/x86/include/asm/uaccess.h:449:2: note: in expansion of macro ‘__uaccess_begin_nospec’
  2063.   __uaccess_begin_nospec();     \
  2064.   ^
  2065. ./arch/x86/include/asm/uaccess.h:529:2: note: in expansion of macro ‘__get_user_nocheck’
  2066.   __get_user_nocheck((x), (ptr), sizeof(*(ptr)))
  2067.   ^
  2068. ./include/linux/pagemap.h:592:16: note: in expansion of macro ‘__get_user’
  2069.    if (unlikely(__get_user(c, uaddr) != 0))
  2070.                 ^
  2071. ././include/linux/compiler_types.h:210:24: warning: ISO C90 forbids mixed declarations and code [-Wdeclaration-after-statement]
  2072.  #define asm_inline asm __inline
  2073.                         ^
  2074. ./include/linux/compiler.h:78:42: note: in definition of macro ‘unlikely’
  2075.  # define unlikely(x) __builtin_expect(!!(x), 0)
  2076.                                           ^
  2077. ./arch/x86/include/asm/alternative.h:204:2: note: in expansion of macro ‘asm_inline’
  2078.   asm_inline volatile (ALTERNATIVE(oldinstr, newinstr, feature) : : : "memory")
  2079.   ^
  2080. ./arch/x86/include/asm/barrier.h:52:26: note: in expansion of macro ‘alternative’
  2081.  #define barrier_nospec() alternative("", "lfence", X86_FEATURE_LFENCE_RDTSC)
  2082.                           ^
  2083. ./arch/x86/include/asm/uaccess.h:125:2: note: in expansion of macro ‘barrier_nospec’
  2084.   barrier_nospec();  \
  2085.   ^
  2086. ./arch/x86/include/asm/uaccess.h:449:2: note: in expansion of macro ‘__uaccess_begin_nospec’
  2087.   __uaccess_begin_nospec();     \
  2088.   ^
  2089. ./arch/x86/include/asm/uaccess.h:529:2: note: in expansion of macro ‘__get_user_nocheck’
  2090.   __get_user_nocheck((x), (ptr), sizeof(*(ptr)))
  2091.   ^
  2092. ./include/linux/pagemap.h:592:16: note: in expansion of macro ‘__get_user’
  2093.    if (unlikely(__get_user(c, uaddr) != 0))
  2094.                 ^
  2095. In file included from <command-line>:0:0:
  2096. ././include/linux/compiler_types.h:210:24: error: expected ‘(’ before ‘__inline’
  2097.  #define asm_inline asm __inline
  2098.                         ^
  2099. ./arch/x86/include/asm/alternative.h:204:2: note: in expansion of macro ‘asm_inline’
  2100.   asm_inline volatile (ALTERNATIVE(oldinstr, newinstr, feature) : : : "memory")
  2101.   ^
  2102. ./arch/x86/include/asm/barrier.h:52:26: note: in expansion of macro ‘alternative’
  2103.  #define barrier_nospec() alternative("", "lfence", X86_FEATURE_LFENCE_RDTSC)
  2104.                           ^
  2105. ./arch/x86/include/asm/uaccess.h:125:2: note: in expansion of macro ‘barrier_nospec’
  2106.   barrier_nospec();  \
  2107.   ^
  2108. ./arch/x86/include/asm/uaccess.h:449:2: note: in expansion of macro ‘__uaccess_begin_nospec’
  2109.   __uaccess_begin_nospec();     \
  2110.   ^
  2111. ./arch/x86/include/asm/uaccess.h:529:2: note: in expansion of macro ‘__get_user_nocheck’
  2112.   __get_user_nocheck((x), (ptr), sizeof(*(ptr)))
  2113.   ^
  2114. ./include/linux/pagemap.h:600:10: note: in expansion of macro ‘__get_user’
  2115.    return __get_user(c, end);
  2116.           ^
  2117. In file included from ./arch/x86/include/asm/barrier.h:5:0,
  2118.                  from ./include/linux/compiler.h:256,
  2119.                  from ./include/linux/init.h:5,
  2120.                  from /var/lib/dkms/veeamsnap/3.0.2.1185/build/stdafx.h:4,
  2121.                  from /var/lib/dkms/veeamsnap/3.0.2.1185/build/log.c:1:
  2122. ./arch/x86/include/asm/alternative.h:108:2: error: expected identifier or ‘(’ before string constant
  2123.   "# ALT: oldnstr\n"      \
  2124.   ^
  2125. ./arch/x86/include/asm/alternative.h:159:2: note: in expansion of macro ‘OLDINSTR’
  2126.   OLDINSTR(oldinstr, 1)      \
  2127.   ^
  2128. ./arch/x86/include/asm/alternative.h:204:23: note: in expansion of macro ‘ALTERNATIVE’
  2129.   asm_inline volatile (ALTERNATIVE(oldinstr, newinstr, feature) : : : "memory")
  2130.                        ^
  2131. ./arch/x86/include/asm/barrier.h:52:26: note: in expansion of macro ‘alternative’
  2132.  #define barrier_nospec() alternative("", "lfence", X86_FEATURE_LFENCE_RDTSC)
  2133.                           ^
  2134. ./arch/x86/include/asm/uaccess.h:125:2: note: in expansion of macro ‘barrier_nospec’
  2135.   barrier_nospec();  \
  2136.   ^
  2137. ./arch/x86/include/asm/uaccess.h:449:2: note: in expansion of macro ‘__uaccess_begin_nospec’
  2138.   __uaccess_begin_nospec();     \
  2139.   ^
  2140. ./arch/x86/include/asm/uaccess.h:529:2: note: in expansion of macro ‘__get_user_nocheck’
  2141.   __get_user_nocheck((x), (ptr), sizeof(*(ptr)))
  2142.   ^
  2143. ./include/linux/pagemap.h:600:10: note: in expansion of macro ‘__get_user’
  2144.    return __get_user(c, end);
  2145.           ^
  2146. In file included from <command-line>:0:0:
  2147. ././include/linux/compiler_types.h:210:24: warning: ISO C90 forbids mixed declarations and code [-Wdeclaration-after-statement]
  2148.  #define asm_inline asm __inline
  2149.                         ^
  2150. ./arch/x86/include/asm/alternative.h:204:2: note: in expansion of macro ‘asm_inline’
  2151.   asm_inline volatile (ALTERNATIVE(oldinstr, newinstr, feature) : : : "memory")
  2152.   ^
  2153. ./arch/x86/include/asm/barrier.h:52:26: note: in expansion of macro ‘alternative’
  2154.  #define barrier_nospec() alternative("", "lfence", X86_FEATURE_LFENCE_RDTSC)
  2155.                           ^
  2156. ./arch/x86/include/asm/uaccess.h:125:2: note: in expansion of macro ‘barrier_nospec’
  2157.   barrier_nospec();  \
  2158.   ^
  2159. ./arch/x86/include/asm/uaccess.h:449:2: note: in expansion of macro ‘__uaccess_begin_nospec’
  2160.   __uaccess_begin_nospec();     \
  2161.   ^
  2162. ./arch/x86/include/asm/uaccess.h:529:2: note: in expansion of macro ‘__get_user_nocheck’
  2163.   __get_user_nocheck((x), (ptr), sizeof(*(ptr)))
  2164.   ^
  2165. ./include/linux/pagemap.h:600:10: note: in expansion of macro ‘__get_user’
  2166.    return __get_user(c, end);
  2167.           ^
  2168. ./include/linux/backing-dev-defs.h: In function ‘wb_put’:
  2169. ././include/linux/compiler_types.h:210:24: error: expected ‘(’ before ‘__inline’
  2170.  #define asm_inline asm __inline
  2171.                         ^
  2172. ./arch/x86/include/asm/bug.h:35:2: note: in expansion of macro ‘asm_inline’
  2173.   asm_inline volatile("1:\t" ins "\n"    \
  2174.   ^
  2175. ./arch/x86/include/asm/bug.h:79:2: note: in expansion of macro ‘_BUG_FLAGS’
  2176.   _BUG_FLAGS(ASM_UD2, BUGFLAG_WARNING|(flags));  \
  2177.   ^
  2178. ./include/asm-generic/bug.h:98:3: note: in expansion of macro ‘__WARN_FLAGS’
  2179.    __WARN_FLAGS(BUGFLAG_ONCE |   \
  2180.    ^
  2181. ./include/linux/backing-dev-defs.h:284:6: note: in expansion of macro ‘WARN_ON_ONCE’
  2182.   if (WARN_ON_ONCE(!wb->bdi)) {
  2183.       ^
  2184. In file included from ./include/linux/bug.h:5:0,
  2185.                  from ./include/linux/thread_info.h:12,
  2186.                  from ./arch/x86/include/asm/preempt.h:7,
  2187.                  from ./include/linux/preempt.h:78,
  2188.                  from ./include/linux/spinlock.h:51,
  2189.                  from ./include/linux/seqlock.h:36,
  2190.                  from ./include/linux/time.h:6,
  2191.                  from ./include/linux/stat.h:19,
  2192.                  from ./include/linux/module.h:10,
  2193.                  from /var/lib/dkms/veeamsnap/3.0.2.1185/build/stdafx.h:5,
  2194.                  from /var/lib/dkms/veeamsnap/3.0.2.1185/build/log.c:1:
  2195. ./arch/x86/include/asm/bug.h:35:22: error: expected identifier or ‘(’ before string constant
  2196.   asm_inline volatile("1:\t" ins "\n"    \
  2197.                       ^
  2198. ./arch/x86/include/asm/bug.h:79:2: note: in expansion of macro ‘_BUG_FLAGS’
  2199.   _BUG_FLAGS(ASM_UD2, BUGFLAG_WARNING|(flags));  \
  2200.   ^
  2201. ./include/asm-generic/bug.h:98:3: note: in expansion of macro ‘__WARN_FLAGS’
  2202.    __WARN_FLAGS(BUGFLAG_ONCE |   \
  2203.    ^
  2204. ./include/linux/backing-dev-defs.h:284:6: note: in expansion of macro ‘WARN_ON_ONCE’
  2205.   if (WARN_ON_ONCE(!wb->bdi)) {
  2206.       ^
  2207. In file included from <command-line>:0:0:
  2208. ././include/linux/compiler_types.h:210:24: warning: ISO C90 forbids mixed declarations and code [-Wdeclaration-after-statement]
  2209.  #define asm_inline asm __inline
  2210.                         ^
  2211. ./arch/x86/include/asm/bug.h:35:2: note: in expansion of macro ‘asm_inline’
  2212.   asm_inline volatile("1:\t" ins "\n"    \
  2213.   ^
  2214. ./arch/x86/include/asm/bug.h:79:2: note: in expansion of macro ‘_BUG_FLAGS’
  2215.   _BUG_FLAGS(ASM_UD2, BUGFLAG_WARNING|(flags));  \
  2216.   ^
  2217. ./include/asm-generic/bug.h:98:3: note: in expansion of macro ‘__WARN_FLAGS’
  2218.    __WARN_FLAGS(BUGFLAG_ONCE |   \
  2219.    ^
  2220. ./include/linux/backing-dev-defs.h:284:6: note: in expansion of macro ‘WARN_ON_ONCE’
  2221.   if (WARN_ON_ONCE(!wb->bdi)) {
  2222.       ^
  2223. ./include/linux/bio.h: In function ‘bio_first_bvec_all’:
  2224. ././include/linux/compiler_types.h:210:24: error: expected ‘(’ before ‘__inline’
  2225.  #define asm_inline asm __inline
  2226.                         ^
  2227. ./arch/x86/include/asm/bug.h:35:2: note: in expansion of macro ‘asm_inline’
  2228.   asm_inline volatile("1:\t" ins "\n"    \
  2229.   ^
  2230. ./arch/x86/include/asm/bug.h:79:2: note: in expansion of macro ‘_BUG_FLAGS’
  2231.   _BUG_FLAGS(ASM_UD2, BUGFLAG_WARNING|(flags));  \
  2232.   ^
  2233. ./include/asm-generic/bug.h:98:3: note: in expansion of macro ‘__WARN_FLAGS’
  2234.    __WARN_FLAGS(BUGFLAG_ONCE |   \
  2235.    ^
  2236. ./include/linux/bio.h:281:2: note: in expansion of macro ‘WARN_ON_ONCE’
  2237.   WARN_ON_ONCE(bio_flagged(bio, BIO_CLONED));
  2238.   ^
  2239. In file included from ./include/linux/bug.h:5:0,
  2240.                  from ./include/linux/thread_info.h:12,
  2241.                  from ./arch/x86/include/asm/preempt.h:7,
  2242.                  from ./include/linux/preempt.h:78,
  2243.                  from ./include/linux/spinlock.h:51,
  2244.                  from ./include/linux/seqlock.h:36,
  2245.                  from ./include/linux/time.h:6,
  2246.                  from ./include/linux/stat.h:19,
  2247.                  from ./include/linux/module.h:10,
  2248.                  from /var/lib/dkms/veeamsnap/3.0.2.1185/build/stdafx.h:5,
  2249.                  from /var/lib/dkms/veeamsnap/3.0.2.1185/build/log.c:1:
  2250. ./arch/x86/include/asm/bug.h:35:22: error: expected identifier or ‘(’ before string constant
  2251.   asm_inline volatile("1:\t" ins "\n"    \
  2252.                       ^
  2253. ./arch/x86/include/asm/bug.h:79:2: note: in expansion of macro ‘_BUG_FLAGS’
  2254.   _BUG_FLAGS(ASM_UD2, BUGFLAG_WARNING|(flags));  \
  2255.   ^
  2256. ./include/asm-generic/bug.h:98:3: note: in expansion of macro ‘__WARN_FLAGS’
  2257.    __WARN_FLAGS(BUGFLAG_ONCE |   \
  2258.    ^
  2259. ./include/linux/bio.h:281:2: note: in expansion of macro ‘WARN_ON_ONCE’
  2260.   WARN_ON_ONCE(bio_flagged(bio, BIO_CLONED));
  2261.   ^
  2262. In file included from <command-line>:0:0:
  2263. ././include/linux/compiler_types.h:210:24: warning: ISO C90 forbids mixed declarations and code [-Wdeclaration-after-statement]
  2264.  #define asm_inline asm __inline
  2265.                         ^
  2266. ./arch/x86/include/asm/bug.h:35:2: note: in expansion of macro ‘asm_inline’
  2267.   asm_inline volatile("1:\t" ins "\n"    \
  2268.   ^
  2269. ./arch/x86/include/asm/bug.h:79:2: note: in expansion of macro ‘_BUG_FLAGS’
  2270.   _BUG_FLAGS(ASM_UD2, BUGFLAG_WARNING|(flags));  \
  2271.   ^
  2272. ./include/asm-generic/bug.h:98:3: note: in expansion of macro ‘__WARN_FLAGS’
  2273.    __WARN_FLAGS(BUGFLAG_ONCE |   \
  2274.    ^
  2275. ./include/linux/bio.h:281:2: note: in expansion of macro ‘WARN_ON_ONCE’
  2276.   WARN_ON_ONCE(bio_flagged(bio, BIO_CLONED));
  2277.   ^
  2278. ./include/linux/bio.h: In function ‘bio_last_bvec_all’:
  2279. ././include/linux/compiler_types.h:210:24: error: expected ‘(’ before ‘__inline’
  2280.  #define asm_inline asm __inline
  2281.                         ^
  2282. ./arch/x86/include/asm/bug.h:35:2: note: in expansion of macro ‘asm_inline’
  2283.   asm_inline volatile("1:\t" ins "\n"    \
  2284.   ^
  2285. ./arch/x86/include/asm/bug.h:79:2: note: in expansion of macro ‘_BUG_FLAGS’
  2286.   _BUG_FLAGS(ASM_UD2, BUGFLAG_WARNING|(flags));  \
  2287.   ^
  2288. ./include/asm-generic/bug.h:98:3: note: in expansion of macro ‘__WARN_FLAGS’
  2289.    __WARN_FLAGS(BUGFLAG_ONCE |   \
  2290.    ^
  2291. ./include/linux/bio.h:292:2: note: in expansion of macro ‘WARN_ON_ONCE’
  2292.   WARN_ON_ONCE(bio_flagged(bio, BIO_CLONED));
  2293.   ^
  2294. In file included from ./include/linux/bug.h:5:0,
  2295.                  from ./include/linux/thread_info.h:12,
  2296.                  from ./arch/x86/include/asm/preempt.h:7,
  2297.                  from ./include/linux/preempt.h:78,
  2298.                  from ./include/linux/spinlock.h:51,
  2299.                  from ./include/linux/seqlock.h:36,
  2300.                  from ./include/linux/time.h:6,
  2301.                  from ./include/linux/stat.h:19,
  2302.                  from ./include/linux/module.h:10,
  2303.                  from /var/lib/dkms/veeamsnap/3.0.2.1185/build/stdafx.h:5,
  2304.                  from /var/lib/dkms/veeamsnap/3.0.2.1185/build/log.c:1:
  2305. ./arch/x86/include/asm/bug.h:35:22: error: expected identifier or ‘(’ before string constant
  2306.   asm_inline volatile("1:\t" ins "\n"    \
  2307.                       ^
  2308. ./arch/x86/include/asm/bug.h:79:2: note: in expansion of macro ‘_BUG_FLAGS’
  2309.   _BUG_FLAGS(ASM_UD2, BUGFLAG_WARNING|(flags));  \
  2310.   ^
  2311. ./include/asm-generic/bug.h:98:3: note: in expansion of macro ‘__WARN_FLAGS’
  2312.    __WARN_FLAGS(BUGFLAG_ONCE |   \
  2313.    ^
  2314. ./include/linux/bio.h:292:2: note: in expansion of macro ‘WARN_ON_ONCE’
  2315.   WARN_ON_ONCE(bio_flagged(bio, BIO_CLONED));
  2316.   ^
  2317. In file included from <command-line>:0:0:
  2318. ././include/linux/compiler_types.h:210:24: warning: ISO C90 forbids mixed declarations and code [-Wdeclaration-after-statement]
  2319.  #define asm_inline asm __inline
  2320.                         ^
  2321. ./arch/x86/include/asm/bug.h:35:2: note: in expansion of macro ‘asm_inline’
  2322.   asm_inline volatile("1:\t" ins "\n"    \
  2323.   ^
  2324. ./arch/x86/include/asm/bug.h:79:2: note: in expansion of macro ‘_BUG_FLAGS’
  2325.   _BUG_FLAGS(ASM_UD2, BUGFLAG_WARNING|(flags));  \
  2326.   ^
  2327. ./include/asm-generic/bug.h:98:3: note: in expansion of macro ‘__WARN_FLAGS’
  2328.    __WARN_FLAGS(BUGFLAG_ONCE |   \
  2329.    ^
  2330. ./include/linux/bio.h:292:2: note: in expansion of macro ‘WARN_ON_ONCE’
  2331.   WARN_ON_ONCE(bio_flagged(bio, BIO_CLONED));
  2332.   ^
  2333. ./include/linux/scatterlist.h: In function ‘sg_assign_page’:
  2334. ././include/linux/compiler_types.h:210:24: error: expected ‘(’ before ‘__inline’
  2335.  #define asm_inline asm __inline
  2336.                         ^
  2337. ./arch/x86/include/asm/bug.h:35:2: note: in expansion of macro ‘asm_inline’
  2338.   asm_inline volatile("1:\t" ins "\n"    \
  2339.   ^
  2340. ./arch/x86/include/asm/bug.h:73:2: note: in expansion of macro ‘_BUG_FLAGS’
  2341.   _BUG_FLAGS(ASM_UD2, 0);     \
  2342.   ^
  2343. ./include/asm-generic/bug.h:62:57: note: in expansion of macro ‘BUG’
  2344.  #define BUG_ON(condition) do { if (unlikely(condition)) BUG(); } while (0)
  2345.                                                          ^
  2346. ./include/linux/scatterlist.h:95:2: note: in expansion of macro ‘BUG_ON’
  2347.   BUG_ON((unsigned long) page & (SG_CHAIN | SG_END));
  2348.   ^
  2349. In file included from ./include/linux/bug.h:5:0,
  2350.                  from ./include/linux/thread_info.h:12,
  2351.                  from ./arch/x86/include/asm/preempt.h:7,
  2352.                  from ./include/linux/preempt.h:78,
  2353.                  from ./include/linux/spinlock.h:51,
  2354.                  from ./include/linux/seqlock.h:36,
  2355.                  from ./include/linux/time.h:6,
  2356.                  from ./include/linux/stat.h:19,
  2357.                  from ./include/linux/module.h:10,
  2358.                  from /var/lib/dkms/veeamsnap/3.0.2.1185/build/stdafx.h:5,
  2359.                  from /var/lib/dkms/veeamsnap/3.0.2.1185/build/log.c:1:
  2360. ./arch/x86/include/asm/bug.h:35:22: error: expected identifier or ‘(’ before string constant
  2361.   asm_inline volatile("1:\t" ins "\n"    \
  2362.                       ^
  2363. ./arch/x86/include/asm/bug.h:73:2: note: in expansion of macro ‘_BUG_FLAGS’
  2364.   _BUG_FLAGS(ASM_UD2, 0);     \
  2365.   ^
  2366. ./include/asm-generic/bug.h:62:57: note: in expansion of macro ‘BUG’
  2367.  #define BUG_ON(condition) do { if (unlikely(condition)) BUG(); } while (0)
  2368.                                                          ^
  2369. ./include/linux/scatterlist.h:95:2: note: in expansion of macro ‘BUG_ON’
  2370.   BUG_ON((unsigned long) page & (SG_CHAIN | SG_END));
  2371.   ^
  2372. In file included from <command-line>:0:0:
  2373. ././include/linux/compiler_types.h:210:24: warning: ISO C90 forbids mixed declarations and code [-Wdeclaration-after-statement]
  2374.  #define asm_inline asm __inline
  2375.                         ^
  2376. ./arch/x86/include/asm/bug.h:35:2: note: in expansion of macro ‘asm_inline’
  2377.   asm_inline volatile("1:\t" ins "\n"    \
  2378.   ^
  2379. ./arch/x86/include/asm/bug.h:73:2: note: in expansion of macro ‘_BUG_FLAGS’
  2380.   _BUG_FLAGS(ASM_UD2, 0);     \
  2381.   ^
  2382. ./include/asm-generic/bug.h:62:57: note: in expansion of macro ‘BUG’
  2383.  #define BUG_ON(condition) do { if (unlikely(condition)) BUG(); } while (0)
  2384.                                                          ^
  2385. ./include/linux/scatterlist.h:95:2: note: in expansion of macro ‘BUG_ON’
  2386.   BUG_ON((unsigned long) page & (SG_CHAIN | SG_END));
  2387.   ^
  2388. ./include/linux/blkdev.h: In function ‘rq_integrity_vec’:
  2389. ././include/linux/compiler_types.h:210:24: error: expected ‘(’ before ‘__inline’
  2390.  #define asm_inline asm __inline
  2391.                         ^
  2392. ./arch/x86/include/asm/bug.h:35:2: note: in expansion of macro ‘asm_inline’
  2393.   asm_inline volatile("1:\t" ins "\n"    \
  2394.   ^
  2395. ./arch/x86/include/asm/bug.h:79:2: note: in expansion of macro ‘_BUG_FLAGS’
  2396.   _BUG_FLAGS(ASM_UD2, BUGFLAG_WARNING|(flags));  \
  2397.   ^
  2398. ./include/asm-generic/bug.h:98:3: note: in expansion of macro ‘__WARN_FLAGS’
  2399.    __WARN_FLAGS(BUGFLAG_ONCE |   \
  2400.    ^
  2401. ./include/linux/blkdev.h:1610:6: note: in expansion of macro ‘WARN_ON_ONCE’
  2402.   if (WARN_ON_ONCE(queue_max_integrity_segments(rq->q) > 1))
  2403.       ^
  2404. In file included from ./include/linux/bug.h:5:0,
  2405.                  from ./include/linux/thread_info.h:12,
  2406.                  from ./arch/x86/include/asm/preempt.h:7,
  2407.                  from ./include/linux/preempt.h:78,
  2408.                  from ./include/linux/spinlock.h:51,
  2409.                  from ./include/linux/seqlock.h:36,
  2410.                  from ./include/linux/time.h:6,
  2411.                  from ./include/linux/stat.h:19,
  2412.                  from ./include/linux/module.h:10,
  2413.                  from /var/lib/dkms/veeamsnap/3.0.2.1185/build/stdafx.h:5,
  2414.                  from /var/lib/dkms/veeamsnap/3.0.2.1185/build/log.c:1:
  2415. ./arch/x86/include/asm/bug.h:35:22: error: expected identifier or ‘(’ before string constant
  2416.   asm_inline volatile("1:\t" ins "\n"    \
  2417.                       ^
  2418. ./arch/x86/include/asm/bug.h:79:2: note: in expansion of macro ‘_BUG_FLAGS’
  2419.   _BUG_FLAGS(ASM_UD2, BUGFLAG_WARNING|(flags));  \
  2420.   ^
  2421. ./include/asm-generic/bug.h:98:3: note: in expansion of macro ‘__WARN_FLAGS’
  2422.    __WARN_FLAGS(BUGFLAG_ONCE |   \
  2423.    ^
  2424. ./include/linux/blkdev.h:1610:6: note: in expansion of macro ‘WARN_ON_ONCE’
  2425.   if (WARN_ON_ONCE(queue_max_integrity_segments(rq->q) > 1))
  2426.       ^
  2427. In file included from <command-line>:0:0:
  2428. ././include/linux/compiler_types.h:210:24: warning: ISO C90 forbids mixed declarations and code [-Wdeclaration-after-statement]
  2429.  #define asm_inline asm __inline
  2430.                         ^
  2431. ./arch/x86/include/asm/bug.h:35:2: note: in expansion of macro ‘asm_inline’
  2432.   asm_inline volatile("1:\t" ins "\n"    \
  2433.   ^
  2434. ./arch/x86/include/asm/bug.h:79:2: note: in expansion of macro ‘_BUG_FLAGS’
  2435.   _BUG_FLAGS(ASM_UD2, BUGFLAG_WARNING|(flags));  \
  2436.   ^
  2437. ./include/asm-generic/bug.h:98:3: note: in expansion of macro ‘__WARN_FLAGS’
  2438.    __WARN_FLAGS(BUGFLAG_ONCE |   \
  2439.    ^
  2440. ./include/linux/blkdev.h:1610:6: note: in expansion of macro ‘WARN_ON_ONCE’
  2441.   if (WARN_ON_ONCE(queue_max_integrity_segments(rq->q) > 1))
  2442.       ^
  2443. scripts/Makefile.build:265: recipe for target '/var/lib/dkms/veeamsnap/3.0.2.1185/build/log.o' failed
  2444. make[1]: *** [/var/lib/dkms/veeamsnap/3.0.2.1185/build/log.o] Error 1
  2445. Makefile:1652: recipe for target '/var/lib/dkms/veeamsnap/3.0.2.1185/build' failed
  2446. make: *** [/var/lib/dkms/veeamsnap/3.0.2.1185/build] Error 2
  2447. make: Leaving directory '/usr/src/linux-headers-5.4.1-050401-generic'
RAW Paste Data
We use cookies for various purposes including analytics. By continuing to use Pastebin, you agree to our use of cookies as described in the Cookies Policy. OK, I Understand
Top