daily pastebin goal
35%
SHARE
TWEET

Untitled

a guest Jan 1st, 2018 85 Never
Not a member of Pastebin yet? Sign Up, it unlocks many cool features!
  1. [ 78%] Linking CXX executable ../../bin/ossim-adrg-dump
  2. ../../lib64/libossim.so.1.9.0: undefined reference to `void ossimPixelFlipper::flipPixels<double>(double, ossimImageData*, unsigned int)'
  3. ../../lib64/libossim.so.1.9.0: undefined reference to `void ossimPixelFlipper::flipPixels<int>(int, ossimImageData*, unsigned int)'
  4. ../../lib64/libossim.so.1.9.0: undefined reference to `void ossimPixelFlipper::flipPixels<unsigned short>(unsigned short, ossimImageData*, unsigned int)'
  5. ../../lib64/libossim.so.1.9.0: undefined reference to `void ossimPixelFlipper::flipPixels<float>(float, ossimImageData*, unsigned int)'
  6. ../../lib64/libossim.so.1.9.0: undefined reference to `void ossimPixelFlipper::flipPixels<unsigned char>(unsigned char, ossimImageData*, unsigned int)'
  7. ../../lib64/libossim.so.1.9.0: undefined reference to `void ossimPixelFlipper::flipPixels<unsigned int>(unsigned int, ossimImageData*, unsigned int)'
  8. ../../lib64/libossim.so.1.9.0: undefined reference to `void ossimPixelFlipper::flipPixels<short>(short, ossimImageData*, unsigned int)'
  9. collect2: error: ld returned 1 exit status
  10. make[2]: *** [apps/ossim-btoa/CMakeFiles/ossim-btoa.dir/build.make:107: bin/ossim-btoa] Error 1
  11. make[1]: *** [CMakeFiles/Makefile2:517: apps/ossim-btoa/CMakeFiles/ossim-btoa.dir/all] Error 2
  12. make[1]: *** Waiting for unfinished jobs....
  13. ../../lib64/libossim.so.1.9.0: undefined reference to `void ossimPixelFlipper::flipPixels<double>(double, ossimImageData*, unsigned int)'
  14. ../../lib64/libossim.so.1.9.0: undefined reference to `void ossimPixelFlipper::flipPixels<int>(int, ossimImageData*, unsigned int)'
  15. ../../lib64/libossim.so.1.9.0: undefined reference to `void ossimPixelFlipper::flipPixels<unsigned short>(unsigned short, ossimImageData*, unsigned int)'
  16. ../../lib64/libossim.so.1.9.0: undefined reference to `void ossimPixelFlipper::flipPixels<float>(float, ossimImageData*, unsigned int)'
  17. ../../lib64/libossim.so.1.9.0: undefined reference to `void ossimPixelFlipper::flipPixels<unsigned char>(unsigned char, ossimImageData*, unsigned int)'
  18. ../../lib64/libossim.so.1.9.0: undefined reference to `void ossimPixelFlipper::flipPixels<unsigned int>(unsigned int, ossimImageData*, unsigned int)'
  19. ../../lib64/libossim.so.1.9.0: undefined reference to `void ossimPixelFlipper::flipPixels<short>(short, ossimImageData*, unsigned int)'
  20. collect2: error: ld returned 1 exit status
  21. make[2]: *** [apps/ossim-chgkwval/CMakeFiles/ossim-chgkwval.dir/build.make:107: bin/ossim-chgkwval] Error 1
  22. make[1]: *** [CMakeFiles/Makefile2:572: apps/ossim-chgkwval/CMakeFiles/ossim-chgkwval.dir/all] Error 2
  23. ../../lib64/libossim.so.1.9.0: undefined reference to `void ossimPixelFlipper::flipPixels<double>(double, ossimImageData*, unsigned int)'
  24. ../../lib64/libossim.so.1.9.0: undefined reference to `void ossimPixelFlipper::flipPixels<int>(int, ossimImageData*, unsigned int)'
  25. ../../lib64/libossim.so.1.9.0: undefined reference to `void ossimPixelFlipper::flipPixels<unsigned short>(unsigned short, ossimImageData*, unsigned int)'
  26. ../../lib64/libossim.so.1.9.0: undefined reference to `void ossimPixelFlipper::flipPixels<float>(float, ossimImageData*, unsigned int)'
  27. ../../lib64/libossim.so.1.9.0: undefined reference to `void ossimPixelFlipper::flipPixels<unsigned char>(unsigned char, ossimImageData*, unsigned int)'
  28. ../../lib64/libossim.so.1.9.0: undefined reference to `void ossimPixelFlipper::flipPixels<unsigned int>(unsigned int, ossimImageData*, unsigned int)'
  29. ../../lib64/libossim.so.1.9.0: undefined reference to `void ossimPixelFlipper::flipPixels<short>(short, ossimImageData*, unsigned int)'
  30. collect2: error: ld returned 1 exit status
  31. make[2]: *** [apps/ossim-adrg-dump/CMakeFiles/ossim-adrg-dump.dir/build.make:107: bin/ossim-adrg-dump] Error 1
  32. make[1]: *** [CMakeFiles/Makefile2:297: apps/ossim-adrg-dump/CMakeFiles/ossim-adrg-dump.dir/all] Error 2
  33. [ 78%] Linking CXX executable ../../bin/ossim-autreg
  34. [ 78%] Linking CXX executable ../../bin/ossim-applanix2ogeom
  35. ../../lib64/libossim.so.1.9.0: undefined reference to `void ossimPixelFlipper::flipPixels<double>(double, ossimImageData*, unsigned int)'
  36. ../../lib64/libossim.so.1.9.0: undefined reference to `void ossimPixelFlipper::flipPixels<int>(int, ossimImageData*, unsigned int)'
  37. ../../lib64/libossim.so.1.9.0: undefined reference to `void ossimPixelFlipper::flipPixels<unsigned short>(unsigned short, ossimImageData*, unsigned int)'
  38. ../../lib64/libossim.so.1.9.0: undefined reference to `void ossimPixelFlipper::flipPixels<float>(float, ossimImageData*, unsigned int)'
  39. ../../lib64/libossim.so.1.9.0: undefined reference to `void ossimPixelFlipper::flipPixels<unsigned char>(unsigned char, ossimImageData*, unsigned int)'
  40. ../../lib64/libossim.so.1.9.0: undefined reference to `void ossimPixelFlipper::flipPixels<unsigned int>(unsigned int, ossimImageData*, unsigned int)'
  41. ../../lib64/libossim.so.1.9.0: undefined reference to `void ossimPixelFlipper::flipPixels<short>(short, ossimImageData*, unsigned int)'
  42. collect2: error: ld returned 1 exit status
  43. make[2]: *** [apps/ossim-autreg/CMakeFiles/ossim-autreg.dir/build.make:107: bin/ossim-autreg] Error 1
  44. make[1]: *** [CMakeFiles/Makefile2:407: apps/ossim-autreg/CMakeFiles/ossim-autreg.dir/all] Error 2
  45. [ 78%] Linking CXX executable ../../bin/ossim-band-merge
  46. ../../lib64/libossim.so.1.9.0: undefined reference to `void ossimPixelFlipper::flipPixels<double>(double, ossimImageData*, unsigned int)'
  47. ../../lib64/libossim.so.1.9.0: undefined reference to `void ossimPixelFlipper::flipPixels<int>(int, ossimImageData*, unsigned int)'
  48. ../../lib64/libossim.so.1.9.0: undefined reference to `void ossimPixelFlipper::flipPixels<unsigned short>(unsigned short, ossimImageData*, unsigned int)'
  49. ../../lib64/libossim.so.1.9.0: undefined reference to `void ossimPixelFlipper::flipPixels<float>(float, ossimImageData*, unsigned int)'
  50. ../../lib64/libossim.so.1.9.0: undefined reference to `void ossimPixelFlipper::flipPixels<unsigned char>(unsigned char, ossimImageData*, unsigned int)'
  51. ../../lib64/libossim.so.1.9.0: undefined reference to `void ossimPixelFlipper::flipPixels<unsigned int>(unsigned int, ossimImageData*, unsigned int)'
  52. ../../lib64/libossim.so.1.9.0: undefined reference to `void ossimPixelFlipper::flipPixels<short>(short, ossimImageData*, unsigned int)'
  53. collect2: error: ld returned 1 exit status
  54. make[2]: *** [apps/ossim-applanix2ogeom/CMakeFiles/ossim-applanix2ogeom.dir/build.make:107: bin/ossim-applanix2ogeom] Error 1
  55. make[1]: *** [CMakeFiles/Makefile2:352: apps/ossim-applanix2ogeom/CMakeFiles/ossim-applanix2ogeom.dir/all] Error 2
  56. ../../lib64/libossim.so.1.9.0: undefined reference to `void ossimPixelFlipper::flipPixels<double>(double, ossimImageData*, unsigned int)'
  57. ../../lib64/libossim.so.1.9.0: undefined reference to `void ossimPixelFlipper::flipPixels<int>(int, ossimImageData*, unsigned int)'
  58. ../../lib64/libossim.so.1.9.0: undefined reference to `void ossimPixelFlipper::flipPixels<unsigned short>(unsigned short, ossimImageData*, unsigned int)'
  59. ../../lib64/libossim.so.1.9.0: undefined reference to `void ossimPixelFlipper::flipPixels<float>(float, ossimImageData*, unsigned int)'
  60. ../../lib64/libossim.so.1.9.0: undefined reference to `void ossimPixelFlipper::flipPixels<unsigned char>(unsigned char, ossimImageData*, unsigned int)'
  61. ../../lib64/libossim.so.1.9.0: undefined reference to `void ossimPixelFlipper::flipPixels<unsigned int>(unsigned int, ossimImageData*, unsigned int)'
  62. ../../lib64/libossim.so.1.9.0: undefined reference to `void ossimPixelFlipper::flipPixels<short>(short, ossimImageData*, unsigned int)'
  63. collect2: error: ld returned 1 exit status
  64. make[2]: *** [apps/ossim-band-merge/CMakeFiles/ossim-band-merge.dir/build.make:107: bin/ossim-band-merge] Error 1
  65. make[1]: *** [CMakeFiles/Makefile2:462: apps/ossim-band-merge/CMakeFiles/ossim-band-merge.dir/all] Error 2
  66. make: *** [Makefile:130: all] Error 2
RAW Paste Data
We use cookies for various purposes including analytics. By continuing to use Pastebin, you agree to our use of cookies as described in the Cookies Policy. OK, I Understand
 
Top