daily pastebin goal
67%
SHARE
TWEET

Untitled

a guest Nov 23rd, 2013 232 Never
Not a member of Pastebin yet? Sign Up, it unlocks many cool features!
  1. __asm_func_dummy
  2. __asm_func_dummy
  3. __asm_func_dummy
  4. __asm_func_dummy
  5. __asm_func_dummy
  6. __asm_func_dummy
  7. __asm_func_dummy
  8. __asm_func_dummy
  9. __asm_func_dummy
  10. __asm_func_dummy
  11. __asm_func_dummy
  12. __asm_func_dummy
  13. __asm_func_dummy
  14. __asm_func_dummy
  15. __asm_func_dummy
  16. __asm_func_dummy
  17. __asm_func_dummy
  18. __asm_func_dummy
  19. __asm_func_dummy
  20. __asm_func_dummy
  21. __asm_func_dummy
  22. __asm_func_dummy
  23. __asm_func_dummy
  24. __asm_func_dummy
  25. __asm_func_dummy
  26. __asm_func_dummy
  27. __asm_func_dummy
  28. __asm_func_dummy
  29. __asm_func_dummy
  30. __asm_func_dummy
  31. __asm_func_dummy
  32. __asm_func_dummy
  33. __asm_func_dummy
  34. __asm_func_dummy
  35. __asm_func_dummy
  36. __asm_func_dummy
  37. __asm_func_dummy
  38. __asm_func_dummy
  39.  
  40. type
  41. port
  42. n_regs
  43. region
  44. size
  45. crypto
  46. num_dev
  47. plat.id..
  48. sys.param.load.rom1st
  49. sys.syscon.pversion.
  50. sys.flash.fmt.
  51. sys.flash.boot.
  52. sys.flash.ext.
  53. lv1.maxplgid..
  54. lv1.specver..
  55. lv1.buildid..
  56. lv1.ts.size.
  57. lv1.ts.start.
  58. lv1.rsx.enable.
  59. spdr.gbe0.macaddr.
  60. sys.debug.device
  61. rsx.rdcy..
  62. lv1.iosys.enable.
  63. ios.net.eurus.lpar
  64. sys.hw.config.version
  65. sys.hw.config.
  66. sys.hw.model.emulate
  67. sys.ac.sd.
  68. sys.boot.gos.
  69. ben...
  70. be...
  71. be..tb_clk.
  72. be..clock.
  73. be..nclk.
  74. be..ioifn.
  75. be..ioif.addr
  76. mun...
  77. mu...
  78. mu..size.
  79. sys.be..spursvsl
  80. sys.be..ausrspun
  81. sys.be..asysspun
  82. Zspider_ddr: module size is not supported.
  83. be.0.tb_clk
  84. sys.lv1.large_pciex
  85. [spider_sc] doesn't add internal interrupt handler
  86. [spider_sc] doesn't connect internal interrupt handler
  87. sys.syscon.protocol_version
  88. [header:
  89. [body: 0x
  90. [spider_sc] message header from syscon is not correct.
  91. header =
  92. [spider_sc] message from syscon is checksum error.
  93. [spider_sc] syscon sends other port interrupt(0x
  94. sc_tc =
  95. , sc_rc =
  96. rsx driver assert failed: /home/work/urag/sdk/sdk_trunk/nv/cellos/src/implementation/driver/rsx/core/device.h
  97. rsx driver assert failed
  98. rsx driver assert failed: core/device.cc
  99. sys.lv1.rsxenable
  100. sys.lv1.rsxdebug
  101. rsx t:    close
  102. rsx t:    open
  103. sys.ac.misc2
  104. rsx:      
  105.  vpe:
  106.  shd:
  107. sys.boot.gos
  108. invalid context attrib :
  109. rsx65 a01
  110. rsx65 a02
  111. rsx65 a03
  112. rsx65 a04
  113. rsx65 a05
  114. rsx65 a06
  115. rsx65 a07
  116. rsx65 a08
  117. rsx65 a09
  118. rsx65 a10
  119. rsx65 a11
  120. rsx65 a12
  121. rsx65 a13
  122. rsx65 a14
  123. rsx65 a15
  124. rsx65 b01
  125. rsx65 b02
  126. rsx65 b03
  127. rsx65 b04
  128. rsx65 b05
  129. rsx65 b06
  130. rsx65 b07
  131. rsx65 b08
  132. rsx65 b09
  133. rsx65 b10
  134. rsx65 b11
  135. rsx65 b12
  136. rsx65 b13
  137. rsx65 b14
  138. rsx65 b15
  139. rsx65 c01
  140. rsx65 c02
  141. rsx65 c03
  142. rsx65 c04
  143. rsx65 c05
  144. rsx65 c06
  145. rsx65 c07
  146. rsx65 c08
  147. rsx65 c09
  148. rsx65 c10
  149. rsx65 c11
  150. rsx65 c12
  151. rsx65 c13
  152. rsx65 c14
  153. rsx65 c15
  154. rsx40 a01
  155. rsx40 a02
  156. rsx40 a03
  157. rsx40 a04
  158. rsx40 a05
  159. rsx40 a06
  160. rsx40 a07
  161. rsx40 a08
  162. rsx28 a01
  163. rsx28 a02
  164. rsx28 a03
  165. rsx28 a04
  166. rsx28 a05
  167. rsx28 a06
  168. rsx28 a07
  169. rsx28 a08
  170. rsx driver assert failed: core/memory.cc
  171. rsx driver assert failed: core/context.cc
  172. rsx driver assert failed: utils/bitmap.cc
  173. rsx ioif0 bus
  174. rsx driver assert failed: bus/ioif0.cc
  175. rsx driver assert failed: device/eic.cc
  176. RSX EIC driver initialization failed
  177. rsx driver assert failed: device/master.cc
  178. rsx.rdcy.2
  179. rsx driver assert failed: device/fb.cc
  180. rsx driver assert failed: device/fifo.cc
  181. rsx driver assert failed: device/graph.cc
  182. rsx ctxsw driver timeout! please report
  183. rsx driver assert failed: device/graph_ctx_rsx.cc
  184. Invalid
  185. rsx driver assert failed: device/clock_rsx.cc
  186. nvclk
  187. geom clkshader clk
  188. rop clk
  189. memory clk
  190. display clk
  191. host clk
  192. rsx driver assert failed: device/audio.cc
  193. rsx driver assert failed: post/post_rsx.cc
  194. rsx.rdcy.1
  195. g_rsx_revoffset
  196. g_chipid_rev
  197. g_chipid_factory
  198. g_chipid_lot
  199. g_chipid_wafer
  200. g_chipid_wafer_x
  201. g_chipid_wafer_y
  202. g_chipid_ds_line
  203. g_chipid_ds_rev
  204. g_chipid_ds_dut
  205. g_fuse_vid
  206. g_fuse_vidbin
  207. g_fuse_dram
  208. g_fuse_mclkt
  209. g_fuse_gv
  210. g_fuse_svop
  211. g_fuse_svop_enable
  212. g_fuse_pt
  213. g_fuse_svop2
  214. g_fuse_mp
  215. rsx rom abort!
  216. sys.lv1.rsxmemcheck
  217. rsx memory check failed. errors:
  218. rsx t:    post
  219. RSX driver: Reading fuse-data failed
  220. rsx driver assert failed: post/post_rsx28.cc
  221. TIMEOUT - gddr5WaitFreeCount_RSX28()
  222. TIMEOUT - gddr5TransferFbToSysmem_RSX28()
  223. TIMEOUT - gddr5WaitIdle_RSX28()
  224. rsx driver assert failed: object/context_dma.cc
  225. rsx driver assert failed: object/nv_class.cc
  226. rsx driver assert failed: object/sw_class.cc
  227. rsx driver assert failed: object/channel.cc
  228. rsx driver assert failed: object/hash_table.cc
  229. rsx driver assert failed: object/sw_driver.cc
  230. rsx driver assert failed: object/vfb.cc
  231. rsx driver assert failed: object/video_rsx.cc
  232. iosys::bus::main() failed (
  233. iosys::network::init() failed (
  234. iosys::usb::init() failed (
  235. sys.lv1.iosys.storage
  236. # mapped reg busaddr:0x
  237.  ea:0x
  238.  size:0x
  239.  lpar:
  240.  lock_count:
  241. reserved reg:0x
  242. : size
  243.  larger than contig size
  244. # 0x
  245.   0x
  246. device : 0x
  247. reserved region object size : 0x
  248. mapped region object size : 0x
  249. #  MMIO regions
  250. #  DMA regions
  251. # allocated io region. io_addr:0x
  252.   size:0x
  253. allocate_io_segment_internal error:0x
  254.  base_address : 0x
  255.  region_size  : 0x
  256.  size         : 0x
  257.  page_size    :
  258. allocate_io_segment error:0x
  259.  lpar_id      :
  260. external_io_allocater can't allocate continuous IO region for GOS
  261. ~io_allocater()
  262. ~internal_io_allocater()
  263. ~external_io_allocater()
  264. SB DMA Controller initialization error:
  265. can't create ebus driver
  266. can't create gbus driver
  267. sys.lv1.iosys.errorhandler
  268. sb error handler level is changed.(sys.lv1.iosys.errorhandler is
  269. sb_device set_iosegment error:0x
  270.   controller id:
  271. addr: 0x
  272.   data: 0x
  273. PCI Express use 1GB MMIO area.(sys.lv1.large_pciex is 1.)
  274.  DDR    : 0x2000_0000 - 0x2FFF_FFFF  256MB
  275.  PCI    : 0x3000_0000 - 0x3FFF_FFFF  256MB
  276.  PCI Ex : 0x4000_0000 - 0x7FFF_FFFF  1GB
  277. sys.lv1.iosys.pci.d.thread
  278. sys.lv1.iosys.pci.d.thread is
  279. ######## update io base segment. io addr : 0x
  280. recover_ip_core_master_error. controller_id:
  281. bus: warning ! IOIFC trxba is not zero : 0x
  282. #### SB DEVICE ####
  283. #  controller_id :
  284. #  ioid : 0x
  285. #  bus_master_id : 0x
  286. #  base_io_segment : 0x
  287. #  sb_master_transaction_base_address_ : 0x
  288. ### Dump INTERRUPTS ###
  289. TIRCS 0x
  290. TIRDEN 0x
  291. TIREMSKA 0x
  292. TIREMSKB 0x
  293. TIRPIEN 0x
  294. TIRPNDA 0x
  295. TIRPNDB 0x
  296. TIRPPNDA 0x
  297. TIRPPNDB 0x
  298. TIRCFGA[
  299. ] 0x
  300. TIRCFGB[
  301. can't get GBUSC forward region 3
  302. Dump PIO registers
  303.  piodo : 0x
  304.  piodi : 0x
  305.  piodir : 0x
  306.  piood : 0x
  307.  pioaen : 0x
  308.  pioactl : 0x
  309.  pioco : 0x
  310. sys.hw.config
  311.  pioc : 0x
  312. ###### dump ebusc SMMIO registers ######
  313. ebusc ebintst : 0x
  314. ebusc ebintmk : 0x
  315. ebusc ebtoinf : 0x
  316. ebusc ebftov : 0x
  317. ebusc ebcadmatch0 : 0x
  318. ebusc ebcactrl0 : 0x
  319. ebusc ebcadbs0 : 0x
  320. ebusc ebcadmatch1 : 0x
  321. ebusc ebcactrl1 : 0x
  322. ebusc ebcadbs1 : 0x
  323. ebusc ebcadmatch2 : 0x
  324. ebusc ebcactrl2 : 0x
  325. ebusc ebcadbs2 : 0x
  326. ebusc ebcadmatch3 : 0x
  327. ebusc ebcactrl3 : 0x
  328. ebusc ebcadbs3 : 0x
  329. ebusc dmatdsad : 0x
  330. ebusc dmatctrl : 0x
  331. ebusc dmactdad : 0x
  332. ebusc dmadmyad : 0x
  333. ebusc dmarsize : 0x
  334. ebusc sbadmatch1 : 0x
  335. ebusc sbadmatch2 : 0x
  336. ebusc iom_acte0 : 0x
  337. ebusc iom_acte1 : 0x
  338. ebusc iot_acte0 : 0x
  339. ebusc iot_acte1 : 0x
  340. can't get PCI sconfig_region
  341. can't get PCI mmio_region
  342. can't get PCI memory region
  343. sys.lv1.iosys.pci.retry
  344. sys.lv1.iosys.pci.retry is
  345. sb_epcic_driver  1st step error:0x
  346. sb_epcic_driver::initialize. wrong state
  347. pre_initialize error
  348. sb_epcic_driver  2nd step error:0x
  349. des[
  350. ]:0x
  351. io_page_size is wrong. 0x
  352. ddr_address alignment is wrong. 0x
  353. ddr_size is wrong. 0x
  354. xdr_address alignment is wrong. 0x
  355. xdr_size is wrong. 0x
  356. xdr size is not same as ddr_size.
  357.  xdr_size : 0x
  358.  ddr_size : 0x
  359. SDMAC: can't get sb bus driver
  360. SDMAC: can't get sdmac driver
  361. SDMAC: can't get sdmac device
  362. SDMAC: can't reserve dma region. error:
  363. ## PCI BUS DRIVER debug##
  364. m_p_controller : 0x
  365. m_device_num :
  366. PCI io shortage
  367. PCI memory shortage
  368. This second_ether is used by Lv2
  369. Unknown PCI header type(
  370. bus:
  371. dev:
  372. func:
  373. ## PCI DEVICE DEBUG ##
  374. bus       : 0x
  375. device    : 0x
  376. function  : 0x
  377. vendor_id : 0x
  378. device_id : 0x
  379. class     : 0x
  380. interrupt_number :
  381. ] is_io  : 0x
  382. ] bar_id : 0x
  383. ] addr   : 0x
  384. ] size   : 0x
  385. #Configuration space
  386. config read : 0x
  387. Unsupported PCI Ex device/port type:0x
  388. Unsupported device/port type:0x
  389. Can't get PCI Express capability.
  390. Ignore this PCI-PCI Bridge.
  391. PANIC: Can't create node: name =
  392. intr
  393. type
  394. data
  395. pci_bus
  396. pci_dev
  397. pci_fun
  398. num_dev
  399. IOIF trace completed.
  400.  ioifc event status       : 0x
  401. # checkstop 0x
  402. === Begin of TRACE DUMP ===
  403. === End of TRACE DUMP ===
  404. TRACE DUMP FAILED
  405. ### EHCI1 error interrupt: 0x
  406. ###  Response Error
  407. ### OHCI1 error interrupt: 0x
  408. ###  Protection Error
  409. ###   Error address: 0x
  410. ###   Error command: 0x
  411. ###  SError
  412. ### EHCI0 error interrupt: 0x
  413. ### OHCI0 error interrupt: 0x
  414. ### GBEC error interrupt(summary): 0x
  415. ### GBEC error interrupt1: 0x
  416. ###  Rx Protection Error
  417. ###  Tx Protection Error
  418. ###  Rx Response Error
  419. ###  Tx Response Error
  420. Dump ioifc error info
  421.  : NO ERROR
  422.  interrupt mask           : 0x
  423.  IOIFC BUS ERROR LOG      : 0x
  424.  IOIFC BUS ERROR LOG ADDR : 0x
  425.  debug mem trigger enable : 0x
  426.  check stop output enable : 0x
  427.  check stop status        : 0x
  428.  signal polar reverse     : 0x
  429. # root error : 0x
  430.   root error id : 0x
  431.   device status : 0x
  432.   correctable error : 0x
  433.   uncorrectable error : 0x
  434.   first error ptr : 0x
  435.   header[0] log : 0x
  436.   header[1] log : 0x
  437.   header[2] log : 0x
  438.   header[3] log : 0x
  439. # core & device access error : 0x
  440.   dummy access error
  441.   common access error
  442.   portA access error
  443.    completion status error
  444.     status:0x
  445.     completorID:0x
  446.    completion length error
  447. # protection error : 0x
  448.   siliconback bus plane serror
  449.   Thread0 error. addr:0x
  450.  cmd:0x
  451.   RequesterID : 0x
  452.   Thread1 error. addr:0x
  453.   Thread2 error. addr:0x
  454.   Thread3 error. addr:0x
  455. cmd:0x
  456. ### PCI Ex error interrupt: 0x
  457. ###  SbError
  458. ### EBUSC error interrupt: 0x
  459. ###  Response error
  460. ###  Address Hole Write error
  461. ###  Master transaction flow timeout error
  462. ###  Slave transaction flow timeout error
  463. ### GBUSC error interrupt: 0x
  464. ###   Error address0: 0x
  465. ###   Error address1: 0x
  466. ###   Error address2: 0x
  467. ###   Error address3: 0x
  468. ###   Error address4: 0x
  469. ###   Error address5: 0x
  470. ###  OCP->GBUS timeout error
  471. ###  GBUS timeout error
  472. ###  GBUS master read access error
  473. ### PCI Master error or Reset assert
  474. ### PCI Master parity error addr(PCI): 0x
  475. ### PCI Master fatal error addr(PCI): 0x
  476. ### PCI Reset asserted
  477. ### PCI Reset deasserted
  478. ### PCI error interrupt: 0x
  479. ###  PCI PERR
  480. ###  PCI SERR
  481. ###  PCI Controller error
  482. ### ATAC1 error interrupt: 0x
  483. ###  Illegal configuration error
  484. ### ATAC0 error interrupt: 0x
  485. ## IOIF tracer is busy!
  486. IOIF trace break_address      : 0x
  487. IOIF trace break_address_mask : 0x
  488. [EH] pciexc_serr
  489. [EH] ioif event:0x
  490.  log:0x
  491.  sb address:0x
  492. [EH] Fatal error
  493. [EH] SBERR happened!
  494. [EH] pciexc_internal
  495. [EH] epcic_serr
  496. [EH] epcic_internal
  497. sb_error_handler started. level:
  498. skip 2nd initialization step
  499. net: [vlan : off]
  500. net: [eurus port mirror : on]
  501. net: [sb port mirror : on]
  502. sys.wake_source
  503. spider.gbe0.macaddr.0
  504. iosys::network::pmi_handler Can't get MAC address.
  505. blk_size
  506. n_blocks
  507. port
  508. meddling
  509. hosttype
  510. region
  511. start
  512. crypto
  513. n_regs
  514. sys.flash.ext
  515. redirection without vflash?
  516. << put_ioptes failed:
  517. cancel_request error :
  518.  device_type :
  519.  tag :
  520.  valid :
  521.  lpar_id :
  522. no redirected device set
  523. invalid storage_device state
  524. confirm_close_common.type:
  525.  confirm_status :
  526. failed to issue read
  527. ios.ata.region0.access
  528. sys.ac.misc
  529. storage: ACL check will be skipped for device id
  530. Un-initializing
  531. new SB_Patac memory shortage
  532. sys.sata.param
  533. sys.ac.product_code
  534. new Pata_TP ERROR
  535. new ATA_Command ERROR
  536. new ATAPI_Command ERROR
  537. ATA PORT:
  538.  CMD ERROR result:0x
  539.  status reg:0x
  540.  error reg:0x
  541.  CMD backup dump
  542.  cm:0x
  543.  fe:0x
  544.  sc:0x
  545.  ll:0x
  546.  lm:0x
  547.  lh:0x
  548.  dv:0x
  549.  ex:0x
  550.  pt:0x
  551. BDVD: Drive Not ready Timeout
  552. Device: PATAC0:Reset Timeout
  553. Device: PATAC1:Reset Timeout
  554. Device: PATAC Reset Timeout
  555. wait_host_idle: Warning Wait Long
  556. wait_host_idle result: 0x
  557. wait_device_ready: Warning Wait Long
  558. wait_device_ready result: 0x
  559. ClearPATACInterrupt Call:
  560. EnablePATACInterrupt MASK:
  561. PRD_table Make SB_Addr:
  562.  size:
  563. PRD_table
  564.  BaseAdd:0x
  565.  ByteCount:0x
  566.  EOT
  567. <<<ERROR>>> PRD overflow
  568. SetUDMAMode Master Mode
  569. SetUDMAMode Slave Mode
  570. _media_interrupt_handler.
  571. SetDMA EAddr:0x
  572.  SBAddr:0x
  573. set_PRD_table fail
  574. SetCurBuff::EA_Data_Buff_Addr :0x
  575. SetCurBuff::SBA_Data_Buff_Addr:0x
  576. DMA_Buff::EA_Addr:       0x
  577. DMA_Buff::EA_region_Size:0x
  578. DMA_Buff::SB_Buff_Addr:  0x
  579. StartDMA Start SBATA Interrupt Status
  580. ***Start Kick DMA BMID_OFST_QCHCD
  581.  INT MASK:
  582. Hex dump  00 01 02 03 04 05 06 07 08 09 0a 0b 0c 0d 0e 0f
  583. Device Reg:0x
  584. MASTER
  585.  ID_Sirial:
  586.  ID_Product:
  587.  FW_revision:
  588. SLAVE
  589. ATA fe:0x
  590. Packet Dump len:
  591. Packet Proto:
  592. ATA/ATAPI Error Reg:
  593.  AltStatus Reg:
  594. Atapi/Ata Interrupt: TIMEOUT Status
  595. Device: PATAC0
  596. Device: PATAC1
  597. TimeOutHandler_dma Called
  598. QCHSD :0x
  599. PTERADD :0x
  600. MODEREG :0x
  601. DMA complete:
  602. EA_Data_Buff_Addr :0x
  603. SBA_Data_Buff_Addr:0x
  604. PATAC ACTE0 :0x
  605. PATAC ACTE1 :0x
  606. PATAC ACTE2 :0x
  607. Initiator Agent State 0x
  608. Master Access Error Address 0x
  609. Master Access Error Command 0x
  610. Endian conversion mode 0x
  611. QCHPRD  Reg:0x
  612. ACTEINT TimeOutHandler_cmd Called
  613. ATA/ATAPI TransSbAddrToPhyAddr search_dma_mapped_bus_region_by_bus_address Fail
  614. ATA/ATAPI TransSbAddrToPhyAddr get_physical_address Fail 0x:
  615. PATAC0:Cable Not Connect
  616. Device: PATAC0:Cable Not Connect
  617. PATAC1:Cable Not Connect
  618. Device: PATAC1:Cable Not Connect
  619. Atapi/Ata Interrupt: Status
  620. Interrupt DMA Fail Retry Start
  621. Interrupt ACTINT_TRANSPARENT Wait
  622. PIO DATA Transfer Complete
  623. ATA PIO DATA Transfer Complete
  624. Atapi/Ata Interrupt ???: Status
  625. _interrupt_handler Start.
  626. _interrupt_handler End.
  627. Ata port:
  628.  Device not found.
  629. Ata port:1 Master HDD removed.
  630. Ata port:0 Slave HDD removed.
  631. ConnectBusDriver Start.
  632. ConnectBusDriver create_dma_region fail:0x
  633. create media interrupt
  634. create media interrupt handle error :
  635. ConnectBusDriver End.
  636. InitializePATAC Start.
  637. ConnectBusDriver Fail :
  638. <<<Error>>> Cannot release PATAC core reset
  639. InitializePATAC End.
  640. HDD
  641.  result:0x
  642.  Err:0x
  643.  lsn:
  644.  num:
  645.  flag:
  646.  tag:
  647. BDVD result:0x
  648.  rev:
  649. encdec_drive: request_complete tag:
  650. ret:
  651. encdec_device::encdec_device(). start device ID:
  652. SYSTEM CLOCK Fail: Set:
  653. new SB_Encdec ERROR
  654. encdec_device::initialize end:
  655. new EDEC_TP ERROR
  656. Encdec ioctl() Kset Seqence cmd:
  657. ENCDEC TransLparAddrToSbAddr invalid address
  658.  request usrbuf lpar_addr:0x
  659.  lpar_id :0x
  660.  request dscbuf lpar_addr:0x
  661.  req size:0x
  662. : in_ba addr invalid?:
  663. : out_ba addr invalid?:
  664. ENCDEC EdecXTS3 TransLparAddrToSbAddr invalid address
  665.  sb_src:0x
  666. EdecSS start.
  667. EdecSS end. DMA Kicked
  668. EdecKgen1 start.
  669. EdecKgen1 end.
  670. EdecKset start.
  671. EdecKset end.
  672. EdecKgen2 start.
  673. EdecKgen2 end.
  674. EdecKgenFlash.
  675. Encdec decsec.
  676. EdecKset OK.
  677. EdecKset NG.
  678. ########## Test Mode Found ##########
  679. EncDec Interrupt Reason:
  680.  ret:
  681. ##### Encdec timeout_handler called ######
  682. SetStgReadDesc lbn:
  683.  secsize:
  684.  key:
  685.  src_addr:
  686.  dst_addr:
  687. SetStgSsEncdec ENC OR DEC:
  688.  lbn:
  689.  usr_sb_addr:
  690.  ss_sb_addr:
  691.  ss_io_count:
  692. SetStgSsDbufEncdec ENC OR DEC:
  693.  sp_sb_addr:
  694.  buf_sb_addr:
  695. InitializeENCDEC Start.
  696. ENCDEC TransSbAddrToPhyAddr search_dma_mapped_bus_region_by_bus_address Fail
  697. ENCDEC TransSbAddrToPhyAddr get_physical_address Fail 0x:
  698. sys.flash.boot
  699. new SB_Starship memory shortage
  700. new sp_tp(Spansion TP) memory shortage
  701.  TEST: End.
  702.  TEST: Read lsn:0x
  703.  num:0x
  704.  SS2 status:0x
  705.  TEST: Current Read :0x
  706. FLASH Memory (SS2) on_complete: Lsn:0x
  707.  Num:0x
  708.  Buf:0x
  709.  Scn:0x
  710. SS2 PIO Address Err cmd:0x
  711.  buf:0x
  712.  buflen:
  713.  TEST: Start.
  714. Starship Reset Error:
  715. ##### StarShip ERROR
  716. unknown scenario:
  717.        stage:
  718. intr_exec proto:
  719.  nsec:
  720.  ea:
  721.  sb:
  722. SWResetPtcl() ERROR:0x
  723. SS2 HW Reset ERROR:0x
  724. SSTransfer Start. Protcol:
  725. SSTransfer PIO IN
  726. SSTransfer PIO OUT
  727. SSTransfer DMA
  728. SSTransfer End.
  729. SSOperation cmd:
  730.  stat:
  731.  istat:
  732. Nor_flash Chip Not Found
  733. NOR but unknown
  734. NOR flash erase data verify failed...
  735. rom address: 0x
  736.  data: 0x
  737. NOR flash is protected. addr :
  738. NOR flash is protected. addr:
  739. NOR flash buffer addr Translate fail
  740. NOR flash is protected. addr :
  741. NOR flash : Writing to the bit which has not been erased.
  742. Sector offset :
  743.  flash_data: 0x
  744.  write_data: 0x
  745. NOR flash: Writing to the bit which has not been erased.
  746. NOR flash is corrupted, data:
  747.  expect:
  748.  addr:
  749.  buf_num:
  750. NOR write to buffer was aborted.. data:
  751. NOR data verify failed...
  752.   write data:
  753.   addr:
  754.   data:
  755. NOR is corrupted, data:
  756. NOR Flash Timeout 10(sec)
  757.  Stg :0x
  758.  Sce :0x
  759. FLASH Memory (SS2) TimeOut
  760.  Scenario:
  761.  Stage:
  762.  CMD:
  763.  STATUS:
  764.  INTREG:
  765.  INTENREG:
  766. Ebus int_status:
  767.  mask:
  768.  BAD_BLOCK: Default:
  769.  Low format after:
  770.  OPT_infomation:0x
  771. StarShip Interrupt: Status
  772. ######StarShip: Stage
  773. FLASH Memory (SS2) ERROR CMD: 0x
  774.  STATUS: 0x
  775.  INTREG: 0x
  776.  ADR_HIGH: 0x
  777.  ADR_LOW: 0x
  778.  COUNT: 0x
  779.  EMMC_REVISION: 0x
  780.  EMMC_ERROR_INFO 0:0x
  781.  1:0x
  782.  2:0x
  783.  EMMC_ERROR_INFO 3:0x
  784.  4:0x
  785.  EMMC_EMMCMONI: 0x
  786.  STCTRL: 0x
  787. FLASH Memory (SS2) Warning: Reading error correction occurs.
  788. _interrupt_handler_dma Start.
  789. _interrupt_handler_dma End.
  790. _interrupt_handler SS Start.
  791. _interrupt_handler SS End.
  792. _interrupt_handler_ebus Start.
  793. _interrupt_handler_ebus End.
  794. KickDMA dir:
  795.  offset:
  796. FLASH (SS2) TransSbAddrToPhyAddr search_dma_mapped_bus_region_by_bus_address Fail
  797. FLASH (SS2) TransSbAddrToPhyAddr get_physical_address Fail 0x:
  798. create interrupt handle error :
  799. create interrupt dma handle error :
  800. ERROR:: ENCDEC insufficint memory. driver not created
  801. : create_dma_region failed:
  802. sys.lv1.iosys.pciex
  803. sys.lv1.iosys.pciex is
  804. sys.ac.sd
  805. AddressProtectionDomain::attachAddressSpace : already attached AddressSpace object
  806. AddressProtectionDomain::~AddressProtectionDomain: The target AddressProtectionDomain object still holds a ProtectionPage object.
  807. AddressProtectionDomain::~AddressProtectionDomain: The AddressSpace object attached to the target AddressProtectionDomain exists.
  808. AddressProtectionDomain::getPageAttribute does not found Protection Page Obj. (vaddr:0x%08x)
  809. AddressProtectionDomain::setPagesAttribute ProtectionPage (0x%08x) does not exist
  810. AddressProtectionDomain::unmapPage : ProtectionPage (0x%08x) does not exist
  811. AddressProtectionDomain::unmapPage : ProtectionPage object which has ProtectionPage::ACTIVE exists
  812. AddressProtectionDomain::mapPage: The specified virtual address or real address is not aligned to the page size which the system defines.
  813. AddressProtectionDomain::unmapPage : ProtectionPage (0x%08x) does not exist in APD(0x%016x)
  814. AddressProtectionDomain::mapPage ProtectionPage (0x%08x) already exists
  815. AddressSpace::~AddressSpace: There are any AddressProtectionDomain objects attaced to the target AddressSpace object.
  816. There is no AddressProtectionDomain objects associated with the target AddressSpace object.
  817. ConditionVariable::~ConditionVariable: There are any threads waiting for a signal arriving to the target ConditionalVariable object.
  818. ConditionVariable::timedWait: The associated Mutex object has not been loced.
  819. ConditionVariable::timedWait: This member function is called when the Scheduler is locked.
  820. ConditionVariable::wait: The associated Mutex object has not been locked.
  821. ConditionVariable::wait: This member function is called when the Scheduler is locked.
  822. exception handling daemon
  823. ../src/Core/common/ExceptionHandlingDaemon.cc
  824. ExceptionHandlingDaemon detects a fatal error.
  825. the specified stride is smaller than the size of a stack.
  826. the specified size is not a multiple of stride.
  827. the specified size is zero.
  828. MMU::initialize(): resource shortage
  829. virtualAddress = %p
  830. vdid_ = %d, vd = %p
  831. vdid = %d, old vd = %p
  832. old_vatce_1 = %p, old_vatce_2 = %p, old_vatce_3 = %p
  833. old_avpn = %p, old_virtual_address = %p
  834. Mutex::~Mutex(): The target Mutex object has been locked by any threads.
  835. Mutex::unlock(ErrorCode): The caller thread of this function is not the owner of the target Mutex object.
  836. Mutex::unlock: The caller thread of this function is not the owner of the target Mutex object.
  837. Mutex::unlock(ErrorCode): The order of releasing Mutex object is not the order of locking the Mutex object.
  838. Mutex::unlock: The order of releasing Mutex object is not the order of locking the Mutex object.
  839. Mutex::lock(): This mermber function is called when the Scheduler is locked.
  840. Mutex::timedLock(): This mermber function is called when the Scheduler is locked.
  841. [0] start: 0x%qx, size: %d
  842. [1] start: 0x%qx, end: 0x%qx
  843. [2]start: 0x%qx, end: 0x%qx
  844. nucleus_lock =
  845. msr_lock =
  846. dec_lock =
  847. Thread::Context::~Context(): The target context is used.
  848. PagePool::allocateContiguousPages: The specified alignment or numberOfPages is zero.
  849. PagePool::allocateContiguousPages: The specified alignment is not power of two.
  850. RelayPoint::wait: This member function is called when the scheduler is locked.
  851. RelayPoint::initialize: The RelayPoint object is initialized while some threads are waiting on it.
  852. RelayPoint::initialize: The RelayPoint object is initialized while the thread associated to it has not been terminated.
  853. RelayPoint::~RelayPoint(): The RelayPoint object is deleted while some threads are waiting on it
  854. RelayPoint::~RelayPoint(): The RelayPoint object is deleted while the thread associated to it has not been terminated.
  855. idling thread
  856. readyQ
  857. readyQ suc
  858. thread =
  859. cause =
  860. info =
  861. srr0 =
  862. srr1 =
  863. lr =
  864. ctr =
  865. GPR
  866. Stack trace
  867. Scheduler::onStop(%p, %d, %p)
  868. NeOS kernel for BPA
  869. Sony Cell OS Team
  870. ../src/Core/common/Thread.cc
  871. Thread::_terminate: the thread is inheriting the priority .
  872. Thread:~Thread(): The target Thread object is not in dormant state.
  873. a system exception(%d,%08x) is raised in the exception handling daemon
  874. Thread::releaseTypeFlag: invalid type flag.
  875. Thread::releaseTypeFlag:  releasing un-assigned type bit.
  876. Thread::terminate: The target Thread object holds any Mutex locks.
  877. Thread::restart: The target Thread object is not in stopped state.
  878. Thread::start: The target Thread object is not in dormant state.
  879. Thread::start: The target Thread object has not been configured.
  880. Thread::start: The specified RelayPoint is used by another Thread object.
  881. Thread::configure: The target thread object is not in dormant state.
  882. Thread::configure: The target Thread object has been configured with invalid argument.
  883. Thread::configure: The target Thread object has been configured as executing user mode, but not been specified.
  884. Thread::setBasePrioriry: The specified prioriry is not in the proper prioriry range.
  885. Timer::wait: This member function is called when the scheduler is locked.
  886. Timer::setPeriodic: The specified period less than or equals to zero.
  887. Timer::~Timer(): deleting a timer while some threads are waiting on the timer.
  888. %p %d.%09d
  889. WeakLock::~WeakLock(): The target WeakLock object has been locked by any threads.
  890. WeakLock::Lock: The caller thread of this function is holding another WeakLock object.
  891. WeakLock::tryLock: The caller thread of this function is holding another WeakLock object.
  892. WeakLock::lock: This member function is called when the scheduler is locked.
  893. initial thread
  894. dummy thread
  895. (fmt null)
  896. (null)
  897. There are some threads waiting on destructing a MessageQueue.
  898. /proc/partitions
  899. %s(%d)
  900. ERROR>
  901. ../src/PMPI/construct_logical_partition.cc
  902. couldn't create /proc/partitions/<lpar>
  903. /proc/partitions/
  904. ../src/PMPI/destruct_logical_partition.cc
  905. couldn't namei "%s" to inode
  906. /vuart/
  907. ../src/PMPI/vuart.cc
  908. proc_num =
  909. proc_ids =
  910. =====================================================
  911. lv1_ioctl: not supported request
  912. %s(%d)
  913. _INFO>
  914. ../src/UX/utils/ELF64.cc
  915. ehdr_ident = %16c
  916. ehdr_type = %d, ehdr_machine = %d, ehdr_version = %d
  917. ehdr_entry = %p, ehdr_phoff = %d, ehdr_shoff = %d
  918. ehdr_flags = 0x%08x, ehdr_ehsize = %d, ehdr_phentsize = %d
  919. ehdr_phnum = %d, ehdr_shentsize = %d, ehdr_shnum = %d
  920. ehdr_shstrndx = %d
  921. [ Stack trace ]
  922.   0x%016x: 0x%016x
  923.  0x%016x
  924.   SRR0 = 0x%016p  SRR1 = 0x%016p
  925.   r0   = 0x%016p
  926.   r1   = 0x%016p
  927.   r2   = 0x%016p
  928.   r3   = 0x%016p
  929.   r4   = 0x%016p
  930.   r5   = 0x%016p
  931.   r6   = 0x%016p
  932.   r7   = 0x%016p
  933.   r8   = 0x%016p
  934.   r9   = 0x%016p
  935.   r10  = 0x%016p
  936.   r11  = 0x%016p
  937.   r12  = 0x%016p
  938.   r13  = 0x%016p
  939.   r14  = 0x%016p
  940.   r15  = 0x%016p
  941.   r16  = 0x%016p
  942.   r17  = 0x%016p
  943.   r18  = 0x%016p
  944.   r19  = 0x%016p
  945.   r20  = 0x%016p
  946.   r21  = 0x%016p
  947.   r22  = 0x%016p
  948.   r23  = 0x%016p
  949.   r24  = 0x%016p
  950.   r25  = 0x%016p
  951.   r26  = 0x%016p
  952.   r27  = 0x%016p
  953.   r28  = 0x%016p
  954.   r29  = 0x%016p
  955.   r30  = 0x%016p
  956.   r31  = 0x%016p
  957.   LR   = 0x%016p  CTR  = 0x%016p
  958.   CR   = 0x%08p          XER  = 0x%08p
  959.   r0   = 0x%016p  
  960.   r2   = 0x%016p  
  961.   r4   = 0x%016p  
  962.   r6   = 0x%016p  
  963.   r8   = 0x%016p  
  964.   r10  = 0x%016p  
  965.   r12  = 0x%016p  
  966.   r14  = 0x%016p  
  967.   r16  = 0x%016p  
  968.   r18  = 0x%016p  
  969.   r20  = 0x%016p  
  970.   r22  = 0x%016p  
  971.   r24  = 0x%016p  
  972.   r26  = 0x%016p  
  973.   r28  = 0x%016p  
  974.   r30  = 0x%016p  
  975. ../src/UX/Kernel/PThread.cc
  976. PThread::onStop(): cause = %d, info = %p
  977. CAUSE_TARGET_DELETION: %s
  978. CAUSE_TARGET_DELETION: %p
  979. PThread::onException(): this = %p
  980. [ Exception in user mode ]
  981. "%s" pid = %d
  982.   [segmentation fault] (code = %p)
  983.   [alignment violation] (code = %p)
  984.   [program exception] (code = %p)
  985.   [floating point exception] (code = %p)
  986. %s(%d)
  987. FATAL>
  988.   !! unexpected exception !! (code = %p)
  989.   DSISR = %p, DAR = %p
  990. pme.console.split
  991. %3d: proc = %8p
  992. , ppid = %d
  993. , ppid = -
  994. , flag = %p
  995. /std
  996. ../src/UX/Kernel/Process.cc
  997. cleanup: LEAK pid = %d(%d), vaddr = %p, kaddr = %p
  998. fail detachAddressSpace (multiple errors occured) (%d)
  999. terminateProcess(): ec = %d
  1000. /std/pme_init
  1001. image.bin
  1002. ../src/UX/Kernel/UserProgramLoader.cc
  1003. target file validation failed
  1004. ../src/UX/SystemCalls/accept.cc
  1005. something happens during wait()
  1006. ../src/UX/SystemCalls/exec.cc
  1007. couldn't prepare loader for exec user program... (%d)
  1008. pid = %d, after cleanup static = %d
  1009. couldn't cleanup AddressSpace (%d)
  1010. ../src/UX/file_system/fs_core.cc
  1011. coudn't create the root directory of UX file system
  1012. unexpected: search_directory_entries result = %d
  1013. proc
  1014. ioif0
  1015. net0
  1016. hvlog0
  1017. ../src/UX/Kernel/main.cc
  1018. couldn't create the zero thread
  1019. pme.profile.time
  1020. pme.profile.counting
  1021. couldn't start ux_file_system (%d)
  1022. couldn't create the terminator process
  1023. couldn't locate the initial user program
  1024. couldn't open the initial user program file
  1025. couldn't create the initial process
  1026. couldn't prepare loader for the initial user program... (%d)
  1027. couldn't load the initial user program... (%d)
  1028. couldn't create the initial thread
  1029. couldn't set up user stack
  1030. couldn't get the entry point of the initial user program
  1031. Someone terminated or interrupted me (%d)
  1032. There should be leaked resources.
  1033. mfs_root
  1034. ../src/UX/file_system/mfs/mfs.cc
  1035. invalid image file (invalid files_offset) ?
  1036. invalid file_name_offset %d (or num_of_files, files_offset)
  1037. invalid file_offset %d (or num_of_files, files_offset)
  1038. %d: missing a terminating null of the last file name
  1039. %d: file_offset doesn't match the end of the last file
  1040. sys.load.image.in_rom
  1041. ../src/UX/SystemCalls/open.cc
  1042. unexpcted: open result = %d
  1043. partitions
  1044. vuart
  1045. ../src/UX/socket/socket_pme_msg.cc
  1046. something illegal happens during wait()
  1047. ../src/UX/SystemCalls/wait.cc
  1048. failed Process::sleep() (%d)
  1049. <%p (v%p)> ->
  1050. [%p (v%p)] ->
  1051. <%p, (%p, %p), ^%p> ->
  1052. [%p, (%p, %p), ^%p] ->
  1053. ../src/UX/utils/region_manager.cc
  1054. couldn't allocate first_free_region...
  1055. couldn't allocate first_free_region_p...
  1056. ../src/UX/Kernel/process_address_space.cc
  1057. mismatch. %p <=> %p, %p <=> %p
  1058. console
  1059. ../src/UX/file_system/console/stdlc.cc
  1060. ../src/UX/file_system/vuart/vuart_file.cc
  1061. unexpected: pmpi_read_virtual_uart result = %d
  1062. unexpected: pmpi_write_virtual_uart result = %d
  1063. ../src/UX/file_system/vuart/sc_vuart_file.cc
  1064. new syscon protcol is not supported
  1065. ../src/UX/file_system/cp/cp_file.cc
  1066. lv1 stockpile: total =
  1067. , used =
  1068. , residual =
  1069. lv1 heap
  1070. , unused =
  1071. pme stockpile: total =
  1072. pme heap: managed =
  1073. proc num =
  1074. ==========
  1075. pid =
  1076. name =
  1077. static pages =
  1078. dynamic pages =
  1079. mmap pages =
  1080. dynamic pages(max) =
  1081. mmap pages(max) =
  1082. couldn't close the device
  1083. ../src/UX/Kernel/storage_device.cc
  1084. pmi_storage_send_device_command result = %d
  1085. resource shortage
  1086. unexpected: wait_for_my_turn() wakeup_status = %d
  1087. unexpected: lv1_result = %d
  1088. unexpected: wait_for_request_completed() wakeup_status = %d
  1089. pmi_storage_write result = %d
  1090. pmi_storage_read result = %d
  1091. ../src/UX/Kernel/storage_region.cc
  1092. device_status = %x
  1093. ../src/UX/Kernel/interrupt_service_storage.cc
  1094. detected a flooding of storage events...
  1095. ../src/UX/file_system/lv1_storage/storage_region_file.cc
  1096. unexpected: read_region() region_result = %d
  1097. unexpected: write_region() region_result = %d
  1098. ../src/UX/file_system/lv1_storage/storage_ioctl_file.cc
  1099. unexpected: write() result = %d
  1100. ../src/UX/file_system/lv1_storage/storage_detector_file.cc
  1101. flash_num
  1102. sd_detector
  1103. rflash1
  1104. eflash1
  1105. rflash0
  1106. eflash0
  1107. rvflash0
  1108. evflash0
  1109. rflash_lx
  1110. rflash_lxp
  1111. local_sys0
  1112. rbd0
  1113. encdec0
  1114. %08x: %016lx
  1115. %016lx
  1116. %016lx
  1117. ../src/UX/file_system/lv1_storage/fat_fs/fat_fs.cc
  1118. FAT is broken?
  1119. bad cluster (%ld)
  1120. cluster chain: 0x%lx(%ld)
  1121. -> 0x%lx(%ld)
  1122. bad cluster
  1123. -> 0x%lx(%ld)
  1124. ../src/UX/file_system/lv1_network/lv1_net_file.cc
  1125. unexpected: pmi_net_set_hardware_info result = %d
  1126. unexpected: pmi_net_set_eurus_firmware_buffer result = %d
  1127. ID to priority
  1128. ID to ordered ID
  1129. priority to masking pattern
  1130. priority %d -> %p
  1131. ordered ID to masking pattern
  1132. ordered id %d -> %p
  1133. ordered ID to ID
  1134. ordered id %d -> %d
  1135. 0123456789abcdef
  1136. 0123456789ABCDEF
  1137. %s: sc_tc(0x%04x) == sc_rc(0x%04x)
  1138. %s: too small payload_size %d, body_len %d
  1139. %s: too large payload_len %d
  1140. %s: body_len(%04x) != body_len2(%04x)
  1141. %s: header checksum %d != %d
  1142. %s: payload checksum %d != %d
  1143. %s: too large payload_size %d
  1144. %s: be_tc(0x%04x) != be_rc(0x%04x)
  1145. %s: write_init_msg fail %d
  1146. %s: wait_swbint(0) returns unknown value %d
  1147. %s: read_cmpl_msg fail %d
  1148. %s: skip cmpl err %d, receive_id %d, transaction_id %d, communication_tag %d
  1149. %s: read_stat_msg fail %d
  1150. %s: write_stat_msg fail %d
  1151. %s: read_cmpl_msg unknown id %d
  1152. %s: read_cmpl_msg unknown transaction_id %d
  1153. %s: read_cmpl_msg unknown communication_tag %d
  1154. [WARN]: sc_version nvs fail %d
  1155. [ERROR]: nv_storage::write block %d, offset %d, size %d fail %d
  1156. [ERROR]: nv_storage::read block %d, offset %d, size %d fail %d
  1157. sc_nv_storage error status %d
  1158. ../../src/UX/selective/secure/certified_file.cc
  1159. This is not certified_file
  1160. CF version mismatch
  1161. CF category mismatch
  1162. incorrect ext_header_size
  1163. incorrect file_offset
  1164. incorrect file_size
  1165. ../../src/UX/selective/secure/self64_file.cc
  1166. self64_file: validation of certified_file failed (%d)
  1167. sys.lv1console.mode
  1168. old syscon mode is obsoluted.
  1169. ABEND: assertion failed:
  1170. ????????????????
  1171. ABEND:
  1172. LOG
  1173. too many hdec handlers
  1174. msr:
  1175. srr0:
  1176. srr1:
  1177. dar:
  1178. dsisr:
  1179. frame#
  1180. CONFIGURATION ERROR:
  1181. logger@
  1182.   buffer address:
  1183.   start pointer:
  1184.   end pointer:
  1185. sys.lv1log.size
  1186. loader parameter full (
  1187. sys.cellos.flags
  1188. sys.mmio.map_allow
  1189. mu.1.size
  1190. be.0.ioif1.addr
  1191. be.0.bp_base
  1192. sys.platform.mode
  1193. , piu
  1194. , last
  1195. heap #
  1196.   last remainder:
  1197.   Queue #
  1198.  bytes)
  1199.    
  1200.   Cache #
  1201.   Releasable
  1202. Block @
  1203. , 0x
  1204. (=2^
  1205. bytes
  1206.   Bin #
  1207. unsorted
  1208.  bytes
  1209. large
  1210. buddy_allocator@
  1211.   free list:
  1212.     2^
  1213.   free block bitmap:
  1214. [stockpile@
  1215.   budget@
  1216.   residual =
  1217.   used =
  1218.   buffer =
  1219. sys.lv0.address
  1220. sys.lv0.size
  1221. sys.lv0.revision
  1222. sys.lv0.version
  1223. sys.lv1.ahcr
  1224. Total memory:
  1225. Lv-0 size:
  1226. Heap consumption (Peak):
  1227. Peak at:
  1228. WARNING: out of memory -
  1229. FATAL: no reserved memory...
  1230. remaining reserved memory =
  1231. lv1.ram.enable
  1232. lv1.ram.ppe_ragid
  1233. lv1.ram.spe_ragid
  1234. lv1.ram.mic_tm_threshold_0
  1235. lv1.ram.mic_tm_threshold_1
  1236. lv1.ram.ioc_ioif0_quethshld
  1237. lv1.ram.ioc_ioif1_quethshld
  1238. lv1.ram.tkm_mbar
  1239. lv1.ram.tkm_ioif0_ar
  1240. lv1.ram.tkm_ioif1_ar
  1241. lv1.ram.tkm_pr
  1242. lv1.ram.tkm_cr
  1243. lv1.ram.biu_modesetup1
  1244. lv1.ram.biu_modesetup2
  1245. be.0.spu.faultbm
  1246. spurious interrupt: pu_thread #
  1247.  unit:
  1248.  interrupt:
  1249. I/O exception:
  1250. source lv1_runtime.tcl
  1251. GOPI#
  1252. invalid GOPI number
  1253. a conflict is detected
  1254. PANIC: conflicting interface number:
  1255. revision:
  1256. date:    
  1257. hash_table_base:
  1258.   node_count =
  1259.   construction_status =
  1260.   bucket_array_count =
  1261.   chain = {
  1262.       reversed_hash =
  1263.       link =
  1264.       rc =
  1265.   bucket_array[
  1266. (rc =
  1267. ) =
  1268.    
  1269. memory leak in heap for thread #
  1270.  is detected.
  1271.   managed memory:
  1272.   leak:
  1273. memory leak in stockpile for node #
  1274.  is detected.
  1275. memory_shortage
  1276. segment_association@
  1277.  peer =
  1278. , invalidation_count =
  1279. WARNING: PTE collision
  1280.         existing=
  1281.         inserted=
  1282. WARNING: PTE collision(secondary)
  1283.         existing=
  1284.         v:      
  1285.         e0:    
  1286.         e1:    
  1287.         ioaddr:
  1288.         a:      
  1289.         ioid:  
  1290. sys.pci.share
  1291. sys.lv1.iofaultmsg
  1292. : write 0x
  1293. : read 0x
  1294. WARNING: "enable_fast_get_execution_time" is deprecated
  1295. LPAR#
  1296. , PC:
  1297. pme.memory.size
  1298. pme.memory.size is not a multiple of 4KB
  1299. be.0.fir.ras_ee
  1300. be.0.fir.l2_em
  1301. be.0.fir.l2_ee
  1302. be.0.fir.biu_em
  1303. be.0.fir.biu_ee
  1304. be.0.fir.ciu_em
  1305. be.0.fir.ciu_ee
  1306. be.0.fir.mic_f0
  1307. be.0.fir.mic_f1
  1308. be.0.fir.ioc_em
  1309. be.0.fir.ioc_ee
  1310. *** dump spu
  1311.  fir regs ***
  1312. spu_fir(0x
  1313. spu_fir_error_mask(0x
  1314. spu_fir_checkstop_enable(0x
  1315. *** [DETECT] unit: spu
  1316. *** [DETECT HW Error] unit: global fir, cause: checkstop ***
  1317. ras_checkstop_fir(0x
  1318. *** [DETECT HW Error] unit: global fir, cause: recoverable ***
  1319. ras_recoverable_fir(0x
  1320. ras_fir_enable_mask(0x
  1321. *** dump global fir regs ***
  1322. ras_lerr_counter_stat(0x
  1323. *** dump biu fir regs ***
  1324. biu_fir(0x
  1325. biu_fir_error_mask(0x
  1326. biu_fir_checkstop_enable(0x
  1327. *** [DETECT] unit: biu ***
  1328. *** dump l2 fir regs ***
  1329. l2_fir(0x
  1330. l2_fir_error_mask(0x
  1331. l2_fir_checkstop_enable(0x
  1332. l2_mode_setup1(0x
  1333. *** [DETECT] unit: l2 ***
  1334. *** dump ioc fir regs ***
  1335. ioc_fir(0x
  1336. ioc_fir_error_mask(0x
  1337. ioc_fir_checkstop_enable(0x
  1338. bic_if0thr(0x
  1339. bic_if1thr(0x
  1340. bic_if0ccnt(0x
  1341. bic_if1ccnt(0x
  1342. *** [DETECT] unit: ioc ***
  1343. bic_if0rcnt(0x
  1344. bic_if1rcnt(0x
  1345. *** dump mic fir regs ***
  1346. mic_fir0(0x
  1347. mic_fir1(0x
  1348. *** [DETECT] unit: mic ***
  1349. *** dump ciu fir regs ***
  1350. ciu_fir(0x
  1351. ciu_fir_error_mask(0x
  1352. ciu_fir_checkstop_enable(0x
  1353. *** [DETECT] unit: ciu ***
  1354. sys.lv1.be_ras
  1355. HVL
  1356. sys.hvlog.size
  1357. sys.dbgcard.dgbe
  1358. SPE hang is detected: GUID
  1359. UNKNOWN
  1360. , NPC
  1361. construction of SPU management VPU failed
  1362.      
  1363. pmi_set_guest_os_mode(): already called
  1364. pmi_set_guest_os_mode(): wrong gos_mode
  1365. sys.lv1.dump_mmio
  1366. plat.id
  1367. PANIC: Can't get loader parameter =
  1368. sys.flash.fmt
  1369. sys.tmp_storage.size
  1370. spider.gbe0.macaddr.1
  1371. spider.gbe0.macaddr.2
  1372. spider.gbe0.macaddr.3
  1373. sys.debug.device
  1374. rsx.rdcy.3
  1375. rsx.rdcy.4
  1376. rsx.rdcy.5
  1377. rsx.rdcy.6
  1378. rsx.rdcy.7
  1379. rsx.rdcy.8
  1380. sys.lv1.iosysenable
  1381. ios.net.eurus.lpar
  1382. sys.hw.config_version
  1383. sys.hw.model_emulate
  1384. be.0.nclk
  1385. be.0.ioif0.addr
  1386. lv1.heap.check
  1387. [ WARNIG ]
  1388. The allocation size from the heap (
  1389. ) exceeds
  1390.  bytes: 0x
  1391. [lp=
  1392. lc.allow.large_id
  1393. [lc=
  1394. ,lp=
  1395. sys.lc.polling.time
  1396. physical_console_0
  1397. hypervisor_console
  1398. EIC driver initialization failed
  1399. FAIL: construction of a SPU objs
  1400. FAIL: Loader parameter 'be.0.spu.faultbm' is required.
  1401. sys.cellos.spu.configure
  1402. FAIL: Lv-1 does not support system SPEs more than 2.
  1403. =(unit_id=
  1404. ,resv_id=
  1405. ,normal
  1406. ,system
  1407. PUUUU
  1408. TUUUU
  1409. XUUUU
  1410. \UUUU
  1411. p`P@
  1412. 13zs
  1413. lock_dma_region_critical
  1414. sys.lv1.iosys.network
  1415. sys.hw.config
  1416. sys.hw.model_emulate
  1417. $,0BH`l
  1418. virtual int cellos::iosys::storage::storage_device::put_ioptes(cellos::uint64_t, cellos::uint64_t, cellos::uint64_t, cellos::uint64_t, cellos::uint64_t, cellos::uint64_t)
  1419. virtual int cellos::iosys::storage::storage_device::put_ioptes(cellos::uint64_t, cellos::uint64_t, cellos::uint64_t, cellos::uint64_t, cellos::uint64_t, cellos::uint64_t)
  1420. virtual int cellos::iosys::storage::storage_device::put_ioptes(cellos::uint64_t, cellos::uint64_t, cellos::uint64_t, cellos::uint64_t, cellos::uint64_t, cellos::uint64_t)
  1421. virtual int cellos::iosys::storage::storage_device::put_ioptes(cellos::uint64_t, cellos::uint64_t, cellos::uint64_t, cellos::uint64_t, cellos::uint64_t, cellos::uint64_t)
  1422. int cellos::iosys::storage::storage_device::confirm_close_common(cellos::uint64_t)
  1423. EdecXTS_XorWithMask
  1424. cellos::iosys::storage::storage_device* initialize_starship()
  1425. 0123456789abcdefghijklmnopqrstuvwxyz
  1426. read_cmpl_msg_ver1
  1427. write_init_msg_ver1
  1428. send_and_receive_safe
  1429. send_and_receive
  1430. 0000000
  1431. be.0.fir.spu0_em
  1432. be.0.fir.spu0_ee
  1433. ios.net.eurus.lpar
  1434. Cell OS SDK4.4.6 000
  1435. Copyright 2013 Sony Computer Entertainment Inc.
  1436. release build: r49873 2013_06_19_232000
  1437. 49873
  1438. Wed Jun 19 23:47:48 JST 2013
  1439.  
  1440. pme.memory.size = 2834432
  1441. sys.hvlog.size=100
  1442. sys.lv1.iosys.storage = 1
  1443. sys.lv1.iosys.pci.retry = 0
  1444. sys.lv1.iosys.pci.d.thread = 0
  1445. sys.lv1.iosys.errorhandler = 1
  1446. sys.lv1.iosys.pciex = 0
  1447. lv1.heap.afill = 0
  1448. lv1.heap.rfill = 0
  1449. sys.lv1console.mode = 0
  1450. sys.lv1.emuioif0irq = 0
  1451. sys.lv1.rsxenable = 3
  1452. sys.lv1.rsxdebug = 0
  1453. sys.lv1.be_ras = 0
  1454. sys.lv1.iofaultmsg = 0
  1455. sys.mmio.map_allow = 0
  1456. sys.pci.share = 0
  1457. sys.lc.polling.time = 500
  1458. be.0.fir.ras_ee = 0xffffffff
  1459. be.0.fir.l2_em = 0x0
  1460. be.0.fir.l2_ee = 0xeff81
  1461. be.0.fir.biu_em = 0x0
  1462. be.0.fir.biu_ee = 0xff
  1463. be.0.fir.ciu_em = 0x0
  1464. be.0.fir.ciu_ee = 0x3fe0000000000000
  1465. be.0.fir.mic_f0 = 0x0000fd7e00000000
  1466. be.0.fir.mic_f1 = 0x0000028000000000
  1467. be.0.fir.ioc_em = 0x0
  1468. be.0.fir.ioc_ee = 0x70fb0fb03f03f0f
  1469. be.0.fir.spu0_em = 0x1bf7ff
  1470. be.0.fir.spu0_ee = 0x0
  1471. be.0.fir.spu1_em = 0x1bf7ff
  1472. be.0.fir.spu1_ee = 0x0
  1473. be.0.fir.spu2_em = 0x1bf7ff
  1474. be.0.fir.spu2_ee = 0x0
  1475. be.0.fir.spu3_em = 0x1bf7ff
  1476. be.0.fir.spu3_ee = 0x0
  1477. be.0.fir.spu4_em = 0x1bf7ff
  1478. be.0.fir.spu4_ee = 0x0
  1479. be.0.fir.spu5_em = 0x1bf7ff
  1480. be.0.fir.spu5_ee = 0x0
  1481. be.0.fir.spu6_em = 0x1bf7ff
  1482. be.0.fir.spu6_ee = 0x0
  1483. be.0.fir.spu7_em = 0x1bf7ff
  1484. be.0.fir.spu7_ee = 0x0
  1485. be.0.lpm.lpar = 2
  1486. be.0.lpm.priv = 0x780301
  1487. lv1.ram.enable = 1
  1488. lv1.ram.spe_ragid = 2
  1489. lv1.ram.tkm_cr = 0x000f73e0
  1490. lv1.ram.tkm_mbar = 0x057d150e
  1491. lv1.ram.tkm_ioif0_ar = 0x00fc79cb
  1492. lv1.ram.tkm_ioif1_ar = 0
  1493. lv1.ram.tkm_pr = 0x3ffffffff
  1494. lv1.ram.mic_tm_threshold_0 = 0x86390c7000000000
  1495. lv1.ram.mic_tm_threshold_1 = 0x86390c7000000000
  1496. lv1.ram.ioc_ioif0_quethshld = 0x676700
  1497. lv1.ram.ioc_ioif1_quethshld = 0
  1498. lv1.ram.biu_modesetup1 = 0xf003c00000000000
  1499. lv1.ram.biu_modesetup2 = 0x000003c020000500
  1500. 33  
  1501. Fri Apr 16 20:17:23 2010
  1502.  rom mods 096_1
  1503. g_rsx_version
  1504. og_rsx_revoffset
  1505. pg_chip_hash
  1506. qg_fuse_select
  1507. rg_fuse_ex_rev_offset
  1508. sg_cp_dram
  1509. tg_cp_mclkt
  1510. ug_cp_gv
  1511. vg_cp_vid
  1512. wg_cp_pt
  1513. xg_cp_svop_enable
  1514. yg_cp_svop
  1515. zg_cp_svop2
  1516. {g_ft_dram
  1517. |g_ft_mclkt
  1518. }g_ft_gv
  1519. ~g_ft_vid
  1520. g_ft_pt
  1521. g_ft_svop_enable
  1522. g_ft_svop
  1523. g_ft_svop2
  1524. g_cp_rsx65_svop_enable
  1525. g_cp_rsx65_svop_sp
  1526. g_cp_rsx65_svop_dp
  1527. g_cp_rsx65_svop_pdp
  1528. g_cp_rsx40_svop_pdp
  1529. g_cp_rsx40_svop_rr
  1530. g_ft_rsx65_svop_enable
  1531. g_ft_rsx65_svop_sp
  1532. g_ft_rsx65_svop_dp
  1533. g_ft_rsx65_svop_pdp
  1534. g_ft_rsx40_svop_pdp
  1535. g_ft_rsx40_svop_rr
  1536. g_fuse_rsx65_svop_enable
  1537. g_fuse_rsx65_svop_sp
  1538. g_fuse_rsx65_svop_dp
  1539. g_fuse_rsx65_svop_pdp
  1540. g_fuse_rsx40_svop_pdp
  1541. g_fuse_rsx40_svop_rr
  1542. g_fuse_dram
  1543. g_fuse_mclkt
  1544. g_fuse_gv
  1545. g_fuse_vid
  1546. g_fuse_pt
  1547. g_fuse_vidbin
  1548. g_fuse_svop_enable
  1549. g_fuse_svop
  1550. g_fuse_svop2
  1551. g_chipid_rev
  1552. g_chipid_factory
  1553. g_chipid_lot
  1554. g_chipid_wafer
  1555. g_chipid_wafer_x
  1556. g_chipid_wafer_y
  1557. g_chipid_ds_line
  1558. g_chipid_ds_rev
  1559. g_chipid_ds_dut
  1560. g_chipid_revoffset
  1561. g_ioif_trim
  1562. g_vttgen
  1563. g_chipid_process
  1564. g_eeprom_val0
  1565. g_eeprom_val1
  1566. g_eeprom_val2
  1567. g_eeprom_val3
  1568. g_eeprom_val4
  1569. g_eeprom_val5
  1570. g_eeprom_val6
  1571. g_eeprom_val7
  1572. g_eeprom_val8
  1573. g_eeprom_val9
  1574. g_eeprom_val10
  1575. g_eeprom_val11
  1576. g_eeprom_val12
  1577. g_mpll_coeff
  1578. g_nvpll_coeff
  1579. g_loaded
  1580. g_zero
  1581. g_fs
  1582. g_cml_clk
  1583. g_mpll_first_time
  1584. g_nvpll_first_time
  1585. g_factory
  1586. rom_post_090821_rsx40_103_12
  1587. initalize_variables
  1588. dram_overwrite
  1589. force_rsx65_fuse
  1590. force_rsx40_fuse
  1591. rsx65_fuse_pt_override
  1592. rsx65_fuse_dram_override
  1593. rsx65_fuse_factory_override
  1594. undefined_rsx_process
  1595. default_mpll_coefficent
  1596.         default_nvpll_coefficent
  1597. no_chip_specific_setting_found
  1598. rsx40_no_fuse
  1599. post_finished
  1600. svop_rsx90
  1601. emaa_3
  1602. emaa_2
  1603. emaa_in_fuses
  1604. rsx65_svop
  1605. rsx40_svop
  1606. nvclk_program_start_rsx90
  1607. nvclk_program_start_rsx65
  1608. nvclk_program_start_rsx40
  1609. mpll_program_start_rsx90
  1610. dll_throttling_sequence
  1611. mpll_program_finish
  1612. mpll_program_start_rsx65
  1613. dll_throttling_sequence
  1614. mpll_program_finish_rsx65
  1615. mpll_program_start_rsx40
  1616. mpll_program_start_rsx40_first
  1617. dll_throttling_sequence
  1618. mpll_program_finish_rsx40
  1619.  cml_clk_9_1ma
  1620. !cml_clk_default
  1621. "mclkt_240ohm
  1622. #rsx65_cml_clk
  1623. $vml_clk_setting
  1624. %rsx65_cml_clk_a02
  1625. &vml_clk_setting
  1626. 'rsx90_dll_reset
  1627. (ref_delay_enable
  1628. )rsx65_dll_reset
  1629. *ref_delay_enable
  1630. +rsx65_a02_dll_reset
  1631. ,ref_delay_enable
  1632. -rsx40_dll_reset
  1633. .ref_delay_enable
  1634. /fb_a0x_hybrid_cl1464312_20060204
  1635. 0fb_b01_sne_tsb_vid12_cl1550434_mods084_6
  1636. 1fb_b01_sne_tsb_vid12_end
  1637. 2fb_b01_sne_vid3_cl1550434_mods084_6
  1638. 3fb_b01_sne_vid3_end
  1639. 4fb_b01_tsb_vid3_cl1550434_mods084_6
  1640. 5fb_b01_tsb_vid3_end
  1641. 6fb_b03_sne_tsb_vid123_samsung_cl1550434_mods084_6
  1642. 7fb_b03_sne_tsb_vid123_samsung_end
  1643. 8fb_b03_sne_tsb_vid123_infineon_cl1550434_mods084_6
  1644. 9fb_b03_sne_tsb_vid123_infineon_end
  1645. :fb_b01_fujitsu_vid123_samsung_cl1625201_mods_084_7
  1646. ;fb_b01_fujitsu_vid123_samsung_end
  1647. <fb_b01_fujitsu_vid123_inf_cl1625201_mods_084_7
  1648. =fb_b01_fujitsu_vid123_inf_end
  1649. >fb_b05_b07_sony_vid123_sam_cl1660973_mods_086_1
  1650. ?fb_b05_b07_sony_vid123_sam_cl1660973_mods_086_1_end
  1651. @fb_b05_b07_sony_vid123_inf_cl1660973_mods_086_1
  1652. Afb_b05_b07_sony_vid123_inf_cl1660973_mods_086_1_end
  1653. Bfb_b068_tsb_vid123_samsung_80nm_mods_092_2
  1654. Cfb_b068_tsby_vid123_samsung_80nm_mods_092_2_end
  1655. Dfb_b07_sne_vid123_qimonda_90nm_2_0v_mods092_2
  1656. Efb_b07_sne_vid123_qimonda_90nm_2_0v_mods092_2_end
  1657. Ffb_b068_tsb_vid123_qimonda_90nm_2_0v_mods_092_4
  1658. Gfb_b068_tsb_vid123_qimonda_90nm_2_0v_mods_092_4_end
  1659. Hfb_rsx65_a01_qimonda
  1660. Ifb_b068_tsb_vid123_qimonda_90nm_2_0v_mods_092_4
  1661. Jfb_rsx65_a01_done
  1662. Kfb_rsx65_a01_samsung
  1663. Lfb_b068_tsb_vid123_samsung_80nm
  1664. Mfb_rsx65_a01_done
  1665. Nfb_rsx65_a02_tsb_samsung
  1666. Ofb_rsx65_a02_done
  1667. Pfb_rsx65_a02_tsb_qimonda
  1668. Qfb_rsx65_a02_done
  1669. Rfb_rsx65_a02_sne_samsung
  1670. Sfb_rsx65_a02_done
  1671. Tfb_rsx65_a02_sne_qimonda
  1672. Ufb_rsx65_a02_done
  1673. Vfb_rsx65_a02_tsb_hynix
  1674. Wfb_rsx65_a02_done
  1675. Xfb_rsx65_a03_tsb_hynix
  1676. Yfb_rsx65_a02_done
  1677. Zfb_rsx65_a06_sne_qimonda80
  1678. [fb_rsx65_a02_done
  1679. \fb_rsx65_a06_tsb_samsung75
  1680. ]fb_rsx65_a02_done
  1681. ^fb_rsx40_a01_tsmc_samsung80
  1682. _fb_rsx40_a01_done
  1683. `fb_rsx40_a01_tsmc_samsung56
  1684. afb_rsx40_a01_done
  1685. bfb_rsx40_a01_tsb_samsung56
  1686. cfb_rsx40_a01_done
  1687. dfb_rsx40_a01_tsmc_hynix_orion
  1688. efb_rsx40_a01_done
  1689. ffb_rsx40_a01_tsb_samsung56_splitrail
  1690. gfb_rsx40_a01_done
  1691.  
  1692. pme_init
  1693. sysmgr_ss.fself
  1694. pme_init.conf
  1695. ss_init.fself
  1696. updater_frontend.fself
  1697. ss_server1.fself
  1698. ss_server2.fself
  1699. ss_server3.fself
  1700.  
  1701. /dev/sc3
  1702. opening %s failed
  1703. pme_user::sc_rtc::get_rtc failed:
  1704. ret = 0x%0x2
  1705. pme_init running...
  1706. pme_init: configuration error
  1707. parser::unget_char:
  1708. already head of the buffer
  1709. invalid parameter: "%c"
  1710. parser::get_char: EOF
  1711. get_char returns %d
  1712. unget_char failed: ret = %d
  1713. skip_whitespace returns %d
  1714. pme_init: wait for child exits...
  1715. waiting for child process failure
  1716. (0x%llx, 0x%llx)
  1717. wait failed:
  1718. ret = %d, errno = %d
  1719. child exits:
  1720. pid = %d, status = %d
  1721. pme_init: all children exited, exiting...
  1722. In check_sync: get_word failed: ret = %d
  1723. sync
  1724. nosync
  1725. In get_function: get_word failed: ret = %d
  1726. In process_line: get_function failed:
  1727. In process_line: get_path failed:
  1728. In process_line: check_sync failed:
  1729. In process_line: execute command failed:
  1730. timeout, system initialization failure
  1731. (0x%llx)
  1732. process synchronization failure
  1733. booting %s...
  1734. get_child_status failed
  1735. failed
  1736. pme_init: initialization failure
  1737. ready
  1738. couldn't exec %s, skip it
  1739. process execution failure
  1740. exiting... (pid: %d)
  1741. process execution failure
  1742. fork failed: ret = %d, errno = %d
  1743. parser::finalize: not initialized
  1744. parser::initialized: already initialized
  1745. pme_init.conf
  1746. no %s file
  1747. open failed:
  1748. open succeeded
  1749. lseek failed:
  1750. malloc failed
  1751. read failed:
  1752. read returns %d, not %d
  1753. close failed:
  1754. errno = %d
  1755. configuration skipped
  1756. parser::initialize failed: ret = %d
  1757. process_line returns
  1758. parser::finalize failed
  1759. boot
  1760. syscon write data:
  1761. command write failed. (%d, %d)
  1762. read failed header. (%d, %d)
  1763. syscon read data:
  1764. read failed body. (%d, %d)
  1765. %04x: %08x
  1766. %08x
  1767. %08x
  1768. map_pages failed: this = %p, area_pages = %d
  1769. max system bytes = %10lu
  1770. system bytes     = %10lu
  1771. in use bytes     = %10lu
  1772. 0123456789abcdef
  1773. 0123456789ABCDEF
  1774. (null)
  1775. GCC: (GNU) 4.1.1 (SDK420, $Rev: 3547 $)
  1776. GCC: (GNU) 4.1.1 (SDK420, $Rev: 3547 $)
  1777. GCC: (GNU) 4.1.1 (SDK420, $Rev: 3547 $)
  1778. GCC: (GNU) 4.1.1 (SDK420, $Rev: 3547 $)
  1779. GCC: (GNU) 4.1.1 (SDK420, $Rev: 3547 $)
  1780. GCC: (GNU) 4.1.1 (SDK420, $Rev: 3547 $)
  1781. GCC: (GNU) 4.1.1 (SDK420, $Rev: 3547 $)
  1782. GCC: (GNU) 4.1.1 (SDK420, $Rev: 3547 $)
  1783. GCC: (GNU) 4.1.1 (SDK420, $Rev: 3547 $)
  1784. GCC: (GNU) 4.1.1 (SDK420, $Rev: 3547 $)
  1785. GCC: (GNU) 4.1.1 (SDK420, $Rev: 3547 $)
  1786. GCC: (GNU) 4.1.1 (SDK420, $Rev: 3547 $)
  1787. GCC: (GNU) 4.1.1 (SDK420, $Rev: 3547 $)
  1788. GCC: (GNU) 4.1.1 (SDK420, $Rev: 3547 $)
  1789. GCC: (GNU) 4.1.1 (SDK420, $Rev: 3547 $)
  1790. GCC: (GNU) 4.1.1 (SDK420, $Rev: 3547 $)
  1791. GCC: (GNU) 4.1.1 (SDK420, $Rev: 3547 $)
  1792. GCC: (GNU) 4.1.1 (SDK420, $Rev: 3547 $)
  1793. GCC: (GNU) 4.1.1 (SDK420, $Rev: 3547 $)
  1794. GCC: (GNU) 4.1.1 (SDK420, $Rev: 3547 $)
  1795. GCC: (GNU) 4.1.1 (SDK420, $Rev: 3547 $)
  1796. GCC: (GNU) 4.1.1 (SDK420, $Rev: 3547 $)
  1797. GCC: (GNU) 4.1.1 (SDK420, $Rev: 3547 $)
  1798. GCC: (GNU) 4.1.1 (SDK420, $Rev: 3547 $)
  1799. GCC: (GNU) 4.1.1 (SDK420, $Rev: 3547 $)
  1800. GCC: (GNU) 4.1.1 (SDK420, $Rev: 3547 $)
  1801. GCC: (GNU) 4.1.1 (SDK420, $Rev: 3547 $)
  1802. GCC: (GNU) 4.1.1 (SDK420, $Rev: 3547 $)
  1803. GCC: (GNU) 4.1.1 (SDK420, $Rev: 3547 $)
  1804. GCC: (GNU) 4.1.1 (SDK420, $Rev: 3547 $)
  1805. GCC: (GNU) 4.1.1 (SDK420, $Rev: 3547 $)
  1806. GCC: (GNU) 4.1.1 (SDK420, $Rev: 3547 $)
  1807. GCC: (GNU) 4.1.1 (SDK420, $Rev: 3547 $)
  1808. GCC: (GNU) 4.1.1 (SDK420, $Rev: 3547 $)
  1809. GCC: (GNU) 4.1.1 (SDK420, $Rev: 3547 $)
  1810. GCC: (GNU) 4.1.1 (SDK420, $Rev: 3547 $)
  1811. GCC: (GNU) 4.1.1 (SDK420, $Rev: 3547 $)
  1812. GCC: (GNU) 4.1.1 (SDK420, $Rev: 3547 $)
  1813. GCC: (GNU) 4.1.1 (SDK420, $Rev: 3547 $)
  1814. GCC: (GNU) 4.1.1 (SDK420, $Rev: 3547 $)
  1815. GCC: (GNU) 4.1.1 (SDK420, $Rev: 3547 $)
  1816. GCC: (GNU) 4.1.1 (SDK420, $Rev: 3547 $)
  1817. GCC: (GNU) 4.1.1 (SDK420, $Rev: 3547 $)
  1818. GCC: (GNU) 4.1.1 (SDK420, $Rev: 3547 $)
  1819. GCC: (GNU) 4.1.1 (SDK420, $Rev: 3547 $)
  1820. GCC: (GNU) 4.1.1 (SDK420, $Rev: 3547 $)
  1821. GCC: (GNU) 4.1.1 (SDK420, $Rev: 3547 $)
  1822. .shstrtab
  1823. .text
  1824. .rodata
  1825. .data
  1826. .opd
  1827. .got
  1828. .bss
  1829. .comment
  1830.  
  1831. enable
  1832. /dev/ioif0
  1833. /dev/sc0
  1834. /proc/partitions/%d/vuart/%d
  1835. PS3_LPAR
  1836. PS2_LPAR
  1837. PS2_GX_LPAR
  1838. PS2_SW_LPAR
  1839. dprint_level
  1840. param
  1841. load
  1842. rom1st
  1843. config
  1844. plat
  1845. /rmt/av_setting.conf
  1846.  3Y1
  1847. bootup
  1848. status
  1849. sysmgr_e : failed to boot lpar %d
  1850. poweroff!
  1851. reboot!
  1852. reboot!!
  1853. *failed to stop bd drive
  1854. poweroff !
  1855. reboot !
  1856. sysmgr : altering lv0 or lv1 is detected.
  1857. sysmgr : integrity check for lv0 and lv1 has passed.
  1858. sysmgr : initial gos boot(%d). avinit=%c, safe=%c
  1859. DEFAULT.SPP
  1860. /std
  1861. sysmgr_if : notify lpar shutdown start to tsma
  1862. sysmgr_if : notify lpar shutdown start to av set %d
  1863. sysmgr_if : notify lpar boot done to tsma
  1864. sysmgr_if : notify lpar boot done to av set
  1865. sysmgr_if : notify lpar kill done to tsma
  1866. sysmgr_if : notify lpar shutdown done to av set
  1867. sysmgr_if : notify lpar shutdown done to tsma
  1868. sysmgr_if : notify lpar boot start to tsma
  1869. sysmgr_if : boot param from SC eeprom
  1870. sysmgr_if : notify lpar boot start to av set %d
  1871. sysmgr_if : notify system boot done to tsma
  1872. sysmgr_if : notify system boot done to av set
  1873. sysmgr_if : notify system shutdown start to tsma
  1874. sysmgr_if : notify system shutdown start to av set %d
  1875. sysmgr_if : notify lpar kill start to tsma
  1876. sysmgr_if : shutdown current lpar refused (no active lpar)
  1877. sysmgr_if : killing current lpar refused (no active lpar)
  1878. lpar_event : fan policy %d. st=%d/id=%d/policy=%d/mode=%d/duty=%d
  1879. lpar_event : fan policy %d. invalid id=%d
  1880. lpar_event : * fan policy %d. %s no privilege
  1881. lpar_event : factory_process_comp %d. st=%x comp=%04x(%04x)
  1882. lpar_event : * factory_process_comp %d. %s no privilege
  1883. lpar_event : rtc_alarm %d status=%x clock=%d
  1884. lpar_event : * rtc_alarm %d. %s no privilege
  1885. lpar_event : boot parameter %d. param=%lx, st=%d
  1886. lpar_event : * boot parameter %d. %s no privilege
  1887. lpar_event : * receive unknown response. type=%d
  1888. lpar_event : * failed to send packet to lpar %d
  1889. lpar_event : to lpar (sid=%d, size=%d)
  1890. lpar_event : temperature : tzone=%d: temp:%d.%d
  1891. lpar_event : from lpar (sid=%d, size=%d)
  1892. lpar_event : * failed to close socket %d
  1893. lpar_event : * destruct virtual uart failed %d
  1894. lpar_event : * construct virtual uart %d failed %d
  1895. lpar_event : * vuart port %d open failed
  1896. lpar_event : * ring buzzer. %s no privilege
  1897. lpar_event : inter-lpar parameter length = %d, type = %d
  1898. lpar_event : * inter lpar parameter size over (%d > %d)
  1899. lpar_event : get_set_config domain=%d, command=%d
  1900. lpar_event : * set config. %s no privilege
  1901. lpar_event : * control led. %s no privilege
  1902. lpar_event : request_system_event_log flag=%d, offset=%d
  1903. lpar_event : * request_system_event_log. %s no privilege
  1904. lpar_event : request_sc_version
  1905. lpar_event : * request_sc_version. %s no privilege
  1906. lpar_event : request_be_count
  1907. lpar_event : * request_be_count. %s no privilege
  1908. lpar_event : request_error_log offset=%d
  1909. lpar_event : * request_error_log. %s no privilege
  1910. lpar_event : set_next_operation %x, %x
  1911. lpar_event : * next operation. %s can't do sysop %d (no privilege)
  1912. boot
  1913. lpar_event : * rewrite %d failed
  1914. lpar_event : * next operation. %s can't boot gos, id=%d (no privilege)
  1915. lpar_event : * receive uart unknown operation. type=%x
  1916. lpar_event : send inter-lpar parameter: bytes=%d
  1917. lpar_event : set_shop_demo_mode status=%d mode=%d
  1918. lpar_event : * set_shop_demo_mode. %s no privilege
  1919.  lparmgr : boot failed reason = %d
  1920.  lparmgr : give up booting %s
  1921.  lparmgr : * initialize default repository failed %d
  1922. rgntotal
  1923. rm_addr
  1924. rm_size
  1925. channel
  1926. bitmap
  1927. spun
  1928. spursv
  1929. spursvn
  1930. parameter
  1931. vir_uart
  1932. port
  1933. sysmgr
  1934. avset
  1935.  lparmgr : * construct_logical_pu failed = %x
  1936.  lparmgr : boot parameter = %08x_%08x
  1937.  lparmgr : * construct repositories failed
  1938. eurus
  1939. lpar
  1940. iso_enbl
  1941.  lparmgr : * activate logical pu failed %x
  1942.  lparmgr : boot completed
  1943.  ------------------------------------------
  1944.  lparmgr : booting %s partition...
  1945.  lparmgr : ability=%x
  1946.  lparmgr : * construct logical parition failed %x
  1947.  lparmgr : * allocate memory failed %x
  1948.  lparmgr : skip ata_key
  1949.  lparmgr : setup bd drive...
  1950.  lparmgr : * setup bd drive failed
  1951. done
  1952.  lparmgr : * extra param setup failed
  1953.  lparmgr : load guestos...
  1954.  lparmgr : * load guest os image failed %d
  1955.  lparmgr : * registering shutdown signal handler failed %x
  1956. sysmgr : * get contents size failed. status=%d, prof=%s/file=%s/type=%d
  1957. sysmgr : * get contents failed. status=%d, prof=%s/file=%s/type=%d
  1958. SCE_CELLOS_SYSTEM_MGR
  1959. SCE_CELLOS_SYSTEM_MGR_PS2
  1960. SCE_CELLOS_SYSTEM_MGR_PS2_GX
  1961. SCE_CELLOS_SYSTEM_MGR_PS2_SW
  1962. SCE_CELLOS_SYSTEM_MGR_PS2_NE
  1963. SCE_CELLOS_PME
  1964. cellos memory size = %ldB
  1965. PS2_NE_LPAR
  1966.  lparmgr : * construct event receive port failed %x
  1967. lparmgr : * get lpar parameter size failed. status=%d, prof=%s
  1968. lparmgr : * get lpar parameter failed . status=%d, prof=%s
  1969. lparmgr : * lpar parameter size unmatch. buf_size=%d, acm_size=%d, using buf_size...
  1970.  lparmgr : shutdown %s partition...
  1971.  lparmgr : * shutdown %s failed %x
  1972.  lparmgr : start destructing partition. id=%d
  1973.  lparmgr : kill %s partition... id=%d
  1974.  lparmgr : shutdown(kill) %s partition...
  1975.  lparmgr : * shutdown(kill) %s failed %x
  1976.  lparmgr : shutdown %s rejected (invalid lpar state %d)
  1977.  lparmgr : start shutdown partition. id=%d
  1978.  lparmgr : send shutdown command to %s
  1979.  lparmgr : unload guestos...
  1980. Failed to get_logical_partition_info for %s. status=%d
  1981.  lparmgr : destructing partition...
  1982. Failed to destruct_logical_partition for %s. result=%d
  1983. reset bd drive failed
  1984. rgnn
  1985. address
  1986.  ps2_entry : * power off pci bus failed.
  1987.  ps2_entry : * power on pci bus failed.
  1988.  lpar_entry : * no scheduling table entry in spp file
  1989.  lpar_entry : * construct scheduling table failed %d
  1990.   -----
  1991.  lpar_entry : * scheduling slot table looking up failed %d
  1992.   slot %d:index=%d,name=%s,ts=%dus(%ld)
  1993.  lpar_entry : * set_scheduling_slot failed %d
  1994. product
  1995. mode
  1996. flash
  1997. sysmgr.boot.ps2.1st
  1998. sysmgr.boot.ps2netemu.1st
  1999. sysmgr.debug.level
  2000. spursvsl
  2001. sysmgr : spu condition info = %p
  2002. asysspun
  2003. sysmgr : number of system spus = %d
  2004. ausrspun
  2005. sysmgr : available number of spus for lpar = %d
  2006. clock
  2007. sysmgr : tb_frequency = %d
  2008. size
  2009. config : total memory size = %d(%dMB)
  2010. hw_config=%x_%x
  2011. /rmt/%s
  2012. /std/%s
  2013. /dev/net0
  2014. /local_sys0/sys/internal/eurus_fw.bin
  2015. eurus_fw.bin
  2016. net_manager::reset_eurus failed(%d) flag=%d
  2017. net_manager::read_firmware invaild jump command : command=0x%08x, new_data_size=%d current_offset=%d, data_offset=%d
  2018. net_manager:: Error : eurus F/W download failed.
  2019. net_manager::read_firmware invaild data : command=0x%08x, new_data_size=%d current_offset=%d, data_offset=%d
  2020. net_manager::read_firmware data: %d, firm_offset: %d
  2021. net_manager::put_firmware read firmware fails.
  2022. net_manager::put_firmware ioctl (EURUS_FIRM) fails %d
  2023. net_manager::open_firmware can't open file (FAT)
  2024. net_manager::open_firmware open file (FAT)
  2025. net_manager::open_firmware open file (COMPOSITE)
  2026. net_manager::on_event_received ioctl (EURUS_STAT) failed.
  2027. net_manager::on_event_received Error : eurus F/W download failed.
  2028. net_manager::on_event_received firmware downloaded.
  2029. net_manager::start_firmware_download
  2030. net_manager::initialize ...
  2031. net_manager::initialize couldn't open the file %s. (%d)
  2032. net_manager::initialize mac_addr=0x%016lx
  2033. net_manager::initialize ioctl (NET_INIT) fails %d
  2034. net_manager::initialize ... completed.
  2035. timer : expired
  2036. timer : set alarm %d us
  2037. str_manager : set_ata_key success
  2038. region0
  2039. access
  2040. str_manager : * set_ata_key failed (0x%x)
  2041. str_manager : delete_ata_key success
  2042. str_manager : * delete_ata_key failed (0x%x)
  2043. str_manager : skip delete_ata_key
  2044. str_manager : * read size error %d != %d
  2045. str_manager : event=%llu, bus_id=%llu, dev_id=%llu, port=%lld, dev_type=%llx
  2046. str_manager : * unknown event type (%d)
  2047. /dev/rbd0
  2048. /dev/sd_detector
  2049. str_manager : * fatal error. can not open device file
  2050. no response from syscon. waiting reply for transaction:
  2051.   %04x
  2052. sc_manager : from syscon (reply=%x)
  2053. sc_manager : to syscon (comm=%x)
  2054. sc_manager : set_wake_source %x
  2055. control_led : p=%x,s=%x result=%d
  2056. control_led : b=%x,h=%x result=%d
  2057. press : timer failed [%d]->[%d]
  2058. sc_manager : * receive unknown packet from syscon. cmd id:%x
  2059. sc_timer : invalid state [%d]
  2060. sc_manager : %smask %d event
  2061. sc_manager : read header error
  2062. sc_manager : read body error
  2063. header %d byte:
  2064. %02x
  2065. body %d byte:
  2066. sc_manager : from syscon (event=%x size=%d)
  2067. sc_manager : set_wake_source %x->%x
  2068. /dev/sc1
  2069. sc_manager : fatal error. can not open syscon device file
  2070. sc_manager : wake source : %x
  2071. map_pages failed: this = %p, area_pages = %d
  2072. syscon write data:
  2073. command write failed. (%d, %d)
  2074. shutdown handler invoked
  2075.  unknown shutdown interrupt %d
  2076. /dev/hvlog0
  2077. hvlog size error %d != %d
  2078. system event id=0x%x, rtc=%d, size=%d [0x%lx 0x%lx 0x%lx 0x%lx]
  2079. /dev/cp0
  2080. sysmgr.conf
  2081. max socket entries
  2082. net_manager(ss)::initialize read_system_data mac_addr=0x%016lx status=%d
  2083. net_manager(ss)::initialize read_system_data wlan_data1=0x%016lx wlan_data2=0x%016lx status=%d
  2084. composite_region::read(0x%llx, %lld, 0x%llx)
  2085. composite_region::allocate_buffer(%lld)
  2086. composite_region::release_buffer(0x%llx)
  2087. composite_region::cache_all_composite_region_entry()
  2088.         offset = %d
  2089.         header is not cached
  2090.         entry is not cached
  2091. composite_region::get_composite_region_entry_by_index(%d, 0x%llx)
  2092. composite_region::writev()
  2093. blksize = 0x%llx, mask = 0x%llx
  2094. iovec[%d].offset = 0x%llx
  2095. iovec[%d].size = 0x%llx
  2096. iovec[%d].buf = 0x%llx
  2097. [%d] align_offset = 0x%llx
  2098. writev(): flush previous data (0x%llx)
  2099. writev(): read initial data (0x%llx)
  2100. writev(): flush last data (0x%llx)
  2101. packet_id: 0x%llx
  2102. function_id: 0x%llx
  2103. retval: 0x%x
  2104. subject_id: (0x%llx,0x%llx)
  2105.     # ss_packet::send_receive (CLIENT) : func_id=0x%llx, packet_id=0x%llx, subject_id=(0x%llx,0x%llx)
  2106.  !!! if_proto::send_receive error : cannot find port ID for function_id=0x%x
  2107.  # if_proto::send_receive : port_id=%llu
  2108.  !!! if_proto::send_receive error : cannot connect port=%u
  2109.  # port_id_table::function_id2port_id : func ID=0x%llx, portid=0x%llx
  2110. read_nbytes : read errno=%d
  2111. read_nbytes : unexpected EOF.
  2112.  # pme_client::receive : PID=%u
  2113. write_nbytes : write errno=%d
  2114. write : unexpected EOF.
  2115.  # pme_client::disconnect : PID=%u
  2116. !!! pme_client::disconnect : close failed (errno=%d)
  2117.  # pme_client::connect : PID=%u, portid=%u
  2118. !!! pme_client:connect : socket failed (errno=%d)
  2119. !!! pme_client::connect : connect failed (port_id=%u, errno=%d)
  2120.  # pme_client::send : PID=%u
  2121. !!! page_bytestring::free_page : unmap_pages failed, page_addr=%p
  2122. !!! page_bytestring::alloc_page : map_pages failed, page_num=%u
  2123. ros0
  2124. ros1
  2125. OS_BANK:0x%llx, 0x%llx
  2126. OS_BANK repository error:0x%llx
  2127. PRG_RVK_BANK:0x%llx, 0x%llx
  2128. PRG_RVK_BANK repository error:0x%llx
  2129. PKG_RVK_BANK:0x%llx, 0x%llx
  2130. PKG_RVK_BANK repository error:0x%llx
  2131. bank_manager::get_repository_value(m_type = %d)
  2132. settle value mismatched. 0x%llx : 0x%llx
  2133. bank_manager::setup(%d)
  2134. bank repository found
  2135. bank repository not found
  2136. max system bytes = %10lu
  2137. system bytes     = %10lu
  2138. in use bytes     = %10lu
  2139. 0123456789abcdef
  2140. 0123456789ABCDEF
  2141. (null)
  2142. P`R S
  2143. P`R S
  2144. P`R*S
  2145. P`R*S
  2146. P`R*S
  2147. P`R*S
  2148. P`R*S
  2149. P`R*S
  2150. P`R*S
  2151. P`R*S
  2152. P`R.S
  2153. P`R.S
  2154. P`R.S
  2155. P`R.S
  2156. PS3_LPAR
  2157. /dev/rflash
  2158. /dev/eflash
  2159. /_init_storage/
  2160. /dev/flash_num
  2161.  ?P?
  2162. UUUUU
  2163. GCC: (GNU) 4.1.1 (SDK310, $Rev: 3320 $)
  2164. GCC: (GNU) 4.1.1 (SDK420, $Rev: 3547 $)
  2165. GCC: (GNU) 4.1.1 (SDK310, $Rev: 3320 $)
  2166. GCC: (GNU) 4.1.1 (SDK310, $Rev: 3320 $)
  2167. GCC: (GNU) 4.1.1 (SDK310, $Rev: 3320 $)
  2168. GCC: (GNU) 4.1.1 (SDK310, $Rev: 3320 $)
  2169. GCC: (GNU) 4.1.1 (SDK310, $Rev: 3320 $)
  2170. GCC: (GNU) 4.1.1 (SDK420, $Rev: 3547 $)
  2171. GCC: (GNU) 4.1.1 (CELL 4.1.2.7, $Rev: 2520 $)
  2172. GCC: (GNU) 4.1.1 (SDK310, $Rev: 3320 $)
  2173. GCC: (GNU) 4.1.1 (SDK420, $Rev: 3547 $)
  2174. GCC: (GNU) 4.1.1 (SDK420, $Rev: 3547 $)
  2175. GCC: (GNU) 4.1.1 (SDK420, $Rev: 3547 $)
  2176. GCC: (GNU) 4.1.1 (SDK420, $Rev: 3547 $)
  2177. GCC: (GNU) 4.1.1 (SDK420, $Rev: 3547 $)
  2178. GCC: (GNU) 4.1.1 (SDK420, $Rev: 3547 $)
  2179. GCC: (GNU) 4.1.1 (SDK420, $Rev: 3547 $)
  2180. GCC: (GNU) 4.1.1 (SDK420, $Rev: 3547 $)
  2181. GCC: (GNU) 4.1.1 (SDK420, $Rev: 3547 $)
  2182. GCC: (GNU) 4.1.1 (SDK420, $Rev: 3547 $)
  2183. GCC: (GNU) 4.1.1 (SDK420, $Rev: 3547 $)
  2184. GCC: (GNU) 4.1.1 (SDK420, $Rev: 3547 $)
  2185. GCC: (GNU) 4.1.1 (SDK420, $Rev: 3547 $)
  2186. GCC: (GNU) 4.1.1 (SDK420, $Rev: 3547 $)
  2187. GCC: (GNU) 4.1.1 (SDK420, $Rev: 3547 $)
  2188. GCC: (GNU) 4.1.1 (SDK420, $Rev: 3547 $)
  2189. GCC: (GNU) 4.1.1 (SDK420, $Rev: 3547 $)
  2190. GCC: (GNU) 4.1.1 (SDK420, $Rev: 3547 $)
  2191. GCC: (GNU) 4.1.1 (SDK420, $Rev: 3547 $)
  2192. GCC: (GNU) 4.1.1 (SDK420, $Rev: 3547 $)
  2193. GCC: (GNU) 4.1.1 (SDK420, $Rev: 3547 $)
  2194. GCC: (GNU) 4.1.1 (SDK420, $Rev: 3547 $)
  2195. GCC: (GNU) 4.1.1 (SDK420, $Rev: 3547 $)
  2196. GCC: (GNU) 4.1.1 (SDK420, $Rev: 3547 $)
  2197. GCC: (GNU) 4.1.1 (SDK420, $Rev: 3547 $)
  2198. GCC: (GNU) 4.1.1 (SDK420, $Rev: 3547 $)
  2199. GCC: (GNU) 4.1.1 (SDK420, $Rev: 3547 $)
  2200. GCC: (GNU) 4.1.1 (SDK420, $Rev: 3547 $)
  2201. GCC: (GNU) 4.1.1 (SDK420, $Rev: 3547 $)
  2202. GCC: (GNU) 4.1.1 (SDK420, $Rev: 3547 $)
  2203. GCC: (GNU) 4.1.1 (SDK420, $Rev: 3547 $)
  2204. GCC: (GNU) 4.1.1 (SDK420, $Rev: 3547 $)
  2205. GCC: (GNU) 4.1.1 (SDK420, $Rev: 3547 $)
  2206. GCC: (GNU) 4.1.1 (SDK420, $Rev: 3547 $)
  2207. GCC: (GNU) 4.1.1 (SDK420, $Rev: 3547 $)
  2208. GCC: (GNU) 4.1.1 (SDK420, $Rev: 3547 $)
  2209. GCC: (GNU) 4.1.1 (SDK420, $Rev: 3547 $)
  2210. GCC: (GNU) 4.1.1 (SDK420, $Rev: 3547 $)
  2211. GCC: (GNU) 4.1.1 (SDK420, $Rev: 3547 $)
  2212. GCC: (GNU) 4.1.1 (SDK420, $Rev: 3547 $)
  2213. GCC: (GNU) 4.1.1 (SDK420, $Rev: 3547 $)
  2214. GCC: (GNU) 4.1.1 (SDK420, $Rev: 3547 $)
  2215. GCC: (GNU) 4.1.1 (SDK420, $Rev: 3547 $)
  2216. GCC: (GNU) 4.1.1 (SDK420, $Rev: 3547 $)
  2217. GCC: (GNU) 4.1.1 (SDK420, $Rev: 3547 $)
  2218. GCC: (GNU) 4.1.1 (SDK420, $Rev: 3547 $)
  2219. GCC: (GNU) 4.1.1 (SDK420, $Rev: 3547 $)
  2220. GCC: (GNU) 4.1.1 (SDK420, $Rev: 3547 $)
  2221. GCC: (GNU) 4.1.1 (SDK420, $Rev: 3547 $)
  2222. GCC: (GNU) 4.1.1 (SDK420, $Rev: 3547 $)
  2223. GCC: (GNU) 4.1.1 (SDK420, $Rev: 3547 $)
  2224. GCC: (GNU) 4.1.1 (SDK420, $Rev: 3547 $)
  2225. GCC: (GNU) 4.1.1 (SDK420, $Rev: 3547 $)
  2226. GCC: (GNU) 4.1.1 (SDK420, $Rev: 3547 $)
  2227. GCC: (GNU) 4.1.1 (SDK420, $Rev: 3547 $)
  2228. GCC: (GNU) 4.1.1 (SDK420, $Rev: 3547 $)
  2229. GCC: (GNU) 4.1.1 (SDK420, $Rev: 3547 $)
  2230. GCC: (GNU) 4.1.1 (SDK420, $Rev: 3547 $)
  2231. GCC: (GNU) 4.1.1 (SDK420, $Rev: 3547 $)
  2232. GCC: (GNU) 4.1.1 (SDK420, $Rev: 3547 $)
  2233. GCC: (GNU) 4.1.1 (SDK420, $Rev: 3547 $)
  2234. GCC: (GNU) 4.1.1 (SDK420, $Rev: 3547 $)
  2235. GCC: (GNU) 4.1.1 (SDK420, $Rev: 3547 $)
  2236. GCC: (GNU) 4.1.1 (SDK420, $Rev: 3547 $)
  2237. GCC: (GNU) 4.1.1 (SDK420, $Rev: 3547 $)
  2238. GCC: (GNU) 4.1.1 (SDK420, $Rev: 3547 $)
  2239. GCC: (GNU) 4.1.1 (SDK420, $Rev: 3547 $)
  2240. GCC: (GNU) 4.1.1 (SDK420, $Rev: 3547 $)
  2241. GCC: (GNU) 4.1.1 (SDK420, $Rev: 3547 $)
  2242. GCC: (GNU) 4.1.1 (SDK420, $Rev: 3547 $)
  2243. GCC: (GNU) 4.1.1 (SDK420, $Rev: 3547 $)
  2244. GCC: (GNU) 4.1.1 (SDK420, $Rev: 3547 $)
  2245. GCC: (GNU) 4.1.1 (SDK420, $Rev: 3547 $)
  2246. GCC: (GNU) 4.1.1 (SDK420, $Rev: 3547 $)
  2247. GCC: (GNU) 4.1.1 (SDK420, $Rev: 3547 $)
  2248. GCC: (GNU) 4.1.1 (SDK420, $Rev: 3547 $)
  2249. GCC: (GNU) 4.1.1 (SDK420, $Rev: 3547 $)
  2250. GCC: (GNU) 4.1.1 (SDK420, $Rev: 3547 $)
  2251. GCC: (GNU) 4.1.1 (SDK420, $Rev: 3547 $)
  2252. GCC: (GNU) 4.1.1 (SDK420, $Rev: 3547 $)
  2253. GCC: (GNU) 4.1.1 (SDK420, $Rev: 3547 $)
  2254. GCC: (GNU) 4.1.1 (SDK420, $Rev: 3547 $)
  2255. GCC: (GNU) 4.1.1 (SDK420, $Rev: 3547 $)
  2256. GCC: (GNU) 4.1.1 (SDK420, $Rev: 3547 $)
  2257. GCC: (GNU) 4.1.1 (SDK420, $Rev: 3547 $)
  2258. GCC: (GNU) 4.1.1 (SDK420, $Rev: 3547 $)
  2259. GCC: (GNU) 4.1.1 (SDK420, $Rev: 3547 $)
  2260. GCC: (GNU) 4.1.1 (SDK420, $Rev: 3547 $)
  2261. GCC: (GNU) 4.1.1 (SDK420, $Rev: 3547 $)
  2262. GCC: (GNU) 4.1.1 (SDK420, $Rev: 3547 $)
  2263. GCC: (GNU) 4.1.1 (SDK420, $Rev: 3547 $)
  2264. GCC: (GNU) 4.1.1 (SDK420, $Rev: 3547 $)
  2265. GCC: (GNU) 4.1.1 (SDK420, $Rev: 3547 $)
  2266. GCC: (GNU) 4.1.1 (SDK420, $Rev: 3547 $)
  2267. GCC: (GNU) 4.1.1 (SDK420, $Rev: 3547 $)
  2268. GCC: (GNU) 4.1.1 (SDK420, $Rev: 3547 $)
  2269. GCC: (GNU) 4.1.1 (SDK420, $Rev: 3547 $)
  2270. GCC: (GNU) 4.1.1 (SDK420, $Rev: 3547 $)
  2271. GCC: (GNU) 4.1.1 (SDK420, $Rev: 3547 $)
  2272. GCC: (GNU) 4.1.1 (SDK420, $Rev: 3547 $)
  2273. GCC: (GNU) 4.1.1 (SDK420, $Rev: 3547 $)
  2274. GCC: (GNU) 4.1.1 (SDK420, $Rev: 3547 $)
  2275. GCC: (GNU) 4.1.1 (SDK420, $Rev: 3547 $)
  2276. GCC: (GNU) 4.1.1 (SDK420, $Rev: 3547 $)
  2277. GCC: (GNU) 4.1.1 (SDK420, $Rev: 3547 $)
  2278. GCC: (GNU) 4.1.1 (SDK420, $Rev: 3547 $)
  2279. GCC: (GNU) 4.1.1 (SDK420, $Rev: 3547 $)
  2280. GCC: (GNU) 4.1.1 (SDK420, $Rev: 3547 $)
  2281. GCC: (GNU) 4.1.1 (SDK420, $Rev: 3547 $)
  2282. GCC: (GNU) 4.1.1 (SDK420, $Rev: 3547 $)
  2283. GCC: (GNU) 4.1.1 (SDK420, $Rev: 3547 $)
  2284. GCC: (GNU) 4.1.1 (SDK420, $Rev: 3547 $)
  2285. GCC: (GNU) 4.1.1 (SDK420, $Rev: 3547 $)
  2286. GCC: (GNU) 4.1.1 (SDK420, $Rev: 3547 $)
  2287. GCC: (GNU) 4.1.1 (SDK420, $Rev: 3547 $)
  2288. GCC: (GNU) 4.1.1 (SDK420, $Rev: 3547 $)
  2289. GCC: (GNU) 4.1.1 (SDK420, $Rev: 3547 $)
  2290. GCC: (GNU) 4.1.1 (SDK420, $Rev: 3547 $)
  2291. GCC: (GNU) 4.1.1 (SDK420, $Rev: 3547 $)
  2292. GCC: (GNU) 4.1.1 (SDK420, $Rev: 3547 $)
  2293. GCC: (GNU) 4.1.1 (SDK420, $Rev: 3547 $)
  2294. GCC: (GNU) 4.1.1 (SDK420, $Rev: 3547 $)
  2295. GCC: (GNU) 4.1.1 (SDK420, $Rev: 3547 $)
  2296. GCC: (GNU) 4.1.1 (SDK420, $Rev: 3547 $)
  2297. GCC: (GNU) 4.1.1 (SDK420, $Rev: 3547 $)
  2298. GCC: (GNU) 4.1.1 (SDK420, $Rev: 3547 $)
  2299. GCC: (GNU) 4.1.1 (SDK420, $Rev: 3547 $)
  2300. GCC: (GNU) 4.1.1 (SDK420, $Rev: 3547 $)
  2301. GCC: (GNU) 4.1.1 (SDK420, $Rev: 3547 $)
  2302. GCC: (GNU) 4.1.1 (SDK420, $Rev: 3547 $)
  2303. GCC: (GNU) 4.1.1 (SDK420, $Rev: 3547 $)
  2304. GCC: (GNU) 4.1.1 (SDK420, $Rev: 3547 $)
  2305. GCC: (GNU) 4.1.1 (SDK420, $Rev: 3547 $)
  2306. GCC: (GNU) 4.1.1 (SDK420, $Rev: 3547 $)
  2307. GCC: (GNU) 4.1.1 (SDK420, $Rev: 3547 $)
  2308. GCC: (GNU) 4.1.1 (SDK420, $Rev: 3547 $)
  2309. GCC: (GNU) 4.1.1 (SDK420, $Rev: 3547 $)
  2310. GCC: (GNU) 4.1.1 (SDK420, $Rev: 3547 $)
  2311. GCC: (GNU) 4.1.1 (SDK420, $Rev: 3547 $)
  2312. GCC: (GNU) 4.1.1 (SDK420, $Rev: 3547 $)
  2313. GCC: (GNU) 4.1.1 (SDK420, $Rev: 3547 $)
  2314. GCC: (GNU) 4.1.1 (SDK420, $Rev: 3547 $)
  2315. GCC: (GNU) 4.1.1 (SDK420, $Rev: 3547 $)
  2316. GCC: (GNU) 4.1.1 (SDK420, $Rev: 3547 $)
  2317. GCC: (GNU) 4.1.1 (SDK420, $Rev: 3547 $)
  2318. GCC: (GNU) 4.1.1 (SDK420, $Rev: 3547 $)
  2319. GCC: (GNU) 4.1.1 (SDK420, $Rev: 3547 $)
  2320. GCC: (GNU) 4.1.1 (SDK420, $Rev: 3547 $)
  2321. GCC: (GNU) 4.1.1 (SDK420, $Rev: 3547 $)
  2322. GCC: (GNU) 4.1.1 (SDK420, $Rev: 3547 $)
  2323. GCC: (GNU) 4.1.1 (SDK420, $Rev: 3547 $)
  2324. GCC: (GNU) 4.1.1 (SDK420, $Rev: 3547 $)
  2325. GCC: (GNU) 4.1.1 (SDK420, $Rev: 3547 $)
  2326. GCC: (GNU) 4.1.1 (SDK420, $Rev: 3547 $)
  2327. GCC: (GNU) 4.1.1 (SDK420, $Rev: 3547 $)
  2328. GCC: (GNU) 4.1.1 (SDK420, $Rev: 3547 $)
  2329. GCC: (GNU) 4.1.1 (SDK420, $Rev: 3547 $)
  2330. GCC: (GNU) 4.1.1 (SDK420, $Rev: 3547 $)
  2331. GCC: (GNU) 4.1.1 (SDK420, $Rev: 3547 $)
  2332. GCC: (GNU) 4.1.1 (SDK420, $Rev: 3547 $)
  2333. GCC: (GNU) 4.1.1 (SDK420, $Rev: 3547 $)
  2334. GCC: (GNU) 4.1.1 (SDK420, $Rev: 3547 $)
  2335. GCC: (GNU) 4.1.1 (SDK420, $Rev: 3547 $)
  2336. GCC: (GNU) 4.1.1 (SDK420, $Rev: 3547 $)
  2337. GCC: (GNU) 4.1.1 (SDK420, $Rev: 3547 $)
  2338. GCC: (GNU) 4.1.1 (SDK420, $Rev: 3547 $)
  2339. GCC: (GNU) 4.1.1 (SDK420, $Rev: 3547 $)
  2340. GCC: (GNU) 4.1.1 (SDK420, $Rev: 3547 $)
  2341. GCC: (GNU) 4.1.1 (SDK420, $Rev: 3547 $)
  2342. GCC: (GNU) 4.1.1 (SDK420, $Rev: 3547 $)
  2343. GCC: (GNU) 4.1.1 (SDK420, $Rev: 3547 $)
  2344. GCC: (GNU) 4.1.1 (SDK420, $Rev: 3547 $)
  2345. GCC: (GNU) 4.1.1 (SDK420, $Rev: 3547 $)
  2346. GCC: (GNU) 4.1.1 (SDK420, $Rev: 3547 $)
  2347. GCC: (GNU) 4.1.1 (SDK420, $Rev: 3547 $)
  2348. GCC: (GNU) 4.1.1 (SDK420, $Rev: 3547 $)
  2349. GCC: (GNU) 4.1.1 (SDK420, $Rev: 3547 $)
  2350. GCC: (GNU) 4.1.1 (SDK420, $Rev: 3547 $)
  2351. GCC: (GNU) 4.1.1 (SDK420, $Rev: 3547 $)
  2352. GCC: (GNU) 4.1.1 (SDK420, $Rev: 3547 $)
  2353. GCC: (GNU) 4.1.1 (SDK420, $Rev: 3547 $)
  2354. GCC: (GNU) 4.1.1 (SDK420, $Rev: 3547 $)
  2355. GCC: (GNU) 4.1.1 (SDK420, $Rev: 3547 $)
  2356. GCC: (GNU) 4.1.1 (SDK420, $Rev: 3547 $)
  2357. GCC: (GNU) 4.1.1 (SDK420, $Rev: 3547 $)
  2358. GCC: (GNU) 4.1.1 (SDK420, $Rev: 3547 $)
  2359. GCC: (GNU) 4.1.1 (SDK420, $Rev: 3547 $)
  2360. GCC: (GNU) 4.1.1 (SDK420, $Rev: 3547 $)
  2361. GCC: (GNU) 4.1.1 (SDK420, $Rev: 3547 $)
  2362. GCC: (GNU) 4.1.1 (SDK420, $Rev: 3547 $)
  2363. GCC: (GNU) 4.1.1 (SDK420, $Rev: 3547 $)
  2364. GCC: (GNU) 4.1.1 (SDK420, $Rev: 3547 $)
  2365. GCC: (GNU) 4.1.1 (SDK420, $Rev: 3547 $)
  2366. GCC: (GNU) 4.1.1 (SDK420, $Rev: 3547 $)
  2367. GCC: (GNU) 4.1.1 (SDK420, $Rev: 3547 $)
  2368. GCC: (GNU) 4.1.1 (SDK420, $Rev: 3547 $)
  2369. GCC: (GNU) 4.1.1 (SDK420, $Rev: 3547 $)
  2370. GCC: (GNU) 4.1.1 (SDK420, $Rev: 3547 $)
  2371. GCC: (GNU) 4.1.1 (SDK420, $Rev: 3547 $)
  2372. GCC: (GNU) 4.1.1 (SDK420, $Rev: 3547 $)
  2373. GCC: (GNU) 4.1.1 (SDK420, $Rev: 3547 $)
  2374. GCC: (GNU) 4.1.1 (SDK420, $Rev: 3547 $)
  2375. GCC: (GNU) 4.1.1 (SDK420, $Rev: 3547 $)
  2376. GCC: (GNU) 4.1.1 (SDK420, $Rev: 3547 $)
  2377. GCC: (GNU) 4.1.1 (SDK420, $Rev: 3547 $)
  2378. GCC: (GNU) 4.1.1 (SDK420, $Rev: 3547 $)
  2379. GCC: (GNU) 4.1.1 (SDK420, $Rev: 3547 $)
  2380. GCC: (GNU) 4.1.1 (SDK420, $Rev: 3547 $)
  2381. GCC: (GNU) 4.1.1 (SDK420, $Rev: 3547 $)
  2382. GCC: (GNU) 4.1.1 (SDK420, $Rev: 3547 $)
  2383. GCC: (GNU) 4.1.1 (SDK420, $Rev: 3547 $)
  2384. GCC: (GNU) 4.1.1 (SDK420, $Rev: 3547 $)
  2385. GCC: (GNU) 4.1.1 (SDK420, $Rev: 3547 $)
  2386. GCC: (GNU) 4.1.1 (SDK420, $Rev: 3547 $)
  2387. GCC: (GNU) 4.1.1 (SDK420, $Rev: 3547 $)
  2388. GCC: (GNU) 4.1.1 (SDK420, $Rev: 3547 $)
  2389. GCC: (GNU) 4.1.1 (SDK420, $Rev: 3547 $)
  2390. GCC: (GNU) 4.1.1 (SDK420, $Rev: 3547 $)
  2391. GCC: (GNU) 4.1.1 (SDK420, $Rev: 3547 $)
  2392. GCC: (GNU) 4.1.1 (SDK420, $Rev: 3547 $)
  2393. GCC: (GNU) 4.1.1 (SDK420, $Rev: 3547 $)
  2394. GCC: (GNU) 4.1.1 (SDK420, $Rev: 3547 $)
  2395. GCC: (GNU) 4.1.1 (SDK420, $Rev: 3547 $)
  2396. GCC: (GNU) 4.1.1 (SDK420, $Rev: 3547 $)
  2397. GCC: (GNU) 4.1.1 (SDK420, $Rev: 3547 $)
  2398. GCC: (GNU) 4.1.1 (SDK420, $Rev: 3547 $)
  2399. GCC: (GNU) 4.1.1 (SDK420, $Rev: 3547 $)
  2400. GCC: (GNU) 4.1.1 (SDK420, $Rev: 3547 $)
  2401. GCC: (GNU) 4.1.1 (SDK420, $Rev: 3547 $)
  2402. .shstrtab
  2403. .text
  2404. .rodata
  2405. .ctors
  2406. .dtors
  2407. .data.rel.ro
  2408. .data
  2409. .opd
  2410. .got
  2411. .bss
  2412. .comment
  2413. # configuration file for pme_init
  2414. # notation:
  2415. #       boot    name_of_executable      sync/nosync
  2416. # sample
  2417. boot    ss_init.fself           sync
  2418. boot    sysmgr_ss.fself         nosync
  2419. boot    pme_shell               nosync
  2420.  
  2421. ss sdk-4.4.6
  2422. Thu Jun 20 00:50:07 JST 2013
  2423. 5083
  2424. 49871
  2425. invalid ch->m_magic: 0x%lx
  2426. invalid ch->m_version: 0x%lx
  2427. invalid ch->m_category: 0x%lx
  2428. invalid sh->m_version: 0x%llx
  2429. In install_lv1_acl: arg is NULL
  2430. SCE_CELLOS_SS_INIT_LV1_ACL
  2431. secure_profile_loader_if::get_contents_size: returns SS_STATUS_NO_ENTRY
  2432. install_lv1_acl succeeded
  2433. configuration error (0x%llx)
  2434. In install_lv1_acl: secure_profile_loader_if::get_contents_size failed: ret = %d
  2435. install_lv1_acl failed
  2436. resource shortage
  2437. malloc failed
  2438. internal error (0x%llx)
  2439. secure_profile_loader_if::get_contents failed: ret = %d
  2440. install_access_control_table failed: ret = %d
  2441. couldn't exec %s
  2442. process execution failure
  2443. open %s failed:
  2444. ret = %d, errno = %d
  2445. reading executable failure
  2446. (0x%llx, 0x%llx)
  2447. read failed:
  2448. reading executable failure (0x%llx)
  2449. read %d / %d bytes
  2450. close failed:
  2451. path name too long: %s%s
  2452. booting %s...
  2453. status check failure (0x%llx)
  2454. In boot_test_appliication: arg is NULL
  2455. /rmt/
  2456. skip it
  2457. process execution failure
  2458. In set_ss_laid: arg is NULL
  2459. ss lpar id = 0x%llx
  2460. LPAR initialization failure (0x%llx)
  2461. In set_timeout: arg is NULL
  2462. SPU_TIMEOUT = 0x%llx
  2463. settle timeout failure (0x%llx)
  2464. result = 0x%llx
  2465. In get_prn_64: override 0x00
  2466. In get_prn_64: PRN = 0x%llx
  2467. In do_fix_bank: arg is NULL
  2468. storage consistency check failure
  2469. fix_bank::instance failed
  2470. storage consistency check failure
  2471. fix_bank::fix_bank_indicator failed
  2472. fix_bank failed
  2473. fix_bank succeeded
  2474. In load_spm_policy: arg is NULL
  2475. security_policy_manager_if::
  2476. load_additional_policy:
  2477. returns SS_STATUS_NO_MATCH
  2478. load_spm_policy succeeded
  2479. load_additional_policy failed:
  2480. load_spm_policy failed
  2481. In install_revoke_list: arg is NULL
  2482. loader initialization failure
  2483. revoke_list_manager::instance failed
  2484. loader initialization failure (0x%llx)
  2485. revoke_list_manager::
  2486. install_revoke_list_to_lv0 failed:
  2487. install_revoke_list failed
  2488. install_revoke_list succeeded
  2489. timeout, system initialization failure
  2490. process synchronization failure
  2491. ss_init: get_child_status:
  2492. ss_init_repository::get_node_value failed:
  2493. get_child_status failed
  2494. ready
  2495. couldn't exec %s, skip it
  2496. exiting... (pid: %d)
  2497. fork failed: ret = %d, errno = %d
  2498. ss_init: configuration error (1)
  2499. ss build date:  %s
  2500. ss revision:    %s
  2501. sys revision:   %s
  2502. ss_init: configuration error (2)
  2503. ss_init: configuration error (3)
  2504. ss_init: fatal error, exiting...
  2505. ss_init: wait for child exits...
  2506. ss_init: exiting...
  2507. ss_server3.fself
  2508. ss_sc_init_pu.fself
  2509. ss_server2.fself
  2510. ss_server1.fself
  2511. factory_data_mngr_server.fself
  2512. updater_frontend.fself
  2513. test_app.fself
  2514. /dev/sc3
  2515. /rmt/ss_sysctl.txt
  2516. common
  2517. debug
  2518. level
  2519. update
  2520. updatefe
  2521. ss_init
  2522. sc_proxy
  2523. policy
  2524. ac_cntl
  2525. ploader
  2526. gloader
  2527. commlib
  2528. sc_mngr
  2529. sc_iso
  2530. ii_mgr
  2531. vtrm
  2532. sec_rtc
  2533. sb_mngr
  2534. sb_iso
  2535. app_info
  2536. aim_iso
  2537. fdm_iso
  2538. stricv
  2539. usbauth
  2540. dispatch
  2541. sc_test
  2542. token
  2543. printf
  2544. enabled
  2545. 0123456789abcdefghijklmnopqrstuvwxyz
  2546. 0123456789abcdef
  2547. 0123456789ABCDEF
  2548. (null)
  2549. max system bytes = %10lu
  2550. system bytes     = %10lu
  2551. in use bytes     = %10lu
  2552.  !!! if_proto::send_receive error : cannot find port ID for function_id=0x%x
  2553.  # if_proto::send_receive : port_id=%llu
  2554.  !!! if_proto::send_receive error : cannot connect port=%u
  2555.  # port_id_table::function_id2port_id : func ID=0x%llx, portid=0x%llx
  2556. read_nbytes : read errno=%d
  2557. read_nbytes : unexpected EOF.
  2558.  # pme_client::receive : PID=%u
  2559. write_nbytes : write errno=%d
  2560. write : unexpected EOF.
  2561.  # pme_client::disconnect : PID=%u
  2562. !!! pme_client::disconnect : close failed (errno=%d)
  2563.  # pme_client::connect : PID=%u, portid=%u
  2564. !!! pme_client:connect : socket failed (errno=%d)
  2565. !!! pme_client::connect : connect failed (port_id=%u, errno=%d)
  2566.  # pme_client::send : PID=%u
  2567. !!! page_bytestring::free_page : unmap_pages failed, page_addr=%p
  2568. !!! page_bytestring::alloc_page : map_pages failed, page_num=%u
  2569. packet_id: 0x%llx
  2570. function_id: 0x%llx
  2571. retval: 0x%x
  2572. subject_id: (0x%llx,0x%llx)
  2573.     # ss_packet::send_receive (CLIENT) : func_id=0x%llx, packet_id=0x%llx, subject_id=(0x%llx,0x%llx)
  2574. package revoke bank : 0x%x
  2575. program revoke bank : 0x%x
  2576. os bank : 0x%x
  2577. fix_bank::initialize_bank_repository()
  2578. initialize_bank_repository()::Flash format version != 2. skipped.
  2579. fix_bank::fix_bank_indicator_entity()
  2580. fix_bank_indicator()::Flash format version != 1. skipped.
  2581. get_composite_region_entry_by_name(%s) not found
  2582. get_composite_region_entry_by_name(%s) failure
  2583. [before]
  2584. m_active_bank = 0x%llx
  2585. m_current_bank = 0x%llx
  2586. m_bank_size = 0x%llx
  2587. [after]
  2588. m_active_bank = 0x%llx
  2589. m_current_bank = 0x%llx
  2590. m_bank_size = 0x%llx
  2591. SIGSPUTIMEOUT from revoke_list_loader is received
  2592. SIGSPUERR from revoke_list_loader is received
  2593. SIGSPUDMA from revoke_list_loader is received
  2594. SIGSPUSTOP from revoke_list_loader is received
  2595. prog.srvk
  2596. module_loader:load_module() failure = 0x%x
  2597. trvk_prg
  2598. trvk_prg0
  2599. trvk_prg1
  2600. m_active_bank = 0x%llx
  2601. m_current_bank = 0x%llx
  2602. m_live_size = 0x%llx
  2603. /std/RL_FOR_PROGRAM.img
  2604. map_file failure
  2605. signal failed
  2606. config manager initialize failure
  2607. construct_logical_spu failure
  2608. load_revoke_list_from_os_region failure
  2609. size = %d
  2610. m_magic = 0x%x
  2611. m_version = 0x%x
  2612. m_category = 0x%x
  2613. m_file_offset = 0x%x
  2614. m_file_size = 0x%x
  2615. install_revoke_list failure
  2616. install_revoke_list()'s status = 0x%x, stop_code = %d
  2617. install_revoke_list() success
  2618. install_revoke_list() failure
  2619. ros0
  2620. ros1
  2621. composite_region::read(0x%llx, %lld, 0x%llx)
  2622. composite_region::allocate_buffer(%lld)
  2623. composite_region::release_buffer(0x%llx)
  2624. composite_region::cache_all_composite_region_entry()
  2625.         offset = %d
  2626.         header is not cached
  2627.         entry is not cached
  2628. composite_region::get_composite_region_entry_by_index(%d, 0x%llx)
  2629. composite_region::writev()
  2630. blksize = 0x%llx, mask = 0x%llx
  2631. iovec[%d].offset = 0x%llx
  2632. iovec[%d].size = 0x%llx
  2633. iovec[%d].buf = 0x%llx
  2634. [%d] align_offset = 0x%llx
  2635. writev(): flush previous data (0x%llx)
  2636. writev(): read initial data (0x%llx)
  2637. writev(): flush last data (0x%llx)
  2638. OS_BANK:0x%llx, 0x%llx
  2639. OS_BANK repository error:0x%llx
  2640. PRG_RVK_BANK:0x%llx, 0x%llx
  2641. PRG_RVK_BANK repository error:0x%llx
  2642. PKG_RVK_BANK:0x%llx, 0x%llx
  2643. PKG_RVK_BANK repository error:0x%llx
  2644. bank_manager::get_repository_value(m_type = %d)
  2645. settle value mismatched. 0x%llx : 0x%llx
  2646. bank_manager::setup(%d)
  2647. bank repository found
  2648. bank repository not found
  2649. DEFAULT.SPP
  2650. In ss_init_repository::get_node_value:
  2651.         name:   {
  2652. 0x%llx,
  2653. 0x%llx}
  2654. timeout occured
  2655. get_repository_node_value succeeded
  2656.         value:  {
  2657. In ss_init_repository::get_node_value:
  2658. remove_repository_node failed
  2659. In ss_init_repository::create_node:
  2660. creating...
  2661. create_repository_node succeeded
  2662. In ss_init_repository::create_node:
  2663. create_repository_node failed
  2664. syscon write data:
  2665. command write failed. (%d, %d)
  2666. read failed header. (%d, %d)
  2667. syscon read data:
  2668. read failed body. (%d, %d)
  2669. %04x: %08x
  2670. %08x
  2671. %08x
  2672. map_pages failed: this = %p, area_pages = %d
  2673. /dev/rflash
  2674. /dev/eflash
  2675. /_init_storage/
  2676. /dev/flash_num
  2677. GCC: (GNU) 4.1.1 (SDK420, $Rev: 3547 $)
  2678. GCC: (GNU) 4.1.1 (SDK420, $Rev: 3547 $)
  2679. GCC: (GNU) 4.1.1 (SDK420, $Rev: 3547 $)
  2680. GCC: (GNU) 4.1.1 (SDK420, $Rev: 3547 $)
  2681. GCC: (GNU) 4.1.1 (SDK420, $Rev: 3547 $)
  2682. GCC: (GNU) 4.1.1 (SDK420, $Rev: 3547 $)
  2683. GCC: (GNU) 4.1.1 (SDK420, $Rev: 3547 $)
  2684. GCC: (GNU) 4.1.1 (SDK420, $Rev: 3547 $)
  2685. GCC: (GNU) 4.1.1 (SDK420, $Rev: 3547 $)
  2686. GCC: (GNU) 4.1.1 (SDK420, $Rev: 3547 $)
  2687. GCC: (GNU) 4.1.1 (SDK420, $Rev: 3547 $)
  2688. GCC: (GNU) 4.1.1 (SDK420, $Rev: 3547 $)
  2689. GCC: (GNU) 4.1.1 (SDK420, $Rev: 3547 $)
  2690. GCC: (GNU) 4.1.1 (SDK420, $Rev: 3547 $)
  2691. GCC: (GNU) 4.1.1 (SDK420, $Rev: 3547 $)
  2692. GCC: (GNU) 4.1.1 (SDK420, $Rev: 3547 $)
  2693. GCC: (GNU) 4.1.1 (SDK420, $Rev: 3547 $)
  2694. GCC: (GNU) 4.1.1 (SDK420, $Rev: 3547 $)
  2695. GCC: (GNU) 4.1.1 (SDK420, $Rev: 3547 $)
  2696. GCC: (GNU) 4.1.1 (SDK420, $Rev: 3547 $)
  2697. GCC: (GNU) 4.1.1 (SDK420, $Rev: 3547 $)
  2698. GCC: (GNU) 4.1.1 (SDK420, $Rev: 3547 $)
  2699. GCC: (GNU) 4.1.1 (SDK420, $Rev: 3547 $)
  2700. GCC: (GNU) 4.1.1 (SDK420, $Rev: 3547 $)
  2701. GCC: (GNU) 4.1.1 (SDK420, $Rev: 3547 $)
  2702. GCC: (GNU) 4.1.1 (SDK420, $Rev: 3547 $)
  2703. GCC: (GNU) 4.1.1 (SDK420, $Rev: 3547 $)
  2704. GCC: (GNU) 4.1.1 (SDK420, $Rev: 3547 $)
  2705. GCC: (GNU) 4.1.1 (SDK420, $Rev: 3547 $)
  2706. GCC: (GNU) 4.1.1 (SDK420, $Rev: 3547 $)
  2707. GCC: (GNU) 4.1.1 (SDK420, $Rev: 3547 $)
  2708. GCC: (GNU) 4.1.1 (SDK420, $Rev: 3547 $)
  2709. GCC: (GNU) 4.1.1 (SDK420, $Rev: 3547 $)
  2710. GCC: (GNU) 4.1.1 (SDK420, $Rev: 3547 $)
  2711. GCC: (GNU) 4.1.1 (SDK420, $Rev: 3547 $)
  2712. GCC: (GNU) 4.1.1 (SDK420, $Rev: 3547 $)
  2713. GCC: (GNU) 4.1.1 (SDK420, $Rev: 3547 $)
  2714. GCC: (GNU) 4.1.1 (SDK420, $Rev: 3547 $)
  2715. GCC: (GNU) 4.1.1 (SDK420, $Rev: 3547 $)
  2716. GCC: (GNU) 3.4.1 (CELL 2.2.1, May 23 2005)
  2717. GCC: (GNU) 4.1.1 (SDK420, $Rev: 3547 $)
  2718. GCC: (GNU) 4.1.1 (SDK420, $Rev: 3547 $)
  2719. GCC: (GNU) 4.1.1 (SDK420, $Rev: 3547 $)
  2720. GCC: (GNU) 4.1.1 (SDK420, $Rev: 3547 $)
  2721. GCC: (GNU) 4.1.1 (SDK420, $Rev: 3547 $)
  2722. GCC: (GNU) 4.1.1 (SDK420, $Rev: 3547 $)
  2723. GCC: (GNU) 4.1.1 (SDK420, $Rev: 3547 $)
  2724. GCC: (GNU) 4.1.1 (SDK420, $Rev: 3547 $)
  2725. GCC: (GNU) 4.1.1 (SDK420, $Rev: 3547 $)
  2726. GCC: (GNU) 4.1.1 (SDK420, $Rev: 3547 $)
  2727. GCC: (GNU) 4.1.1 (SDK420, $Rev: 3547 $)
  2728. GCC: (GNU) 4.1.1 (SDK420, $Rev: 3547 $)
  2729. GCC: (GNU) 4.1.1 (SDK420, $Rev: 3547 $)
  2730. GCC: (GNU) 4.1.1 (SDK420, $Rev: 3547 $)
  2731. GCC: (GNU) 4.1.1 (SDK420, $Rev: 3547 $)
  2732. GCC: (GNU) 4.1.1 (SDK420, $Rev: 3547 $)
  2733. GCC: (GNU) 4.1.1 (SDK420, $Rev: 3547 $)
  2734. GCC: (GNU) 4.1.1 (SDK420, $Rev: 3547 $)
  2735. GCC: (GNU) 4.1.1 (SDK420, $Rev: 3547 $)
  2736. GCC: (GNU) 4.1.1 (SDK420, $Rev: 3547 $)
  2737. GCC: (GNU) 4.1.1 (SDK420, $Rev: 3547 $)
  2738. GCC: (GNU) 4.1.1 (SDK420, $Rev: 3547 $)
  2739. GCC: (GNU) 4.1.1 (SDK420, $Rev: 3547 $)
  2740. GCC: (GNU) 4.1.1 (SDK420, $Rev: 3547 $)
  2741. GCC: (GNU) 4.1.1 (SDK420, $Rev: 3547 $)
  2742. GCC: (GNU) 4.1.1 (SDK420, $Rev: 3547 $)
  2743. GCC: (GNU) 4.1.1 (SDK420, $Rev: 3547 $)
  2744. GCC: (GNU) 4.1.1 (SDK420, $Rev: 3547 $)
  2745. GCC: (GNU) 4.1.1 (SDK420, $Rev: 3547 $)
  2746. GCC: (GNU) 4.1.1 (SDK420, $Rev: 3547 $)
  2747. GCC: (GNU) 4.1.1 (SDK420, $Rev: 3547 $)
  2748. GCC: (GNU) 4.1.1 (SDK420, $Rev: 3547 $)
  2749. GCC: (GNU) 4.1.1 (SDK420, $Rev: 3547 $)
  2750. GCC: (GNU) 4.1.1 (SDK420, $Rev: 3547 $)
  2751. GCC: (GNU) 4.1.1 (SDK420, $Rev: 3547 $)
  2752. GCC: (GNU) 4.1.1 (SDK420, $Rev: 3547 $)
  2753. GCC: (GNU) 4.1.1 (SDK420, $Rev: 3547 $)
  2754. GCC: (GNU) 4.1.1 (SDK420, $Rev: 3547 $)
  2755. GCC: (GNU) 4.1.1 (SDK420, $Rev: 3547 $)
  2756. GCC: (GNU) 4.1.1 (SDK420, $Rev: 3547 $)
  2757. GCC: (GNU) 4.1.1 (SDK420, $Rev: 3547 $)
  2758. GCC: (GNU) 4.1.1 (SDK420, $Rev: 3547 $)
  2759. GCC: (GNU) 4.1.1 (SDK420, $Rev: 3547 $)
  2760. GCC: (GNU) 4.1.1 (SDK420, $Rev: 3547 $)
  2761. .shstrtab
  2762. .text
  2763. .rodata
  2764. .ctors
  2765. .dtors
  2766. .data.rel.ro
  2767. .data
  2768. .opd
  2769. .got
  2770. .bss
  2771. .comment
  2772.  
  2773. System update: SUCCESS
  2774. System update: FAILURE
  2775. updater_frontend: ebootrom not specified
  2776. boot normaly
  2777. [GET HARDWARE INFORMATION]
  2778. get hardware information failure
  2779. [GET IMAGE FILE]
  2780. System update: Invalid file name
  2781. Update image file name = %s
  2782. increase pme memory budget failure = 0xll%x
  2783. shutdown
  2784. CORE_OS_PACKAGE.pkg
  2785. RL_FOR_PROGRAM.img
  2786. RL_FOR_PACKAGE.img
  2787. NAND_UPDATE.pkg
  2788. BDIT_FIRMWARE_PACKAGE.pkg
  2789. BDPT_FIRMWARE_PACKAGE_301R.pkg
  2790. BDPT_FIRMWARE_PACKAGE_302R.pkg
  2791. BDPT_FIRMWARE_PACKAGE_303R.pkg
  2792. BDPT_FIRMWARE_PACKAGE_304R.pkg
  2793. sdk_version
  2794. version.txt
  2795. updater_frontend_if::check_ebootrom()
  2796. CORE_OS_REGION (%s)not found in ebootrom
  2797. REVOKE_LIST_FOR_PACKAGE (%s) not found in ebootrom
  2798. trvk_pkg
  2799. REVOKE_LIST_FOR_PROGRAM (%s) not found in ebootrom
  2800. trvk_prg
  2801. NAND_UPDATE_REGION (%s) not found in ebootrom
  2802. nand_update
  2803. BDIT_300R_FIRMWARE_REGION (%s)not found in ebootrom
  2804. bdit_firmware
  2805. BDPT_301R_FIRMWARE_REGION (%s)not found in ebootrom
  2806. bdpt_301r_firmware
  2807. BDPT_302R_FIRMWARE_REGION (%s)not found in ebootrom
  2808. bdpt_302r_firmware
  2809. BDPT_303R_FIRMWARE_REGION (%s)not found in ebootrom
  2810. bdpt_303r_firmware
  2811. BDPT_304R_FIRMWARE_REGION (%s)not found in ebootrom
  2812. bdpt_304r_firmware
  2813. polling_result()
  2814.         request_id = 0x%llx, node_type = 0x%d
  2815. get_status() failure
  2816. [VERIFY IMAGE FILE]
  2817. [WRITE IMAGE FILE]
  2818. |%3d%%]
  2819. |%3d%%]
  2820. polling_result() ret = %d
  2821. updater_frontend_if::print_sdk_version()
  2822. %s's entry
  2823.         m_offset = 0x%llx
  2824.         m_size = 0x%llx
  2825. %s : %s
  2826. updater_frontend_if::invoke_update_package(%d)
  2827. target entry
  2828.         m_offset = 0x%llx
  2829.         m_size = 0x%llx
  2830. %s.%02d
  2831. invoke_update_package: check %s
  2832. target file(%s) entry
  2833.         m_offset = 0x%llx
  2834.         m_size = 0x%llx
  2835. updater_frontend_if::update_region(%d)
  2836. updater_frontend_if::get_os_version()
  2837.         os_version =
  2838.         build_version =
  2839. updater_frontend_if::update_ebootrom(%s)
  2840. initialize os version area in SC NVS failure(%d)
  2841. initialize os version area in SC NVS success
  2842. update status flag get failure
  2843. update status flag: 0x%x
  2844. product mode flag get failure
  2845. product mode flag: 0x%x
  2846. /rmt/%s
  2847. System update: Invalid image file
  2848.         file not found
  2849.         permission denied
  2850.         filename too long
  2851. [INSPECT IMAGE FILE]
  2852. System update: file read error
  2853. System update: Invalid image file format
  2854. System update: Image file read error
  2855. System update: Invalid version file format. ignored.
  2856. [UPDATE SYSTEM phase 1]
  2857. System update: older revoke list skipped
  2858. System update: update system data failure(%d)
  2859. [UPDATE SYSTEM phase 1 done]
  2860. [UPDATE SYSTEM phase 2]
  2861. System update: Invalid version
  2862. System update: update system software failure(%d)
  2863. [UPDATE SYSTEM phase 2 done]
  2864. [UPDATE SYSTEM phase 3]
  2865. [UPDATE SYSTEM phase 3 done]
  2866. [UPDATE SYSTEM phase 4]
  2867. [UPDATE SYSTEM phase 4 done]
  2868. [UPDATE SYSTEM phase 5]
  2869. **** Now updating critical part. ****
  2870. **** Don't turn off the power while processing, or system will be crashed ****
  2871. System update: BDIT drive not found. skipped
  2872. System update: BDPT 301R drive not found. skipped
  2873. System update: BDPT 302R drive not found. skipped
  2874. System update: BDPT 303R drive not found. skipped
  2875. System update: BDPT 304R drive not found. skipped
  2876. **** Now updating critical part done. ****
  2877. [UPDATE SYSTEM phase 5 done]
  2878. System update: update system information failure(%d)
  2879. settle os version area in SC NVS failure(%d)
  2880. settle os version area in SC NVS success
  2881. settle to normal mode
  2882. top_toc
  2883. asecure_loader
  2884. eEID
  2885. cISD
  2886. cCSD
  2887. cvtrm
  2888. lsp_update
  2889. ros0
  2890. ros1
  2891. trvk_prg0
  2892. trvk_prg1
  2893. trvk_pkg0
  2894. trvk_pkg1
  2895. END_OF_REGION
  2896. release:
  2897. build:
  2898. 0123456789abcdef
  2899. 0123456789ABCDEF
  2900. (null)
  2901. max system bytes = %10lu
  2902. system bytes     = %10lu
  2903. in use bytes     = %10lu
  2904. composite_region::read(0x%llx, %lld, 0x%llx)
  2905. composite_region::allocate_buffer(%lld)
  2906. composite_region::release_buffer(0x%llx)
  2907. composite_region::cache_all_composite_region_entry()
  2908.         offset = %d
  2909.         header is not cached
  2910.         entry is not cached
  2911. composite_region::get_composite_region_entry_by_index(%d, 0x%llx)
  2912. composite_region::writev()
  2913. blksize = 0x%llx, mask = 0x%llx
  2914. iovec[%d].offset = 0x%llx
  2915. iovec[%d].size = 0x%llx
  2916. iovec[%d].buf = 0x%llx
  2917. [%d] align_offset = 0x%llx
  2918. writev(): flush previous data (0x%llx)
  2919. writev(): read initial data (0x%llx)
  2920. writev(): flush last data (0x%llx)
  2921.  !!! if_proto::send_receive error : cannot find port ID for function_id=0x%x
  2922.  # if_proto::send_receive : port_id=%llu
  2923.  !!! if_proto::send_receive error : cannot connect port=%u
  2924.  # port_id_table::function_id2port_id : func ID=0x%llx, portid=0x%llx
  2925. read_nbytes : read errno=%d
  2926. read_nbytes : unexpected EOF.
  2927.  # pme_client::receive : PID=%u
  2928. write_nbytes : write errno=%d
  2929. write : unexpected EOF.
  2930.  # pme_client::disconnect : PID=%u
  2931. !!! pme_client::disconnect : close failed (errno=%d)
  2932.  # pme_client::connect : PID=%u, portid=%u
  2933. !!! pme_client:connect : socket failed (errno=%d)
  2934. !!! pme_client::connect : connect failed (port_id=%u, errno=%d)
  2935.  # pme_client::send : PID=%u
  2936. !!! page_bytestring::free_page : unmap_pages failed, page_addr=%p
  2937. !!! page_bytestring::alloc_page : map_pages failed, page_num=%u
  2938. In ss_init_repository::get_node_value:
  2939.         name:   {
  2940. 0x%llx,
  2941. 0x%llx}
  2942. timeout occured
  2943. get_repository_node_value succeeded
  2944.         value:  {
  2945. In ss_init_repository::get_node_value:
  2946. remove_repository_node failed
  2947. In ss_init_repository::create_node:
  2948. creating...
  2949. create_repository_node succeeded
  2950. In ss_init_repository::create_node:
  2951. create_repository_node failed
  2952. packet_id: 0x%llx
  2953. function_id: 0x%llx
  2954. retval: 0x%x
  2955. subject_id: (0x%llx,0x%llx)
  2956.     # ss_packet::send_receive (CLIENT) : func_id=0x%llx, packet_id=0x%llx, subject_id=(0x%llx,0x%llx)
  2957. GCC: (GNU) 4.1.1 (SDK420, $Rev: 3547 $)
  2958. GCC: (GNU) 4.1.1 (SDK420, $Rev: 3547 $)
  2959. GCC: (GNU) 4.1.1 (SDK420, $Rev: 3547 $)
  2960. GCC: (GNU) 4.1.1 (SDK420, $Rev: 3547 $)
  2961. GCC: (GNU) 4.1.1 (SDK420, $Rev: 3547 $)
  2962. GCC: (GNU) 4.1.1 (SDK420, $Rev: 3547 $)
  2963. GCC: (GNU) 4.1.1 (SDK420, $Rev: 3547 $)
  2964. GCC: (GNU) 4.1.1 (SDK420, $Rev: 3547 $)
  2965. GCC: (GNU) 4.1.1 (SDK420, $Rev: 3547 $)
  2966. GCC: (GNU) 4.1.1 (SDK420, $Rev: 3547 $)
  2967. GCC: (GNU) 4.1.1 (SDK420, $Rev: 3547 $)
  2968. GCC: (GNU) 4.1.1 (SDK420, $Rev: 3547 $)
  2969. GCC: (GNU) 4.1.1 (SDK420, $Rev: 3547 $)
  2970. GCC: (GNU) 4.1.1 (SDK420, $Rev: 3547 $)
  2971. GCC: (GNU) 4.1.1 (SDK420, $Rev: 3547 $)
  2972. GCC: (GNU) 4.1.1 (SDK420, $Rev: 3547 $)
  2973. GCC: (GNU) 4.1.1 (SDK420, $Rev: 3547 $)
  2974. GCC: (GNU) 4.1.1 (SDK420, $Rev: 3547 $)
  2975. GCC: (GNU) 4.1.1 (SDK420, $Rev: 3547 $)
  2976. GCC: (GNU) 4.1.1 (SDK420, $Rev: 3547 $)
  2977. GCC: (GNU) 4.1.1 (SDK420, $Rev: 3547 $)
  2978. GCC: (GNU) 4.1.1 (SDK420, $Rev: 3547 $)
  2979. GCC: (GNU) 4.1.1 (SDK420, $Rev: 3547 $)
  2980. GCC: (GNU) 4.1.1 (SDK420, $Rev: 3547 $)
  2981. GCC: (GNU) 4.1.1 (SDK420, $Rev: 3547 $)
  2982. GCC: (GNU) 4.1.1 (SDK420, $Rev: 3547 $)
  2983. GCC: (GNU) 4.1.1 (SDK420, $Rev: 3547 $)
  2984. GCC: (GNU) 4.1.1 (SDK420, $Rev: 3547 $)
  2985. GCC: (GNU) 4.1.1 (SDK420, $Rev: 3547 $)
  2986. GCC: (GNU) 4.1.1 (SDK420, $Rev: 3547 $)
  2987. GCC: (GNU) 4.1.1 (SDK420, $Rev: 3547 $)
  2988. GCC: (GNU) 4.1.1 (SDK420, $Rev: 3547 $)
  2989. GCC: (GNU) 4.1.1 (SDK420, $Rev: 3547 $)
  2990. GCC: (GNU) 4.1.1 (SDK420, $Rev: 3547 $)
  2991. GCC: (GNU) 4.1.1 (SDK420, $Rev: 3547 $)
  2992. GCC: (GNU) 4.1.1 (SDK420, $Rev: 3547 $)
  2993. GCC: (GNU) 4.1.1 (SDK420, $Rev: 3547 $)
  2994. GCC: (GNU) 4.1.1 (SDK420, $Rev: 3547 $)
  2995. GCC: (GNU) 4.1.1 (SDK420, $Rev: 3547 $)
  2996. GCC: (GNU) 4.1.1 (SDK420, $Rev: 3547 $)
  2997. GCC: (GNU) 4.1.1 (SDK420, $Rev: 3547 $)
  2998. GCC: (GNU) 4.1.1 (SDK420, $Rev: 3547 $)
  2999. GCC: (GNU) 4.1.1 (SDK420, $Rev: 3547 $)
  3000. GCC: (GNU) 4.1.1 (SDK420, $Rev: 3547 $)
  3001. GCC: (GNU) 4.1.1 (SDK420, $Rev: 3547 $)
  3002. GCC: (GNU) 4.1.1 (SDK420, $Rev: 3547 $)
  3003. GCC: (GNU) 4.1.1 (SDK420, $Rev: 3547 $)
  3004. GCC: (GNU) 4.1.1 (SDK420, $Rev: 3547 $)
  3005. GCC: (GNU) 4.1.1 (SDK420, $Rev: 3547 $)
  3006. GCC: (GNU) 4.1.1 (SDK420, $Rev: 3547 $)
  3007. GCC: (GNU) 4.1.1 (SDK420, $Rev: 3547 $)
  3008. GCC: (GNU) 4.1.1 (SDK420, $Rev: 3547 $)
  3009. GCC: (GNU) 4.1.1 (SDK420, $Rev: 3547 $)
  3010. GCC: (GNU) 4.1.1 (SDK420, $Rev: 3547 $)
  3011. GCC: (GNU) 4.1.1 (SDK420, $Rev: 3547 $)
  3012. GCC: (GNU) 4.1.1 (SDK420, $Rev: 3547 $)
  3013. GCC: (GNU) 4.1.1 (SDK420, $Rev: 3547 $)
  3014. GCC: (GNU) 4.1.1 (SDK420, $Rev: 3547 $)
  3015. GCC: (GNU) 4.1.1 (SDK420, $Rev: 3547 $)
  3016. GCC: (GNU) 4.1.1 (SDK420, $Rev: 3547 $)
  3017. GCC: (GNU) 4.1.1 (SDK420, $Rev: 3547 $)
  3018. GCC: (GNU) 4.1.1 (SDK420, $Rev: 3547 $)
  3019. GCC: (GNU) 4.1.1 (SDK420, $Rev: 3547 $)
  3020. GCC: (GNU) 4.1.1 (SDK420, $Rev: 3547 $)
  3021. GCC: (GNU) 4.1.1 (SDK420, $Rev: 3547 $)
  3022. GCC: (GNU) 4.1.1 (SDK420, $Rev: 3547 $)
  3023. .shstrtab
  3024. .text
  3025. .rodata
  3026. .ctors
  3027. .dtors
  3028. .data.rel.ro
  3029. .data
  3030. .opd
  3031. .got
  3032. .bss
  3033. .comment
  3034.  
  3035. ss_init_if::notify_failure failed:
  3036. ss_init_if::notify_ready failed:
  3037. usb_dongle_authenticator::verify_response
  3038. given response body=
  3039. %02x
  3040. challenge body=
  3041. dongle_id=%u
  3042. dongle ID revoked.
  3043. get_dongle_key error
  3044. calc. response body=
  3045. usb_dongle_authenticator::generate_challenge
  3046. security_hardware_framework_if::get_random_number sanity check error : r=%d
  3047. usb_dongle_authenticator::initialize
  3048. encrypted master key recover succeeded.
  3049. encrypted master key recover failed -> use dummy key.
  3050. user_token:m_magic = 0x%x
  3051. user_token:m_format_version = 0x%x
  3052. user_token:m_size = 0x%llx
  3053. user_token:m_capability = 0x%llx
  3054. user_token:m_expire_date = 0x%llx
  3055. user_token:m_idps:
  3056. 0x%02x
  3057. user_token:m_attribute:
  3058. user_token:attr:m_type = 0x%x
  3059. user_token:attr:m_size = 0x%x
  3060. user_token:attr:m_data:
  3061. user_token:m_digest:
  3062. user_token_manager::decrypt_user_token()
  3063. invalid user token format.
  3064. decrypt_and_verify() failure = 0x%x
  3065. get_time() failure = 0x%x, status = 0x%llx.
  3066. rtc value = 0x%llx, status = 0x%llx.
  3067. user token has been expired.
  3068. user_token_manager::encrypt_user_token()
  3069. sign_and_decyrpt() failure = 0x%x
  3070. spu_utoken_processor.self
  3071.         user_token_processor::SIGSPUMB caught(not disired)
  3072.         user_token_processor::SIGSPUTIMEOUT caught(not disired)
  3073.         user_token_processor::SIGSPUERR caught(not disired)
  3074.         user_token_processor::SIGSPUDMA caught(not disired)
  3075.         user_token_processor::SIGSPUMB msg = 0x%x
  3076.         user_token_processor::SIGSPUSTOP_SL received
  3077.         user_token_processor::status = 0x%x
  3078.         user_token_processor::stop_code = 0x%x
  3079.         user_token_processor::SIGSPUSTOP received
  3080. user_token_processor::read_idps() read EID0 size failure(%d)
  3081. user_token_processor::read_idps() EID0 size = %d
  3082. user_token_processor::read_idps() malloc failure
  3083. user_token_processor::read_idps() read EID0 failure(%d)
  3084. user_token_processor::read_idps() EID0
  3085.         user_token_processor::read_idps() failure(%d)
  3086.         user_token_processor::create_command() failure(%d)
  3087.         user_token_processor::load_module() failure
  3088.         user_token_processor::request_loading_spu_module() failure
  3089.         user_token_processor::request_loading_spu_module() success
  3090. update_manager::read failure
  3091. update_manager::write verification failure
  3092. update_manager::swap_bank(%d, 0x%llx)
  3093. update_manager::swap_bank() swap_boot_bank() = %d
  3094. update_manager::get_package_info(%d)
  3095.         version = 0x%llx
  3096. update_manager::get_secure_product_mode()
  3097. update_manager::get_sc_status(%d) failure
  3098. update_manager::get_secure_product_mode() value = 0x%x
  3099. update_manager::set_secure_product_mode(0x%x)
  3100. current sc_version = 0x%x, sc_status = 0x%x
  3101. new sc_version = 0x%x, sc_status = 0x%x
  3102. update_manager::set_sc_status(%d) failure
  3103. decompress_and_write_image()
  3104. data_offset = 0x%llx, data_size = %u, comp_size = %u
  3105. image_offset = 0x%llx, chunk_offset = 0x%llx
  3106. 1.2.3
  3107. deflateInit failure
  3108. offset = 0x%llx, wsize = 0x%llx
  3109. write_image()
  3110. data_offset = 0x%llx, data_size = %u
  3111. image_offset = 0x%llx, chunk_offset = 0x%llx
  3112. real_offset = 0x%llx, align = 0x%llx
  3113. update_manager::decompress_and_write_target()
  3114. data_offset = 0x%llx, data_size = %u, comp_size = %u
  3115. update_manager::write_target()
  3116. data_offset = 0x%llx, data_size = %u
  3117.         filename = %s, file_loc = 0x%llx, file_size = 0x%llx
  3118.         verify_util::SHA-1 hash
  3119. 0x%x
  3120. update_manager::check_core_os_hash()
  3121. in product mode, check is skipped.
  3122. update_manager::check_core_os_hash() get_version_and_hash() failure
  3123. update_manager::check_core_os_hash() SC not initialized. skipped integrity check.
  3124. update_manager::check_core_os_hash() config_manager failure
  3125. update_manager::check_core_os_hash() calc lv0 hash failure(%d)
  3126. update_manager::check_core_os_hash() calc lv1 hash failure(%d)
  3127. lv0 and lv1 have passed integrity check
  3128. lv0 has been altered. integrity check failure.
  3129. lv1 has been altered. integrity check failure.
  3130. update_manager::read_revoke_list(%d)
  3131. module_loader:load_module() failure = 0x%x
  3132.         m_magic = 0x%x
  3133.         m_category = 0x%x
  3134.         m_file_offset = 0x%llx
  3135.         m_file_size = 0x%llx
  3136. update_manager::initialize_revoke_list_info(%d)
  3137. read_revoke_list() failure = %d
  3138. calc hash of revoke list failure = %d
  3139. verify_revoke_list() failure = %d
  3140. set_version_and_hash_to_trm() failure = %d
  3141. update_manager::applicable_version_info(%d)
  3142. get_version_and_hash_to_trm() failure = %d
  3143. get_applicable_version()::installed_version = 0x%llx
  3144. get_applicable_version()::builtin_rvk_version = 0x%llx
  3145. revoke list: operator = %u,  operand = 0x%llx
  3146. invalid version operator in revoke list = 0x%x
  3147. get_applicable_version()::manu_sdk_version = 0x%llx
  3148. applicable_version_info: lower = 0x%llx(%lld), upper = 0x%llx(%lld)
  3149. update_manager::check_revoke_list_hash()
  3150. update_manager::check_revoke_list_hash() get_version_and_hash() failure
  3151. update_manager::check_revoke_list_hash() read revoke list failure
  3152. update_manager::check_revoke_list_hash() calc hash failure
  3153. revoke list %d have passed integrity check
  3154. revoke list %d has been altered. integrity check failure.
  3155. update_manager::check_revoke_list_all()
  3156. revoke list for update package has been altered. integrity check failure.
  3157. revoke list for program has been altered. integrity check failure.
  3158.         update_manager::check_size(%d, 0x%llx)
  3159.         update_manager::check_size() invalid parameters
  3160.         update_manager::check_size() invalid file image
  3161.         update_manager::check_size() file_size = 0x%llx
  3162.         update_manager::check_size() conf_mgr initialize failure
  3163.         bank_size = 0x%llx, body_size = 0x%llx, orig_file_size = 0x%llx
  3164.         update_manager::check_size() invalid bank size
  3165. sc updater initialize failure.
  3166. appropriate SC firmware revision(pkg:0x%llx, rom:0x%llx)
  3167. SC firmware binary patch
  3168. SC firmware revision is mismatched(pkg:0x%llx, rom:0x%llx)
  3169. SC firmware binary patch failure = %d
  3170. bd.detect_drive_type() : ret = %d, type = 0x%llx
  3171. BD Drive not found.
  3172. not fatal error in DEH/ARCADE.
  3173. BD Drive is emergency mode in manufacturing phase (error).
  3174. BD Drive is not emergency mode in manufacturing phase.
  3175. BD Drive type is not 302R/304R/306R/308R/310R/312R/314R/316R on CEX. fatal error
  3176. BD Drive type is 302R/304R/306R/308R/310R/312R/314R/316R on CEX. valid combination
  3177.         get BD firmware version failure = %d.
  3178. set initial BD firmware version = 0x%llx
  3179. set_version_and_hash_to_trm() failure.
  3180. bd.disable_reqsense() : ret = %d
  3181. BD Drive control failure.
  3182. bd.enable_reqsense() : ret = %d
  3183. drive_type = 0x%llx, h_id = 0x%lld
  3184. apprppriate drive type and firmware found
  3185. firmware update failure
  3186. firmware update done
  3187. fatal error in DEX/CEX.
  3188.         raw image overlap check failure
  3189.         raw image overlap check success
  3190.         raw image with crypto
  3191.         raw image without crypto
  3192.         last chunk (%d) came, store version
  3193. update_manager::set SBI flags = 0x%llx
  3194. update_manager::bank size = %lld, data size = %lld
  3195. update_manager::data is too large
  3196.         {status = 0x%x, flags = 0x%x}
  3197. update_manager::calc_os_hash failure(%d, %s)
  3198. update_manager::calc_os_hash no entry(%s)
  3199. bank swap immediately.
  3200. bank swap delayed.
  3201.         {status = 0x%x, flags = 0x%x, size = 0x%llx}
  3202. update_manager::force update mode(flag is rewrited to REVOKE_CHECK_OFF | ALLOW_DOWN_VERSION.) = 0x%llx
  3203. update_manager::update_package_tophalf() check_size() failure = %d
  3204. update_manager::common_tophalf:: reques_id = 0x%llx
  3205.         update_manager::is_valid_access(0x%x, 0x%02x, 0x%llx)
  3206.         update_manager::is_valid_access() for TOOL/DEX/ARCADE or manufacturing phase
  3207.         update_manager::is_valid_access() for CEX
  3208. update_manager::inspect_package_tophalf(0x%x, 0x%llx, 0x%x, 0x%llx, 0x%llx, 0x%x, 0x%x)
  3209.         No permission for inspect_package(%d)
  3210. update_manager::extract_package_tophalf(0x%x, 0x%llx, 0x%x, 0x%llx, 0x%llx, 0x%x, 0x%x)
  3211.         No permission for extract_package(%d)
  3212. update_manager::update_package_tophalf(0x%x, 0x%llx, 0x%x, 0x%llx, 0x%llx, 0x%x, 0x%x)
  3213. update_manager::update_package_tophalf() not supported package type = %d
  3214.         No permission for update_package(%d)
  3215. update_manager::set_token()
  3216. update_manager::set_token delete qa flag signature failure
  3217. update_manager::set_token delete qa flag failure
  3218. update_manager::set_token delete qa flag exist flag failure
  3219. update_manager::set_token verify success
  3220. update_manager::set_token verify failure
  3221. update_manager::set_token store qa flag signature failure
  3222. update_manager::set_token store qa flag failure
  3223. update_manager::set_token store qa flag exist flag failure
  3224. update_manager::read_eprom(0x%x)
  3225. update_manager::get_token_seed()
  3226. update_manager::get_token_seed get qa flag exist flag failure
  3227. update_manager::get_token_seed use previous qa flag
  3228. update_manager::get_token_seed get qa flag failure
  3229. update_manager::get_token_seed read previous qa flag signature
  3230. update_manager::get_token_seed get qa flag signature failure
  3231. update_manager::get_token_seed success
  3232. qa_flag:
  3233. update_manager::get_token_seed failure
  3234. update_manager::inspect_package_bottomhalf()
  3235. update_manager::extract_package_bottomhalf()
  3236. update_manager::get_extract_package()
  3237. update_manager::illegal parameter
  3238. update_manager::no entry
  3239. update_manager::invalid context
  3240. update_manager::copy extracted data
  3241. update_manager::update_package_bottomhalf()
  3242. update_manager::update_package_bottomhalf start processing
  3243. update_manager::update_package_bottomhalf nothing to do
  3244. update_manager::get_fix_instruction()
  3245. [%d] cp = %d
  3246. invalid check point = %d
  3247. not fatal error in DEH.
  3248. fatal error in DEH.
  3249. update_manager::erase_core_os_standby_bank()
  3250. update_manager::erase_core_os_standby_bank() normal mode. skipped
  3251. erasing core os in standby bank...
  3252. update_manager::erase_core_os_standby_bank() config_manager failure
  3253. update_manager::erase_core_os_standby_bank() get_info() failure
  3254. update_manager::erase_core_os_standby_bank() region_manager failure
  3255. update_manager::erase_core_os_standby_bank() get sbi flag failure
  3256. update_manager::erase_core_os_standby_bank() erase flag is not settle. skipped
  3257. erasing core os in standby bank skipped.
  3258. update_manager::erase_core_os_standby_bank() sense standby bank failure
  3259. update_manager::erase_core_os_standby_bank() get real flash offset failure
  3260. update_manager::erase_core_os_standby_bank() get standby os region failure
  3261. update_manager::erase_core_os_standby_bank() get standby os region header failure
  3262. update_manager::erase_core_os_standby_bank() seach file failure. fall back fail safe
  3263. update_manager::erase_core_os_standby_bank() bank_size = 0x%llx, erase size = 0x%llx
  3264. update_manager::erase_core_os_standby_bank() memory shortage
  3265. real_offset = 0x%llx, align = 0x%llx, flags = 0x%llx
  3266. update_manager::erase_core_os_standby_bank() done.
  3267. update_manager::erase_core_os_standby_bank() clear sbi_flag failure
  3268. erasing core os in standby bank done...
  3269. update_manager::erase_hash_standby_bank(%d)
  3270. in product mode, erasing is skipped.
  3271. update_manager::erase_hash_standby_bank() get_version_and_hash() failure
  3272. update_manager::erase_hash_standby_bank() already erased
  3273. update_manager::erase_hash_standby_bank() set_version_and_hash() failure
  3274. update_manager::set_analog_sunset_flag_repository() modify repository failure
  3275. update_manager::set_analog_sunset_flag_repository() create repository failure
  3276. update_manager::init_ss_params_repositories() read eprom failure(%d)
  3277. fall back to using safe parameter
  3278. set_analog_sunset_flag_repository() failure
  3279. update_manager::init_ss_params_repositories() analog_sunset_flag off
  3280. update_manager::init_ss_params_repositories() analog_sunset_flag on
  3281. update_manager::set_debug_support_repository() modify repository failure
  3282. update_manager::set_debug_support_repository() create repository failure
  3283. set_debug_support_repository() failure
  3284. update_manager::init_ss_params_repositories() debug_support = 0x%016llx, 0x%016llx
  3285. update_manager::set_hdd_copy_mode_repository() modify repository failure
  3286. update_manager::set_hdd_copy_mode_repository() create repository failure
  3287. set_hdd_copy_mode_repository() failure
  3288. update_manager::init_ss_params_repositories() hdd copy mode off
  3289. update_manager::init_ss_params_repositories() hdd copy mode 1
  3290. update_manager::init_ss_params_repositories() hdd copy mode 2
  3291. update_manager::init_ss_params_repositories() hdd copy mode unknown
  3292. update_manager::set_recover_mode_repository() modify repository failure
  3293. update_manager::set_recover_mode_repository() create repository failure
  3294. set_recover_mode_repository() failure
  3295. update_manager::init_ss_params_repositories() recover mode off
  3296. update_manager::init_ss_params_repositories() recover mode on
  3297. update_manager::set_fself_control_repository() modify repository failure
  3298. update_manager::set_fself_control_repository() create repository failure
  3299. update_manager::init_device_type() read eprom failure(%d)
  3300. fall back to using safe parameter
  3301. update_manager::init_ss_params_repositories() fself_control = 0x%x
  3302. set_fself_control_repository() failure
  3303. update_manager::init_ss_params_repositories()
  3304. set_fself_control_flag() failure = %d
  3305. set_recover_mode_flag() failure = %d
  3306. set_hdd_copy_mode_flag() failure = %d
  3307. set_debug_support_flag() failure = %d
  3308. set_analog_sunset_flag() failure = %d
  3309. update_manager::set_update_status_repository() modify repository failure
  3310. update_manager::set_update_status_repository() create repository failure
  3311. update_manager::write_eprom(0x%x, 0x%x)
  3312. update_manager::write_eprom() check delayed bank swap
  3313. update_manager::write_eprom() do delayed bank swap for core os
  3314. update_manager::write_eprom() do delayed bank swap for program revoke list
  3315. update_manager::write_eprom() do delayed bank swap for package revoke list
  3316. update_manager::write_eprom() clear recover mode flag.
  3317. update_manager::write_eprom() already cleared recover mode flag.
  3318. update_manager::write_eprom() check permission
  3319. update_manager::write_eprom() allowed
  3320. update_manager::write_eprom() denied
  3321. update_manager::set_qa_flag_repository() modify repository failure
  3322. update_manager::set_qa_flag_repository() create repository failure
  3323. update_manager::init_qa_flag()
  3324. update_manager::set_qa_flag_repository() read eprom failure
  3325. update_manager::set_qa_flag_repository() failure
  3326. update_manager::init_qa_flag() no token
  3327. update_manager::init_qa_flag() installed qa_flag was broken.
  3328. update_manager::init_qa_flag() update qa flag value = 0x%x
  3329. QA_FLAG_FORCE_UPDATE settle
  3330. QA_FLAG_ALLOW_NON_QA settle
  3331. update_manager::init_qa_flag() exam api qa flag value = 0x%x
  3332. QA_FLAG_EXAM_API_ENABLE settle
  3333. QA_FLAG_QA_MODE_ENABLE settle
  3334. update_manager::do_fix_regions()
  3335. update_manager::do_fix_regions() read eprom failure
  3336. update_manager::do_fix_regions() update_status = 0x%x
  3337. update_manager::do_fix_trm_regions()
  3338. update_manager::sc version = 0x%x, status = 0x%x
  3339. update_manager::init_for_updater(%d) failure
  3340. update_manager::init_device_type()
  3341. update_manager::init_device_type() dev_type = (0x%llx, 0x%llx)
  3342. update_manager::init_device_type() failure = %d
  3343. pkg.srvk
  3344. prog.srvk
  3345. lv1.self
  3346. spu_token_processor.self
  3347. lv2_kernel.self
  3348.                 certified_file::invalid m_magic
  3349.                 certified_file::invalid m_version
  3350.                 certified_file::invalid m_category
  3351.                 certified_file::invalid m_segment_type
  3352.                 certified_file::invalid m_segment_id
  3353. 106|.X
  3354.         verify_util::SIGSPUTIMEOUT from revoke_list_loader is received
  3355.         verify_util::SIGSPUERR from revoke_list_loader is received
  3356.         verify_util::SIGSPUDMA from revoke_list_loader is received
  3357.         verify_util::SIGSPUSTOP_SL from revoke_list_loader is received
  3358.         verify_util::install_revoke_list_to_lv0()
  3359. construct_logical_spu failure
  3360. install_revoke_list failure
  3361. install_revoke_list()'s status = 0x%x, stop_code = %d
  3362. install_revoke_list() success
  3363. install_revoke_list() failure
  3364.         verify_util::prepare_args()
  3365.         type = 0x%llx
  3366.         flags = 0x%llx
  3367.         src_addr = 0x%llx
  3368.         src_size = 0x%llx
  3369.         dst_addr = 0x%llx
  3370.         dst_size = 0x%llx
  3371.         rvk_src_addr = 0x%llx
  3372.         rvk_src_size = 0x%llx
  3373.         rvk_dst_addr = 0x%llx
  3374.         rvk_dst_size = 0x%llx
  3375.         verify_util::detect_id(): active_bank => %d
  3376.         verify_util::detect_id(): standby_bank => %d
  3377.         verify_util::detect_id(): id => %d
  3378.         verify_util::get version and hash from SC
  3379.         verify_util::version : 0x%llx
  3380.         verify_util::hash1 :
  3381.         verify_util::hash2 :
  3382.         verify_util::get_version_and_hash() failure : %d
  3383.         verify_util::calc_hash_of_target(src_addr = 0x%llx, size = %d)
  3384.         verify_util::invalid parameters
  3385.         verify_util::Calc SHA-1 hash failure
  3386.         write_data(%d, 0x%llx, 0x%llx, 0x%llx)
  3387.         write_data(): offset/size error
  3388.         read_data(%d, 0x%llx, 0x%llx, 0x%llx)
  3389.         read_data(): offset/size error
  3390. storage_bank_indicator
  3391.         m_active_bank = 0x%llx
  3392.         m_current_bank = 0x%llx
  3393.         m_bank_size = 0x%llx
  3394.         m_flags = 0x%llx
  3395. Mismatch active_bank and current_bank
  3396. Need reboot, and fix bank indicator
  3397. real_bank_size = 0x%llx
  3398. region_manager::setup_internal()
  3399.         bank0 = 0x%llx, bank1 = 0x%llx
  3400. swap_boot_bank(0x%llx)
  3401.         (before)m_bank_info.m_active_bank = 0x%llx
  3402.         (before)m_bank_info.m_current_bank = 0x%llx
  3403.         (before)m_bank_info.m_flags = 0x%llx
  3404.         (after)m_bank_info.m_active_bank = 0x%llx
  3405.         (after)m_bank_info.m_current_bank = 0x%llx
  3406.         (after)m_bank_info.m_flags = 0x%llx
  3407. region_manager::set_update_status(%d)
  3408.         m_update_status = 0x%x
  3409.         m_update_flag = 0x%x
  3410.         m_live_size = 0x%llx
  3411. region_manager::get_update_status(%d)
  3412.         m_update_status = 0x%x
  3413.         m_update_flag = 0x%x
  3414.         m_live_size = 0x%llx
  3415. top_toc
  3416. asecure_loader
  3417. eEID
  3418. cISD
  3419. cCSD
  3420. trvk_prg
  3421. trvk_pkg
  3422. cvtrm
  3423. nand_update
  3424. lsp_update
  3425. bdit_firmware
  3426. bdpt_301r_firmware
  3427. bdpt_302r_firmware
  3428. bdpt_303r_firmware
  3429. ros0
  3430. ros1
  3431. trvk_prg0
  3432. trvk_prg1
  3433. trvk_pkg0
  3434. trvk_pkg1
  3435. bdpt_304r_firmware
  3436. END_OF_REGION
  3437. /proc/partitions/%d/mem
  3438.         update_token_processor::SIGSPUMB caught(not disired)
  3439.         update_token_processor::SIGSPUTIMEOUT caught(not disired)
  3440.         update_token_processor::SIGSPUERR caught(not disired)
  3441.         update_token_processor::SIGSPUDMA caught(not disired)
  3442.         update_token_processor::SIGSPUMB msg = 0x%x
  3443.         update_token_processor::SIGSPUSTOP_SL received
  3444.         update_token_processor::status = 0x%x
  3445.         update_token_processor::stop_code = 0x%x
  3446.         update_token_processor::SIGSPUSTOP received
  3447. update_token_processor::read_idps() read EID0 size failure(%d)
  3448. update_token_processor::read_idps() EID0 size = %d
  3449. update_token_processor::read_idps() malloc failure
  3450. update_token_processor::read_idps() read EID0 failure(%d)
  3451. update_token_processor::read_idps() EID0
  3452.         update_token_processor::read_idps() failure(%d)
  3453.         update_token_processor::create_command() failure(%d)
  3454.         update_token_processor::load_module() failure
  3455.         update_token_processor::request_loading_spu_module() failure
  3456.         update_token_processor::request_loading_spu_module() success
  3457. bd_updater::detect_need_eject(): type = %d, revision = %d,
  3458. need_eject = true
  3459. need_eject = false
  3460. bd_updater::disable_reqsense() ret = 0x%d,(result_code = %lld)
  3461. bd_updater::enable_reqsense() ret = 0x%d,(result_code = %lld)
  3462.         secure firmware version = 0x%llx
  3463.         secure command timeout
  3464. bd_updater::eval_exception_rules(0x%llx)
  3465.         installed_version = 0x%llx
  3466.         exception rules matched.
  3467. bd_updater::sense_cmd()
  3468. dump sense data
  3469. bd_updater::check_cmd_result()
  3470. bd_updater::check_cmd_result(): result_code = 0x%llx
  3471.         test_cmd::send_atp_command
  3472.         test_cmd::send_atp_command returned
  3473. bd_updater::detect_drive_generation()
  3474. bd_updater::detect_drive_generation(): mode_sense_cmd() failure = 0x%d
  3475. bd_update::detect_drive_generation:
  3476.         page_code = 0x%x, major = 0x%x, minor = 0x%x, gen = 0x%x
  3477. bd_updater::polling_progress()
  3478.         TEST UNIT READY failure(ss_status = %d)
  3479.         REQUEST SENSE returns 2/04/07 and report no progress(because of invalid command issued. ignore it)
  3480.         Writing... %d %%
  3481. REQUEST SENSE returns 2/3a/0 (invalid firmware length or combination reported)
  3482. REQUEST SENSE returns 5/26/0 (invalid firmware combination or hash error reported)
  3483. REQUEST SENSE returns 4/3e/01 (failure erasing or writing flash of BD drive error reported)
  3484.         TEST UNIT READY success(result_code = 0x%llx)
  3485. bd_updater::writebuf_cmd(0x%x, 0x%x, 0x%x, 0x%x, 0x%x)
  3486.         atpcmd->pkt[%d] = 0x%x
  3487.         atpcmd->blocks = 0x%x
  3488.         atpcmd->block_size = 0x%x
  3489.         atpcmd->arglen = 0x%x
  3490. dump write buffer command
  3491. bd_updater::send_firmware(0x%llx, 0x%llx)
  3492.         send firmware data to drive
  3493.         send WRITE_BUFFER command(buf = 0x%x, offset = 0x%x, size = 0x%x)
  3494.         WRITE BUFFER failure(ss_status = %d)
  3495.         WRITE BUFFER failure(result_code = 0x%llx)
  3496.         sense_key = 0x%x,
  3497. asc = 0x%x,
  3498. snsAscq[0] = 0x%x
  3499. REQUEST SENSE returns 5/24/0 (invalid data length or continuous error reported)
  3500. (generation mismatch detected. not fatal error.)
  3501. bd_updater::readbuf_cap_cmd()
  3502. bd_updater::readbuf_cmd(0x%x, 0x%x, 0x%x, 0x%x, 0x%x)
  3503. bd_updater::eject()
  3504. bd_updater::eject: ret = %d, result_code 0x%llx
  3505. bd_updater::stop()
  3506. bd_updater::stop: ret = %d, result_code 0x%llx
  3507. bd_updater::prepare_drive()
  3508.         wait until drive update ready
  3509.         TEST UNIT READY
  3510.         TEST UNIT READY failure(result_code = 0x%llx)
  3511.         now drive update ready
  3512.         drive update not ready
  3513.         GET EVENT STATUS
  3514.         GET EVENT STATUS failure(ss_status = %d)
  3515. inquiry cmd(ret = %d, result_code = 0x%llx)
  3516. 0x%02x(%c)
  3517. bd_updater::inquiry
  3518. bd_updater::inquiry: ret = %d, result_code 0x%llx
  3519. bd_updater::detect_drive_type()
  3520. bd_updater::detect_drive_type(): inquiry() failure = 0x%d
  3521. bd_updater::detect_drive_type() = 0x%llx
  3522. bd_updater::detect_drive_type(): detect_drive_generation() failure = 0x%llx
  3523. bd_update::detect_drive_type(): generation = 0x%x, revision = %d
  3524. SONY    EmerFlashROM
  3525. SONY    PS-EMBOOT   300R
  3526. SONY    BDRW AQUAM(BDIT)
  3527. SONY    PS-SYSTEM   300R
  3528. SONY    PS-SYSTEM   V300
  3529. SCEI    EMER-FLASH-8
  3530. SONY    PS-EMBOOT   301R
  3531. SONY    PS-SYSTEM   301R
  3532. SONY    PS-EMBOOT   302R
  3533. SONY    PS-SYSTEM   302R
  3534. SONY    PS-EMBOOT   303R
  3535. SONY    PS-SYSTEM   303R
  3536. SONY    PS-EMBOOT   304R
  3537. SONY    PS-SYSTEM   304R
  3538. SONY    PS-EMBOOT   306R
  3539. SONY    PS-SYSTEM   306R
  3540. SONY    PS-EMBOOT   308R
  3541. SONY    PS-SYSTEM   308R
  3542. SONY    PS-EMBOOT   310R
  3543. SONY    PS-SYSTEM   310R
  3544. SONY    PS-EMBOOT   312R
  3545. SONY    PS-SYSTEM   312R
  3546. SONY    PS-EMBOOT   314R
  3547. SONY    PS-SYSTEM   314R
  3548. SONY    PS-EMBOOT   316R
  3549. SONY    PS-SYSTEM   316R
  3550. sc_updater:: major = 0x%x, minor = 0x%x.
  3551. /dev/sc2
  3552. sc_updater:: sc device file open failure.
  3553. sc_updater:: detect sc type failure.
  3554. sc_updater:: detect rom revision failure.
  3555. sc_updater:: sc_type = 0x%llx, rom revision = 0x%llx.
  3556.         get_ps_code failure = %d. return default
  3557.         product_code = 0x%x, product_sub_code = 0x%x
  3558.         detect DEH XB chassis compatible.
  3559.         detect DEH compatible.
  3560.         detect vflash enable on A/B/B' chassis. deal with D-chassis compatible.
  3561.         unknown chassis type
  3562.         chassis type = %d: mask = 0x%llx: h_id = 0x%llx
  3563.         special case: target = 0x%llx, required = 0x%llx
  3564.         normal case: target = 0x%llx, required = 0x%llx
  3565.         exception rule applied fo revoke by direction type
  3566.         revoked by direction type
  3567.         chassis type = %d
  3568. revoked by chassis type
  3569.         get BD firmware version from TRM.
  3570.         get BD firmware version from secure command.
  3571. sc device file open failure.
  3572. get_patch_version_in_eprom() success = 0x%llx.
  3573. get_patch_version_in_eprom() failure = %d.
  3574. decrypt_and_verify_update_package failure(%d)
  3575.                 (flash)version = 0x%llx
  3576.                 (file) version = 0x%llx
  3577.         older version (NG)
  3578.         same version (OK) (TOOL/DEX/ARCADE policy)
  3579.         same version (OK) (CEX policy for Core OS)
  3580.         same version (NG) (CEX policy)
  3581.         newer version (OK)
  3582.         h_attribute = 0x%llx
  3583.         package direction check.
  3584.         unknown direction.
  3585.         appropriate direction: h_region = 0x%x.
  3586.         inappropriate direction: h_region = 0x%x.
  3587.         package direction check skipped.
  3588.         manufacturing OS image check.
  3589.         denied manufacturing OS image in normal mode.
  3590.         accepted manufacturing OS image in manufacturing mode.
  3591.         revoked by buildin revoke list.
  3592.         not revoked by buildin revoke list.
  3593.         chassis type miss matched.
  3594.         chassis type matched.
  3595. spu_pkg_rvk_verifier.self
  3596.         certified_file_verifier::SIGSPUMB caught(not disired)
  3597.         certified_file_verifier::plain_src_addr = 0x%llx, plain_size = 0x%llx, enc_size = 0x%llx
  3598.         certified_file_verifier::prepare_args failure
  3599.         certified_file_verifier::load_module() failure : %d
  3600.         certified_file_verifier::request_loading_spu_module() failure
  3601.         cerfified_file_verifier::request_loading_spu_module() success
  3602.         certified_file_verifier::SIGSPUTIMEOUT caught(not disired)
  3603.         certified_file_verifier::SIGSPUERR caught(not disired)
  3604.         certified_file_verifier::SIGSPUDMA caught(not disired)
  3605.         certified_file_verifier::SIGSPUMB msg = 0x%x
  3606.         certified_file_verifier::SIGSPUMB read PUINTMB failure
  3607.         certified_file_verifier::SIGSPUSTOP_SL received
  3608.         certified_file_verifier::status = 0x%x
  3609.         certified_file_verifier::stop_code = 0x%x
  3610.         certified_file_verifier::SIGSPUSTOP received
  3611. ret:%d :%d
  3612. policy:%08X
  3613. policy not match condition
  3614. HW: auth_sv ret:%d
  3615. HW:disc_auth_emu:%d
  3616. HW: disc auth emu API(%d)
  3617. HW:param error:%d
  3618. HW: disc_mode %d
  3619. HW:test_unit_ready ret:%d code:%lx
  3620. HW:test_unit req sense 0x%08x
  3621. HW:read disc structure ret:%d code:%lx
  3622. HW:inquiry ret %d result %d
  3623. HW:inquiry:%s:%s
  3624. HW:FW not supported
  3625. failed
  3626. Success
  3627. HW:sendign security command for check
  3628. retry_auth_drive(%d): ret=%d
  3629. HW: get_vesion
  3630. HW:me_dec_block:index %llu size %llu
  3631. HW:me_auth_header: size %llu
  3632. HW:mc: ret %d
  3633. HW:mc:%p %p %p
  3634. HW: passphrase (%d)
  3635. HW: user_id:
  3636. HW: vesion:%d
  3637. HW: size:%d
  3638. %02x
  3639. HW: secure rtc error (%d):(%d)
  3640. HW: secure rtc value (%llu)
  3641. HW: size :%d mode :%d
  3642. HW: bd voucher (%d)
  3643. profile:%08X
  3644. HW: not ps3 disc
  3645. HW: ps3 disc change new API
  3646. HW: ps3 disc param %d
  3647. HW: ps3 hdd game auth new API
  3648. HW: not ps3 disc, set policy
  3649. auth_disc_hdd fail:(%d) recover..
  3650. HW: save disc id for HDD
  3651. HW: ps3 disc auth new API
  3652. HW: single layer ps3 bd
  3653. HW: multi layer ps3 bd
  3654. HW: ps3 dvd
  3655. HW: save disc id
  3656. HW: ps2 disc auth
  3657. HW: not ps2 disc
  3658. HW:drive_auth:%d
  3659. HW: Check device file:
  3660. HW: drive interface is busy
  3661. .drive interface open() failed
  3662. HW: not ready, clean key
  3663. HW: ret %d
  3664. HW: not ready for auth, clean key
  3665. HW:encdec/ata param:0x%lx
  3666. HW: set_encdec_key for disable_ata ret:%d
  3667. HW: set_encdec_key for enable_ata ret:%d
  3668. SB: atagpest %lx
  3669. HW: send_sb_clear ret:%d result:%p
  3670. cannot get dev_type
  3671. dev_type is CEX
  3672. HW: set_encdec_key for ps2emu, key_version failure (%d)
  3673. HW: set_encdec_key for ps2emu, savedata_key_version failure (%d)
  3674. dev_type is NOT CEX
  3675. HW: set_encdec_key for ps2emu, key_id:%d
  3676. PS-SYSTEM
  3677. PS-SPECIAL
  3678. incorrect header check
  3679. unknown compression method
  3680. invalid window size
  3681. unknown header flags set
  3682. header crc mismatch
  3683. invalid block type
  3684. invalid stored block lengths
  3685. too many length or distance symbols
  3686. invalid code lengths set
  3687. invalid bit length repeat
  3688. invalid literal/lengths set
  3689. invalid distances set
  3690. invalid literal/length code
  3691. invalid distance code
  3692. invalid distance too far back
  3693. incorrect data check
  3694. incorrect length check
  3695.  
  3696. /dev/rbd0
  3697. syscon write data:
  3698. command write failed. (%d, %d)
  3699. read failed. (%d, %d)
  3700. syscon read data:
  3701. %04x: %08x
  3702. %08x
  3703. %08x
  3704. map_pages failed: this = %p, area_pages = %d
  3705. manu_info_spu_module.self
  3706. virtual_trm_manager::read_flash_raw : vector_io::range, r=%d
  3707. virtual_trm_manager::read_flash_raw : vector_io::read, r=%d
  3708. !!! virtual_trm_manager::restart_objs [setup_header] : array_t::setup, r=%d
  3709. virtual_trm_manager::set_flash_tampered
  3710. !!! virtual_trm_manager::set_flash_tampered : tr-start, r=%d
  3711. !!! virtual_trm_manager::set_flash_tampered : flash write, r=%d
  3712. !!! virtual_trm_manager::set_flash_tampered : tr-force_commit, r=%d
  3713. virtual_trm_manager::set_srh_mismatched
  3714. !!! virtual_trm_manager : sc_decrypt sanity check error r=%d
  3715. virtual_trm_manager::decrypt_master: subject_id=(0x%llx,0x%llx)
  3716. virtual_trm_manager::decrypt_with_portability
  3717. virtual_trm_manager::decrypt: subject_id=(0x%llx,0x%llx)
  3718. !!! virtual_trm_manager : sc_encrypt sanity check error r=%d
  3719. virtual_trm_manager::encrypt_with_portability
  3720. virtual_trm_manager::encrypt: subject_id=(0x%llx,0x%llx)
  3721. virtual_trm_manager : GET_PRODUCT_MODE, r=%d
  3722. virtual_trm_manager::backup_flash
  3723. virtual_trm_manager::backup_flash : read_flash_raw, r=%d, pos=0x%llx, size=%llu
  3724. virtual_trm_manager::flash_addr_size
  3725. virtual_trm_manager::flash_addr_size : vector_io::range, r=%d
  3726. virtual_trm_manager::restore_srk_srh
  3727. virtual_trm_manager::backup_srk_srh : sc_manager_if::restore_root_info r=%d
  3728. virtual_trm_manager::backup_srk_srh
  3729. virtual_trm_manager::backup_srk_srh : sc_manager_if::backup_root_info r=%d
  3730. virtual_trm_manager::write_flash_raw : vector_io::range, r=%d
  3731. virtual_trm_manager::write_flash_raw : vector_io::erase_and_program, r=%d
  3732. virtual_trm_manager::write_flash_raw : vector_io::read, r=%d
  3733. virtual_trm_manager::write_flash_raw : written data mismatch detected.
  3734. virtual_trm_manager::restore_flash
  3735. virtual_trm_manager::restore_flash : write_flash_rawr=%d, pos=0x%llx, size=%llu
  3736. !!! virtual_trm_manager : get_table_hash, r=%d
  3737. virtual_trm_manager::vtrm_chk_stat, m_stat=%d
  3738. !!! virtual_trm_manager::check_table_icv read, r=%d
  3739.  virtual_trm_manager: memory shortage in restart.
  3740.  virtual_trm_manager: srh mismatch detected in restart.
  3741.  virtual_trm_manager: flash format error detected in restart.
  3742.  virtual_trm_manager: version mismatch detected.
  3743.  virtual_trm_manager: internal error in restart.
  3744.  virtual_trm_manager: need initialize (illegal state).
  3745.  virtual_trm_manager: need restart (illegal state).
  3746.  virtual_trm_manager: state transittion error.
  3747. virtual_trm_manager::status
  3748.  virtual_trm_manager::%s : sanity check error #%d
  3749. status
  3750. virtual_trm_manager::status : *m_p_htbl check icv all mismatched!
  3751. !!! virtual_trm_manager::update_table_icv : read, r=%d
  3752. !!! virtual_trm_manager::update_table_icv : write, r=%d
  3753. !!! virtual_trm_manager : sc_get_srh sanity check error : r=%d
  3754.  virtual_trm_manager::fix_2pc_status : root hash (FLASH) =
  3755.  virtual_trm_manager::fix_2pc_status : need 2pc commit/abort.
  3756.  virtual_trm_manager::fix_2pc_status : commit
  3757. !!! vtrm::fix_2pc_status : two_pc_proto::abort r=%d
  3758.  virtual_trm_manager::fix_2pc_status : abort
  3759. !!! virtual_trm_manager::fix_2pc_status : two_pc_proto::abort r=%d
  3760.  virtual_trm_manager::_fix_2pc_status : root hash matching OK.
  3761.  virtual_trm_manager::_fix_2pc_status : root hash matching NG.
  3762. !!! virtual_trm_manager : sc_set_srh sanity check error : r=%d
  3763.   virtual_trm_manager::update_srh done.
  3764.   virtual_trm_manager::update_srh : root hash =
  3765.   virtual_trm_manager::update_srh : root hsec =
  3766. !!! virtual_trm_manager::restart_objs [restart_twopc] : two_pc_proto::restart, r=%d
  3767. !!! virtual_trm_manager : sc_is_init_vtrm sanity check error : r=%d
  3768. !!! virtual_trm_manager::restart_objs [retrieve_rhash_rhsec] : fatal error #0, r=%d
  3769.  virtual_trm_manager::restart_objs [retrieve_rhash_rhsec] : root hash (TRM) =
  3770.  virtual_trm_manager::restart_objs [retrieve_rhash_rhsec] : root hsec (TRM) =
  3771. !!! virtual_trm_manager::restart_objs : [get_twopc_range] two_pc_proto::range, r=%d
  3772.  virtual_trm_manager::restart_objs [get_twopc_range]  : vtrm flash area : start=0x%x, len=0x%x
  3773. !!! virtual_trm_manager::restart_objs [check_header] : array_t::read r=%d
  3774.  virtual_trm_manager::restart_objs [check_header] : magic_number=0x%llx, format_version=0x%llx, program_version=0x%llx
  3775. !!! virtual_trm_manager::restart_objs [restart_htbl] : hashtable_t::restart, r=%d
  3776. virtual_trm_manager::restart
  3777.  virtual_trm_manager::restart : m_stat=%d, r=%d
  3778. virtual_trm_manager::force_restart
  3779. virtual_trm_manager::force_restart : restart r=%d
  3780. virtual_trm_manager::initialize
  3781. !!! virtual_trm_manager::initialize : init, r=%d
  3782. !!! virtual_trm_manager::initialize : range, r=%d
  3783.  virtual_trm_manager::initialize : raw flash area : start=0x%x, len=0x%x
  3784.  virtual_trm_manager::initialize : htbl flash area : start=0x%x, len=0x%x
  3785.  (printed address is smaller than real address by a flash_offset).)
  3786.  virtual_trm_manager::initialize : flash erase done. (1/6)
  3787.  virtual_trm_manager::initialize : setup_header done. (2/6)
  3788. !!! virtual_trm_manager : get_random_number sanity check error : r=%d
  3789.  virtual_trm_manager::initialize [init_db] : get_random_numebr, r=%d
  3790. !!! virtual_trm_manager::initialize [init_db] : array_t::setup, r=%d
  3791. !!! virtual_trm_manager : sc_init_for_vtrm sanity check error : r=%d
  3792.  virtual_trm_manager::initialize [init_sc] : update_srh, r=%d
  3793. !!! virtual_trm_manager::inititialize [init_header] : array_t::write, r=%d
  3794.  virtual_trm_manager::initialize : restart, r=%d
  3795.  virtual_trm_manager::initialize : restart done. (6/6)
  3796.  virtual_trm_manager::initialize : init_db done. (3/6)
  3797.  virtual_trm_manager::initialize : sc_manager::init_for_vtrm done.
  3798.  virtual_trm_manager::initialize : init_sc done. (4/6)
  3799.  virtual_trm_manager::initialize : init_header done. (5/6)
  3800. !!! virtual_trm_manager::setup_flash : flash_io::init, r=%d
  3801. !!! virtual_trm_manager::instanciate_objs [print_flash_range] : flash_io::range, r=%d
  3802.  virtual_trm_manager::instanciate_objs [print_flash_range] : raw flash area : start=0x%x, len=0x%x
  3803.  (printed address is smaller than real value by a flash_offset.)
  3804. virtual_trm_manager::instanciate
  3805. virtual_trm_manager::free: subject_id=(0x%llx,0x%llx), nth=%llu
  3806.   internal subject_id=(0x%llx,0x%llx)
  3807. free
  3808. !!! virtual_trm_manager::free : sanity check error #2: r=%d
  3809. !!! virtual_trm_manager::store : update_table_icv, r=%d
  3810. virtual_trm_manager::retrieve: subject_id=(0x%llx,0x%llx), nth=%llu
  3811. retrieve
  3812. virtual_trm_manager::retrieve: block=
  3813. false
  3814. true
  3815. virtual_trm_manager::store: subject_id=(0x%llx,0x%llx), nth=%llu, TRM_update=%s
  3816. virtual_trm_manager::store: block=
  3817. store
  3818. !!! virtual_trm_manager::store : sanity check error #2, r=%d, stat=%d
  3819. !!! virtual_trm_manager::store : sanity check error #3: r=%d
  3820. Retry_flag: %02x
  3821. get_ps_code error: %0d
  3822. PRODUCT_CODE: %04x
  3823. auth_sv: dummy call(0x%08x): 0x%x
  3824. me_auth_2: block_info no_entry
  3825. me_auth_2: ret[0]: 0x%x
  3826. me_auth_2: ret[1]: 0x%x
  3827. me_auth_2: ret[2]: 0x%x
  3828. me_auth_2: clear state
  3829. me_auth_1: ret[0]: 0x%x
  3830. me_auth_1: ret[1]: 0x%x
  3831. me_auth_1: ret[2]: 0x%x
  3832. me_auth_1: last bit entry to dec/auth: %d
  3833. mc_auth_2: ret[0]: 0x%x
  3834. mc_auth_2: ret[1]: 0x%x
  3835. mc_auth_2: ret[2]: 0x%x
  3836. mc_auth_1: ret[0]: 0x%x
  3837. mc_auth_1: ret[1]: 0x%x
  3838. mc_auth_1: ret[2]: 0x%x
  3839. auth_sv: ret[0]: 0x%x
  3840. auth_sv: ret[1]: 0x%x
  3841. auth_sv: ret[2]: 0x%x
  3842. get_random_number: ret[0]: 0x%x
  3843. get_random_number: ret[1]: 0x%x
  3844. get_random_number: ret[2]: 0x%x
  3845. set_encdec_key: ret[0]: 0x%x
  3846. set_encdec_key: ret[1]: 0x%x
  3847. set_encdec_key: ret[2]: 0x%x
  3848. sbm_set_key: get_result: ret[0]: 0x%x
  3849. sbm_get_rnd: get_result: ret[0]: 0x%x
  3850. sbm_get_rnd: get_result: ret[1]: 0x%x
  3851. sb_iso_spu_module.self
  3852. sbm_get_rnd: run: ret[0]: 0x%x
  3853. sbm_set_key: run: ret[0]: 0x%x
  3854.  sv_auth: run: get_result[0]: 0x%x
  3855. sv_auth: get_result: ret[1]: 0x%x
  3856. sv_iso_spu_module.self
  3857. sv_iso_for_ps2emu.self
  3858. sv_auth: run: ret[0]: 0x%x
  3859. mc_auth_2: get_result: ret[0]: 0x%x
  3860. mc_auth_1: get_result: ret[0]: 0x%x
  3861. mc_iso_spu_module.self
  3862. mc_auth_2: run: ret[0]: 0x%x
  3863. mc_auth_1: run: ret[0]: 0x%x
  3864. me_auth_2: get_result: ret[0]: 0x%x
  3865. me_auth_1: get_result: ret[0]: 0x%x
  3866. me_iso_spu_module.self
  3867. me_iso_for_ps2emu.self
  3868. me_auth_2: run: ret[0]: 0x%x
  3869. me_auth_1: run: ret[0]: 0x%x
  3870. start signal handler sputimeout
  3871. recv signal (%d) is SIGSPUTIMEOUT. (r4=%d)
  3872. recv signal (%d) is not SIGSPUTIMEOUT. (r4=%d)
  3873. start signal handler spustopsl
  3874. recv signal (%d) is SIGSPUSTOP_SL. (r4=%d)
  3875. recv signal (%d) is not SIGSPUSTOP_SL. (r4=%d)
  3876. start signal handler spumbsl
  3877. recv signal (%d) is SIGSPUMB_SL. (r4=%d)
  3878. recv signal (%d) is not SIGSPUMB_SL. (r4=%d)
  3879. start signal handler spuerr
  3880. recv signal (%d) is SIGSPUERR. (r4=%d)
  3881. recv signal (%d) is not SIGSPUERR. (r4=%d)
  3882. start signal handler spudma
  3883. recv signal (%d) is SIGSPUDMA. (r4=%d)
  3884. recv signal (%d) is not SIGSPUDMA. (r4=%d)
  3885. start signal handler spustop
  3886. recv signal (%d) is SIGSPUSTOP. (r4=%d)
  3887. recv signal (%d) is not SIGSPUSTOP. (r4=%d)
  3888. start signal handler spumb
  3889. recv signal (%d) is SIGSPUMB. (r4=%d)
  3890. recv signal (%d) is not SIGSPUMB. (r4=%d)
  3891. send DMA data to SPU
  3892. send_abort: ret[0]: 0x%x
  3893. send_success: ret[0]: 0x%x
  3894.         received seqno:         0x%x
  3895.         received mbmsg:         0x%x
  3896.         received cmd:           0x%x
  3897.         received cmd_data_size: 0x%x
  3898. check_header: seqno invalid
  3899. check_header: mbmsg invalid
  3900. check_header: command invalid
  3901. check_header: exit data len invalid
  3902. sendrecv_process_atp: ret[0]: 0x%x
  3903.         send_data_size: 0x%x
  3904.         recv_data_size: 0x%x
  3905. sendrecv_process_atp: ret[1]: 0x%x
  3906.         padding_size: 0x%x
  3907. sendrecv_process: ret[1]: 0x%x
  3908. sendrecv_process: ret[0]: 0x%x
  3909. check_stop_code: ret: 0x%x
  3910.         stopcode: 0x%x
  3911. check_received_data: ret[0]: 0x%x
  3912. received DMA data from SPU
  3913. check_received_data: seqno invalid
  3914. check_received_data: mbmsg invalid
  3915. check_received_data: command invalid
  3916. sb_core: ret[0]: 0x%x
  3917.         module_bufp: 0x%x
  3918.         module_size: 0x%x
  3919. sbm_core_process: ret[2]: 0x%x
  3920. sbm_core_process: eid_size 0x%x is illegal
  3921. sbm_core_process: eid is old format
  3922.         eid_bufp: %p
  3923.         eid_size: 0x%x
  3924. sbm_core_process: ret[3]: 0x%x
  3925.         eid_size:      0x%x
  3926.         eid_read_size: 0x%x
  3927. EID data(encrypt)
  3928.         2nd_eid_size:      0x%x
  3929.         2nd_eid_read_size: 0x%x
  3930. sb_core: ret[1]: 0x%x
  3931. sb_core: eid_size: %d
  3932. sb_core: ret[2]: 0x%x
  3933. API start DMA data
  3934. sb_core: ret[3]: 0x%x
  3935. API end DMA data
  3936. sendrecv_sb: ret[0]: 0x%x
  3937.         sent_data_size: 0x%x
  3938.         recd_data_size: 0x%x
  3939. sendrecv_atp: ret[0]: 0x%x
  3940. /dev/encdec0
  3941. composite_region::read(0x%llx, %lld, 0x%llx)
  3942. composite_region::allocate_buffer(%lld)
  3943. composite_region::release_buffer(0x%llx)
  3944. composite_region::cache_all_composite_region_entry()
  3945.         offset = %d
  3946.         header is not cached
  3947.         entry is not cached
  3948. composite_region::get_composite_region_entry_by_index(%d, 0x%llx)
  3949. composite_region::writev()
  3950. blksize = 0x%llx, mask = 0x%llx
  3951. iovec[%d].offset = 0x%llx
  3952. iovec[%d].size = 0x%llx
  3953. iovec[%d].buf = 0x%llx
  3954. [%d] align_offset = 0x%llx
  3955. writev(): flush previous data (0x%llx)
  3956. writev(): read initial data (0x%llx)
  3957. writev(): flush last data (0x%llx)
  3958. OS_BANK:0x%llx, 0x%llx
  3959. OS_BANK repository error:0x%llx
  3960. PRG_RVK_BANK:0x%llx, 0x%llx
  3961. PRG_RVK_BANK repository error:0x%llx
  3962. PKG_RVK_BANK:0x%llx, 0x%llx
  3963. PKG_RVK_BANK repository error:0x%llx
  3964. bank_manager::get_repository_value(m_type = %d)
  3965. settle value mismatched. 0x%llx : 0x%llx
  3966. bank_manager::setup(%d)
  3967. bank repository found
  3968. bank repository not found
  3969. capability_checker::check_product_mode_capability: OK
  3970. capability_checker::check_product_mode_capability: NG
  3971.  !!! if_proto::send_receive error : cannot find port ID for function_id=0x%x
  3972.  # if_proto::send_receive : port_id=%llu
  3973.  !!! if_proto::send_receive error : cannot connect port=%u
  3974.  # ss_responder::terminate
  3975.  # ss_responder::initialize
  3976. !!! ss_responder::initialize : failed
  3977. !!! port_id=%llu, return=%u
  3978.  # ss_responder::initialize : port_id=%d, socket=%d
  3979. # ss_responder::loop_once : sock=%d
  3980.  # port_id_table::function_id2port_id : func ID=0x%llx, portid=0x%llx
  3981. read_nbytes : read errno=%d
  3982. read_nbytes : unexpected EOF.
  3983.  # pme_client::receive : PID=%u
  3984. write_nbytes : write errno=%d
  3985. write : unexpected EOF.
  3986.  # pme_client::disconnect : PID=%u
  3987. !!! pme_client::disconnect : close failed (errno=%d)
  3988.  # pme_client::connect : PID=%u, portid=%u
  3989. !!! pme_client:connect : socket failed (errno=%d)
  3990. !!! pme_client::connect : connect failed (port_id=%u, errno=%d)
  3991.  # pme_client::send : PID=%u
  3992.  # pme_server::disconnect : PID=%u
  3993. !!! pme_server::disconnect : close failed (errno=%d)
  3994.  # pme_server::force_close : PID=%u
  3995.  # pme_server::reply : PID=%u
  3996. !!! pme_server::reply : close failed (errno=%d)
  3997.  # pme_server::accept : PID=%u
  3998. !!! pme_server::accept : accept failed (errno=%d)
  3999. !!! pme_server::accept : read_nbytes failed (return=%d)
  4000.  # pme_server::connect : PID=%u, port_id=%u
  4001. !!! pme_server::connect : socket failed (errno=%d)
  4002. !!! pme_server::connect : bind failed (errno=%d)
  4003. !!! pme_server::connect : listen failed (errno=%d)
  4004. !!! page_bytestring::free_page : unmap_pages failed, page_addr=%p
  4005. !!! page_bytestring::alloc_page : map_pages failed, page_num=%u
  4006. packet_id: 0x%llx
  4007. function_id: 0x%llx
  4008. retval: 0x%x
  4009. subject_id: (0x%llx,0x%llx)
  4010.     # ss_packet::send_receive (CLIENT) : func_id=0x%llx, packet_id=0x%llx, subject_id=(0x%llx,0x%llx)
  4011.     # ss_packet::process_async : packet_id=0x%llx
  4012.  # ss_packet::process_received (SERVER) : sock=%d
  4013. !!! ss_packet::process_received (SERVER) error: packet format error (broken?)
  4014.   # ss_packet::process_received (SERVER) : packet_id=0x%llx, subject_id=(0x%llx,0x%llx)
  4015. !!! ss_packet::process_received (SERVER) error: unknown packet
  4016.     # ss_packet::process_received (SERVER) error: port table inconsistent
  4017.  # ss_packet::accept_reply : accept done. sock=%d
  4018. In ss_init_repository::get_node_value:
  4019.         name:   {
  4020. 0x%llx,
  4021. 0x%llx}
  4022. timeout occured
  4023. get_repository_node_value succeeded
  4024.         value:  {
  4025. In ss_init_repository::get_node_value:
  4026. remove_repository_node failed
  4027. In ss_init_repository::create_node:
  4028. creating...
  4029. create_repository_node succeeded
  4030. In ss_init_repository::create_node:
  4031. create_repository_node failed
  4032. 0123456789abcdef
  4033. 0123456789ABCDEF
  4034. (null)
  4035. max system bytes = %10lu
  4036. system bytes     = %10lu
  4037. in use bytes     = %10lu
  4038. _USB_DONGLE_AUTH_USB_DONGLE_
  4039. QEvKf5-iJ8
  4040. [@2S
  4041. /dev/rflash
  4042. /dev/eflash
  4043. /_init_storage/
  4044. /dev/flash_num
  4045. /dev/eflash
  4046. GCC: (GNU) 4.1.1 (SDK420, $Rev: 3547 $)
  4047. GCC: (GNU) 4.1.1 (SDK420, $Rev: 3547 $)
  4048. GCC: (GNU) 4.1.1 (SDK420, $Rev: 3547 $)
  4049. GCC: (GNU) 4.1.1 (SDK420, $Rev: 3547 $)
  4050. GCC: (GNU) 4.1.1 (SDK420, $Rev: 3547 $)
  4051. GCC: (GNU) 4.1.1 (SDK420, $Rev: 3547 $)
  4052. GCC: (GNU) 4.1.1 (SDK420, $Rev: 3547 $)
  4053. GCC: (GNU) 4.1.1 (SDK420, $Rev: 3547 $)
  4054. GCC: (GNU) 4.1.1 (SDK420, $Rev: 3547 $)
  4055. GCC: (GNU) 4.1.1 (SDK420, $Rev: 3547 $)
  4056. GCC: (GNU) 4.1.1 (SDK420, $Rev: 3547 $)
  4057. GCC: (GNU) 4.1.1 (SDK420, $Rev: 3547 $)
  4058. GCC: (GNU) 4.1.1 (SDK420, $Rev: 3547 $)
  4059. GCC: (GNU) 4.1.1 (SDK420, $Rev: 3547 $)
  4060. GCC: (GNU) 4.1.1 (SDK420, $Rev: 3547 $)
  4061. GCC: (GNU) 4.1.1 (SDK420, $Rev: 3547 $)
  4062. GCC: (GNU) 4.1.1 (SDK420, $Rev: 3547 $)
  4063. GCC: (GNU) 4.1.1 (SDK420, $Rev: 3547 $)
  4064. GCC: (GNU) 4.1.1 (SDK420, $Rev: 3547 $)
  4065. GCC: (GNU) 4.1.1 (SDK420, $Rev: 3547 $)
  4066. GCC: (GNU) 4.1.1 (SDK420, $Rev: 3547 $)
  4067. GCC: (GNU) 4.1.1 (SDK420, $Rev: 3547 $)
  4068. GCC: (GNU) 4.1.1 (SDK420, $Rev: 3547 $)
  4069. GCC: (GNU) 4.1.1 (SDK420, $Rev: 3547 $)
  4070. GCC: (GNU) 4.1.1 (SDK420, $Rev: 3547 $)
  4071. GCC: (GNU) 4.1.1 (SDK420, $Rev: 3547 $)
  4072. GCC: (GNU) 4.1.1 (SDK420, $Rev: 3547 $)
  4073. GCC: (GNU) 4.1.1 (SDK420, $Rev: 3547 $)
  4074. GCC: (GNU) 4.1.1 (SDK420, $Rev: 3547 $)
  4075. GCC: (GNU) 4.1.1 (SDK420, $Rev: 3547 $)
  4076. GCC: (GNU) 4.1.1 (SDK420, $Rev: 3547 $)
  4077. GCC: (GNU) 4.1.1 (SDK420, $Rev: 3547 $)
  4078. GCC: (GNU) 4.1.1 (SDK420, $Rev: 3547 $)
  4079. GCC: (GNU) 4.1.1 (SDK420, $Rev: 3547 $)
  4080. GCC: (GNU) 4.1.1 (SDK420, $Rev: 3547 $)
  4081. GCC: (GNU) 4.1.1 (SDK420, $Rev: 3547 $)
  4082. GCC: (GNU) 4.1.1 (SDK420, $Rev: 3547 $)
  4083. GCC: (GNU) 4.1.1 (SDK420, $Rev: 3547 $)
  4084. GCC: (GNU) 4.1.1 (SDK420, $Rev: 3547 $)
  4085. GCC: (GNU) 4.1.1 (SDK420, $Rev: 3547 $)
  4086. GCC: (GNU) 4.1.1 (SDK420, $Rev: 3547 $)
  4087. GCC: (GNU) 4.1.1 (SDK420, $Rev: 3547 $)
  4088. GCC: (GNU) 4.1.1 (SDK420, $Rev: 3547 $)
  4089. GCC: (GNU) 4.1.1 (SDK420, $Rev: 3547 $)
  4090. GCC: (GNU) 4.1.1 (SDK420, $Rev: 3547 $)
  4091. GCC: (GNU) 4.1.1 (SDK420, $Rev: 3547 $)
  4092. GCC: (GNU) 4.1.1 (SDK420, $Rev: 3547 $)
  4093. GCC: (GNU) 4.1.1 (SDK420, $Rev: 3547 $)
  4094. GCC: (GNU) 4.1.1 (SDK420, $Rev: 3547 $)
  4095. GCC: (GNU) 4.1.1 (SDK420, $Rev: 3547 $)
  4096. GCC: (GNU) 4.1.1 (SDK420, $Rev: 3547 $)
  4097. GCC: (GNU) 4.1.1 (SDK420, $Rev: 3547 $)
  4098. GCC: (GNU) 4.1.1 (SDK420, $Rev: 3547 $)
  4099. GCC: (GNU) 4.1.1 (SDK420, $Rev: 3547 $)
  4100. GCC: (GNU) 4.1.1 (SDK420, $Rev: 3547 $)
  4101. GCC: (GNU) 4.1.1 (SDK420, $Rev: 3547 $)
  4102. GCC: (GNU) 4.1.1 (SDK420, $Rev: 3547 $)
  4103. GCC: (GNU) 4.1.1 (SDK420, $Rev: 3547 $)
  4104. GCC: (GNU) 4.1.1 (SDK420, $Rev: 3547 $)
  4105. GCC: (GNU) 4.1.1 (SDK420, $Rev: 3547 $)
  4106. GCC: (GNU) 4.1.1 (SDK420, $Rev: 3547 $)
  4107. GCC: (GNU) 4.1.1 (SDK420, $Rev: 3547 $)
  4108. GCC: (GNU) 4.1.1 (SDK420, $Rev: 3547 $)
  4109. GCC: (GNU) 4.1.1 (SDK420, $Rev: 3547 $)
  4110. GCC: (GNU) 4.1.1 (SDK420, $Rev: 3547 $)
  4111. GCC: (GNU) 4.1.1 (SDK420, $Rev: 3547 $)
  4112. GCC: (GNU) 4.1.1 (SDK420, $Rev: 3547 $)
  4113. GCC: (GNU) 4.1.1 (SDK420, $Rev: 3547 $)
  4114. GCC: (GNU) 4.1.1 (SDK420, $Rev: 3547 $)
  4115. GCC: (GNU) 4.1.1 (SDK420, $Rev: 3547 $)
  4116. GCC: (GNU) 4.1.1 (SDK420, $Rev: 3547 $)
  4117. GCC: (GNU) 4.1.1 (SDK420, $Rev: 3547 $)
  4118. GCC: (GNU) 4.1.1 (SDK420, $Rev: 3547 $)
  4119. GCC: (GNU) 4.1.1 (SDK420, $Rev: 3547 $)
  4120. GCC: (GNU) 4.1.1 (SDK420, $Rev: 3547 $)
  4121. GCC: (GNU) 4.1.1 (SDK420, $Rev: 3547 $)
  4122. GCC: (GNU) 4.1.1 (SDK420, $Rev: 3547 $)
  4123. GCC: (GNU) 4.1.1 (SDK420, $Rev: 3547 $)
  4124. GCC: (GNU) 4.1.1 (SDK420, $Rev: 3547 $)
  4125. GCC: (GNU) 4.1.1 (SDK420, $Rev: 3547 $)
  4126. GCC: (GNU) 4.1.1 (SDK420, $Rev: 3547 $)
  4127. GCC: (GNU) 4.1.1 (SDK420, $Rev: 3547 $)
  4128. GCC: (GNU) 4.1.1 (SDK420, $Rev: 3547 $)
  4129. GCC: (GNU) 4.1.1 (SDK420, $Rev: 3547 $)
  4130. GCC: (GNU) 4.1.1 (SDK420, $Rev: 3547 $)
  4131. GCC: (GNU) 4.1.1 (SDK420, $Rev: 3547 $)
  4132. GCC: (GNU) 4.1.1 (SDK420, $Rev: 3547 $)
  4133. GCC: (GNU) 4.1.1 (SDK420, $Rev: 3547 $)
  4134. GCC: (GNU) 4.1.1 (SDK420, $Rev: 3547 $)
  4135. GCC: (GNU) 4.1.1 (SDK420, $Rev: 3547 $)
  4136. GCC: (GNU) 4.1.1 (SDK420, $Rev: 3547 $)
  4137. GCC: (GNU) 4.1.1 (SDK420, $Rev: 3547 $)
  4138. GCC: (GNU) 4.1.1 (SDK420, $Rev: 3547 $)
  4139. GCC: (GNU) 4.1.1 (SDK420, $Rev: 3547 $)
  4140. GCC: (GNU) 4.1.1 (SDK420, $Rev: 3547 $)
  4141. GCC: (GNU) 4.1.1 (SDK420, $Rev: 3547 $)
  4142. GCC: (GNU) 4.1.1 (SDK420, $Rev: 3547 $)
  4143. GCC: (GNU) 4.1.1 (SDK420, $Rev: 3547 $)
  4144. GCC: (GNU) 4.1.1 (SDK420, $Rev: 3547 $)
  4145. GCC: (GNU) 4.1.1 (SDK420, $Rev: 3547 $)
  4146. GCC: (GNU) 4.1.1 (SDK420, $Rev: 3547 $)
  4147. GCC: (GNU) 4.1.1 (SDK420, $Rev: 3547 $)
  4148. GCC: (GNU) 4.1.1 (SDK420, $Rev: 3547 $)
  4149. GCC: (GNU) 4.1.1 (SDK420, $Rev: 3547 $)
  4150. GCC: (GNU) 4.1.1 (SDK420, $Rev: 3547 $)
  4151. GCC: (GNU) 4.1.1 (SDK420, $Rev: 3547 $)
  4152. GCC: (GNU) 4.1.1 (SDK420, $Rev: 3547 $)
  4153. GCC: (GNU) 4.1.1 (SDK420, $Rev: 3547 $)
  4154. GCC: (GNU) 4.1.1 (SDK420, $Rev: 3547 $)
  4155. GCC: (GNU) 4.1.1 (SDK420, $Rev: 3547 $)
  4156. GCC: (GNU) 4.1.1 (SDK420, $Rev: 3547 $)
  4157. GCC: (GNU) 4.1.1 (SDK420, $Rev: 3547 $)
  4158. GCC: (GNU) 4.1.1 (SDK420, $Rev: 3547 $)
  4159. GCC: (GNU) 4.1.1 (SDK420, $Rev: 3547 $)
  4160. GCC: (GNU) 4.1.1 (SDK420, $Rev: 3547 $)
  4161. GCC: (GNU) 4.1.1 (SDK420, $Rev: 3547 $)
  4162. GCC: (GNU) 4.1.1 (SDK420, $Rev: 3547 $)
  4163. GCC: (GNU) 4.1.1 (SDK420, $Rev: 3547 $)
  4164. GCC: (GNU) 4.1.1 (SDK420, $Rev: 3547 $)
  4165. GCC: (GNU) 4.1.1 (SDK420, $Rev: 3547 $)
  4166. GCC: (GNU) 4.1.1 (SDK420, $Rev: 3547 $)
  4167. GCC: (GNU) 4.1.1 (SDK420, $Rev: 3547 $)
  4168. GCC: (GNU) 4.1.1 (SDK420, $Rev: 3547 $)
  4169. GCC: (GNU) 4.1.1 (SDK420, $Rev: 3547 $)
  4170. GCC: (GNU) 4.1.1 (SDK420, $Rev: 3547 $)
  4171. GCC: (GNU) 4.1.1 (SDK420, $Rev: 3547 $)
  4172. GCC: (GNU) 4.1.1 (SDK420, $Rev: 3547 $)
  4173. GCC: (GNU) 4.1.1 (SDK420, $Rev: 3547 $)
  4174. GCC: (GNU) 4.1.1 (SDK420, $Rev: 3547 $)
  4175. GCC: (GNU) 4.1.1 (SDK420, $Rev: 3547 $)
  4176. GCC: (GNU) 4.1.1 (SDK420, $Rev: 3547 $)
  4177. GCC: (GNU) 4.1.1 (SDK420, $Rev: 3547 $)
  4178. GCC: (GNU) 4.1.1 (SDK420, $Rev: 3547 $)
  4179. GCC: (GNU) 4.1.1 (SDK420, $Rev: 3547 $)
  4180. GCC: (GNU) 4.1.1 (SDK420, $Rev: 3547 $)
  4181. GCC: (GNU) 4.1.1 (SDK420, $Rev: 3547 $)
  4182. GCC: (GNU) 4.1.1 (SDK420, $Rev: 3547 $)
  4183. GCC: (GNU) 4.1.1 (SDK420, $Rev: 3547 $)
  4184. GCC: (GNU) 4.1.1 (SDK420, $Rev: 3547 $)
  4185. GCC: (GNU) 4.1.1 (SDK420, $Rev: 3547 $)
  4186. GCC: (GNU) 4.1.1 (SDK420, $Rev: 3547 $)
  4187. GCC: (GNU) 4.1.1 (SDK420, $Rev: 3547 $)
  4188. GCC: (GNU) 4.1.1 (SDK420, $Rev: 3547 $)
  4189. GCC: (GNU) 4.1.1 (SDK420, $Rev: 3547 $)
  4190. GCC: (GNU) 4.1.1 (SDK420, $Rev: 3547 $)
  4191. GCC: (GNU) 4.1.1 (SDK420, $Rev: 3547 $)
  4192. GCC: (GNU) 4.1.1 (SDK420, $Rev: 3547 $)
  4193. GCC: (GNU) 4.1.1 (SDK420, $Rev: 3547 $)
  4194. GCC: (GNU) 4.1.1 (SDK420, $Rev: 3547 $)
  4195. GCC: (GNU) 4.1.1 (SDK420, $Rev: 3547 $)
  4196. GCC: (GNU) 4.1.1 (SDK420, $Rev: 3547 $)
  4197. GCC: (GNU) 4.1.1 (SDK420, $Rev: 3547 $)
  4198. GCC: (GNU) 4.1.1 (SDK420, $Rev: 3547 $)
  4199. GCC: (GNU) 4.1.1 (SDK420, $Rev: 3547 $)
  4200. GCC: (GNU) 4.1.1 (SDK420, $Rev: 3547 $)
  4201. GCC: (GNU) 4.1.1 (SDK420, $Rev: 3547 $)
  4202. GCC: (GNU) 4.1.1 (SDK420, $Rev: 3547 $)
  4203. GCC: (GNU) 4.1.1 (SDK420, $Rev: 3547 $)
  4204. GCC: (GNU) 4.1.1 (SDK420, $Rev: 3547 $)
  4205. GCC: (GNU) 4.1.1 (SDK420, $Rev: 3547 $)
  4206. GCC: (GNU) 4.1.1 (SDK420, $Rev: 3547 $)
  4207. GCC: (GNU) 4.1.1 (SDK420, $Rev: 3547 $)
  4208. GCC: (GNU) 4.1.1 (SDK420, $Rev: 3547 $)
  4209. GCC: (GNU) 3.4.1 (CELL 2.2.1, May 23 2005)
  4210. .shstrtab
  4211. .text
  4212. .rodata
  4213. .ctors
  4214. .dtors
  4215. .data.rel.ro
  4216. .data
  4217. .opd
  4218. .got
  4219. .bss
  4220. .comment
  4221.  
  4222. ss_server2::initialize_modules: iimgr failed
  4223. ss_server2::initialize_modules: secure_rtc failed
  4224. ss_init_if::notify_failure failed:
  4225. ss_init_if::notify_ready failed:
  4226. get_open_psid: ret[0]: 0x%x
  4227. get_open_psid: ret[1]: 0x%x
  4228. get_open_psid: ret[2]: 0x%x
  4229. get_ps_code: ret[0]: 0x%x
  4230. get_ps_code: ret[1]: 0x%x
  4231. get_ps_code: ret[2]: 0x%x
  4232. get_device_id: ret[0]: 0x%x
  4233. get_device_id: ret[1]: 0x%x
  4234. get_device_id: ret[2]: 0x%x
  4235. get_device_type: ret[0]: 0x%x
  4236. get_device_type: ret[1]: 0x%x
  4237. get_device_type: ret[2]: 0x%x
  4238. aim_get_open_psid: get_result: ret[0]: 0x%x
  4239. aim_get_ps_code: get_result: ret[0]: 0x%x
  4240. aim_get_device_id: get_result: ret[0]: 0x%x
  4241. aim_get_device_type: get_result: ret[0]: 0x%x
  4242. aim_get_open_psid: run: ret[0]: 0x%x
  4243. aim_get_ps_code: run: ret[0]: 0x%x
  4244. aim_get_device_id: run: ret[0]: 0x%x
  4245. aim_get_device_type: run: ret[0]: 0x%x
  4246. aim_get_open_psid: setup: ret[0]: 0x%x
  4247. aim_get_ps_code: setup: ret[0]: 0x%x
  4248. aim_get_device_id: setup: ret[0]: 0x%x
  4249. aim_get_device_type: setup: ret[0]: 0x%x
  4250. 0x%02x
  4251. aim_core: SIGSPUTIMEOUT caught(not desired)
  4252. aim_core: SIGSPUERR caught(not desired)
  4253. aim_core: SIGSPUDMA caught(not desired)
  4254. aim_core: SIGSPUSTOP_SL caught(not desired)
  4255. aim_core: SIGSPUSTOP caught
  4256. aim_core: SIGSPUMB_SL caught(not desired)
  4257. aim_core: SIGSPUMB caught(not desired)
  4258.         m_dma_bufp: 0x%llx
  4259.         m_dma_size: 0x%x
  4260. aim_core_process: ret[0]: 0x%x
  4261. aim_spu_module.self
  4262. aim_core_process: ret[1]: 0x%x
  4263.         module_bufp: 0x%x
  4264.         module_size: 0x%x
  4265. aim_core_process: ret[2]: 0x%x
  4266.         eid_bufp: 0x%llx
  4267.         eid_size: 0x%x
  4268. aim_core_process: ret[3]: 0x%x
  4269.         eid_size:      0x%x
  4270.         eid_read_size: 0x%x
  4271. EID data(encrypt)
  4272. aim_core_process: ret[4]: 0x%x
  4273. aim_core_process: ret[5]: 0x%x
  4274.         signal_type: 0x%x
  4275. aim_core_process: ret[6]: 0x%x
  4276.         stop_code: 0x%x
  4277. read_system_data_from_eeprom: buf_addr == NULL
  4278. metldr
  4279. DEFAULT.SPP
  4280. SCE_CELLOS_SS_INDI_INFO_EID
  4281. ### unmap pages
  4282. metldr
  4283. ###Format1
  4284. ###Format2
  4285. set_rtc: ret[2]: 0x%x
  4286. set_time: ret[1]: 0x%x
  4287.         subject ID:
  4288.           lpar_authority_id:    0x%llx
  4289.           program_authority_id: 0x%llx
  4290.         ID:
  4291.           internal tid:         0x%llx
  4292. set_time: ret[2]: 0x%x
  4293. set_time: ret[0]: 0x%x
  4294. get_time: ret[1]: 0x%x
  4295. get_time: ret[2]: 0x%x
  4296.           value:  0x%llx
  4297.           status: 0x%llx
  4298. get_time: ret[0]: 0x%x
  4299. SCE_CELLOS_SS_SECURE_RTC
  4300. setup: ret[0]: 0x%x
  4301.         size: 0x%x
  4302. setup: ret[1]: 0x%x
  4303.         out_size: 0x%x
  4304. SPL:check laid:%lx %lx
  4305. SPL: laid check error:%lx %lx
  4306. SPL:check paid:%lx %lx
  4307. SPL: laid or paid check error: laid:%lx %lx
  4308.  paid:%lx %lx
  4309. SPL:get_component index error: %d
  4310. SPL:get_component: get_module_location failure(%d)
  4311. SPL:get_component: file_size:%d offset:%d
  4312. SPL:get_component: %d bytes to read.
  4313. SPL:get_component info.la: %p info.size: %d
  4314. SPL:get_component: mmap(%d)
  4315. SPL:get_component: read %d bytes.
  4316. munmap: %d
  4317. SPL:get_component: munmap(%d)
  4318. SPL:get_component: read(%d)
  4319. SPL:get_component: region size error(%d)
  4320. SPL:get_component: done
  4321. SPL: get_contents: type %lx
  4322. SPL: profile_mgr get faild %d
  4323. SPL: profile not initialized %d
  4324. SPL: get_lpar_parameter_size: %s
  4325. SCE_CELLOS_SYSTEM_MGR
  4326. SPL: get_lpar_parameter: lpar_list fail: %d
  4327. SPL: get_lpar_parameter: lpar_name size : %d
  4328. SPL: get_lpar_parameter: lpar_parameters size : %d
  4329. SPL: get_contents_size: type %lx
  4330. SPL: get_lpar_info: type %d
  4331. SPL: get_lpar_info  type error
  4332. SPL: get_lpar_parameter: %s
  4333. SPL: get_lpar_parameter: lpar_info : %s
  4334. SPL: get_lpar_parameter: lpar_info fail: %d
  4335. SPL: get_lpar_parameter:done: %s
  4336. emer_init.self
  4337. hdd_copy.self
  4338. SPL:spp header format version error:%d
  4339. SPL:spp header size error:%d
  4340. SPL:spp header align error:%d
  4341. PM:signal: timeout
  4342.  ----- signal has arrived -----
  4343. SL:timeout_handler:read_spu_status failed.
  4344. SL:signal: handler_end
  4345. PM:signal: spu err
  4346. SL:err_handler:read_spu_status failed.
  4347. SL:signal: spu dma
  4348.  ----- signal spudma -----
  4349. SL:dma_handler:read_spu_status failed.
  4350. spu problem area: %p
  4351. SL:signal: stop and signal
  4352. SL:sigspustop_handler:read_spu_status failed.
  4353. SPU state:%lu
  4354. stop code = %u
  4355. signal result = %p
  4356. PM:verify_profile size:%d
  4357. PM: spp header error %d
  4358. PM:fileloader load spu_module faild: %d
  4359. PM:fileloader spu_module get_buffer faild: %d
  4360. PM:fileloader get spu module size faild: %d
  4361. PM: spu request done
  4362. PM:verify_profile:request_loading_spu_module failure %d
  4363. sleep...
  4364. PM:verify spp finish
  4365. PM:SIGSPUDMA: error
  4366. PM:SIGSPUERR: error
  4367. PM:SIGSPUTIMEOUT: error
  4368. PM:verify_profile finish:%d size:%lu
  4369. PM: delete_profile: %s
  4370. PM:fileloader load faild: %d
  4371. PM:fileloader get_buffer faild: %d
  4372. PM:fileloader get_size faild: %d
  4373. spu_filename:%s
  4374. PM: verify profile failed %d
  4375. PM: free buffer for load_profile
  4376. PM:stored spp:%s,
  4377. requested spp:%s
  4378. PM: flash_id: %d, flash_top_offset: %d
  4379. get_repository_node_value failed:
  4380. PM:has prof:%s
  4381. PM:load prof:%s
  4382. PM: load faild:%d %s
  4383. /flh/os/spp_verifier.self
  4384. /rmt/default.spp
  4385. /flh/os/default.spp
  4386. FL:vfs open error:%d :toolong
  4387. FL:vfs open error:%d :errno:%d
  4388. FL:vfs size error:%d
  4389. FL:lseek fail, and close fail:fd: %d
  4390. SL:allocate fail:size(%d)
  4391. FL:close fail:fd: %d
  4392. FL: vfs seek error:%d
  4393. FL: vfs size error:%d
  4394. FL:size error:%d  %d
  4395. FL:file loaded :%d
  4396. FL: conf_mgr init err
  4397. offset:%d size: %d
  4398. FL:read error:%d
  4399. /flh/os/
  4400. FL: release_buffer for pme_malloc
  4401. FL: malloc :size  %lu
  4402. /rmt
  4403. /local_sys0
  4404. /flh
  4405.  * map data buffer:
  4406. /proc/partitions/%d/mem
  4407. couldn't open file...(%s)
  4408. mapped address: %p
  4409. mmap failed: errno = %d
  4410. close error:%d
  4411. spp:data size error:%lu
  4412. spp:contents size is too big:%lu
  4413. spp: segment size exceed whole data size error
  4414. error seg_size is too large
  4415. spp: new for contents[] failed
  4416. spp:create_contents error. %d
  4417. spp: release: seg_num %d
  4418. spp: seg %d ct %d released
  4419. spp: seg %d cts released
  4420. spp: segs released
  4421. spp: all segments released
  4422. spp: released
  4423. spp: create: has data %d
  4424. spp: create: start create
  4425. spp: create: null buffer
  4426. spp: create: too small
  4427. spp: version error: (%d)
  4428. spp:segment seg_num error: %lu
  4429. spp:create:new segments[]: %d
  4430. spp: new for segments[] failed
  4431. spp: create new segment: %d
  4432. spp:create segment:%d : error
  4433. spp:create: total data length check error
  4434. spp:get_contents: nodata %d
  4435. spp:get_contents: invalid type:%d
  4436. spp:skip type:%d
  4437. spp:get_contents: not found: type %d
  4438. total seg_num:%d
  4439. seg:%d
  4440. pmode_srv_verify_response: ret[0]: 0x%x
  4441. pmode_srv_verify_response: ret[2]: 0x%x
  4442. pmode_srv_generate_challenge: ret[0]: 0x%x
  4443. pmode_srv_generate_challenge: ret[1]: 0x%x
  4444. restore_root_info: ret[0]: 0x%x
  4445. restore_root_info: ret[1]: 0x%x
  4446. restore_root_info: ret[2]: 0x%x
  4447. backup_root_info: ret[0]: 0x%x
  4448. backup_root_info: ret[1]: 0x%x
  4449. backup_root_info: ret[2]: 0x%x
  4450. correct_rtc_factory: ret[0]: 0x%x
  4451. correct_rtc_factory: ret[1]: 0x%x
  4452. correct_rtc_factory: ret[2]: 0x%x
  4453. set_rtc_factory: ret[0]: 0x%x
  4454. set_rtc_factory: ret[1]: 0x%x
  4455. set_rtc_factory: ret[2]: 0x%x
  4456. sc_binary_patch: ret[0]: 0x%x
  4457. sc_binary_patch: ret[1]: 0x%x
  4458. sc_binary_patch: ret[2]: 0x%x
  4459. set_sc_status: ret[0]: 0x%x
  4460. set_sc_status: ret[1]: 0x%x
  4461. set_sc_status: ret[2]: 0x%x
  4462. get_sc_status: ret[0]: 0x%x
  4463. get_sc_status: ret[1]: 0x%x
  4464. get_sc_status: ret[2]: 0x%x
  4465. get_property: ret[0]: 0x%x
  4466. get_property: ret[1]: 0x%x
  4467. get_property: ret[2]: 0x%x
  4468. init_for_updater: ret[0]: 0x%x
  4469. init_for_updater: ret[1]: 0x%x
  4470. init_for_updater: ret[2]: 0x%x
  4471. init_for_updater: ret[3]: 0x%x
  4472. init_for_updater: ret[4]: 0x%x
  4473. init_for_updater: ret[5]: 0x%x
  4474. write_eprom: ret[0]: 0x%x
  4475.         service:       0x%x
  4476.         major_version: 0x%x
  4477.         minor_version: 0x%x
  4478. ***write using nvs service***
  4479. write_eprom: ret[1]: 0x%x
  4480.         offset:       0x%x
  4481.         block_id:     0x%x
  4482.         block_offset: 0x%x
  4483. write_eprom: ret[2]: 0x%x
  4484. ***write using device_access_service***
  4485. read_eprom: ret[0]: 0x%x
  4486. ***read using nvs service***
  4487. read_eprom: ret[1]: 0x%x
  4488. read_eprom: ret[2]: 0x%x
  4489. ***read using device_access_service***
  4490. set_product_mode: ret[0]: 0x%x
  4491.         property: 0x%llx
  4492. set_product_mode: ret[1]: 0x%x
  4493.         version: 0x%x
  4494.         mode:    0x%x
  4495. set_product_mode: ret[2]: 0x%x
  4496.         product mode: 0x%x
  4497. set_product_mode: ret[3]: 0x%llx
  4498. set_rtc: ret[0]: 0x%x
  4499. set_rtc: ret[1]: 0x%x
  4500. set_region_data: ret[0]: 0x%x
  4501. set_region_data: ret[1]: 0x%x
  4502. set_region_data: ret[2]: 0x%x
  4503. get_region_data: ret[0]: 0x%x
  4504. get_region_data: ret[1]: 0x%x
  4505. get_region_data: ret[2]: 0x%x
  4506. set_srh: ret[0]: 0x%x
  4507. set_srh: ret[1]: 0x%x
  4508. set_srh: ret[2]: 0x%x
  4509. get_srh: ret[0]: 0x%x
  4510. get_srh: ret[1]: 0x%x
  4511. get_srh: ret[2]: 0x%x
  4512. decrypt: ret[0]: 0x%x
  4513. decrypt: ret[1]: 0x%x
  4514. decrypt: ret[2]: 0x%x
  4515. encrypt: ret[0]: 0x%x
  4516. encrypt: ret[1]: 0x%x
  4517. encrypt: ret[2]: 0x%x
  4518. init_for_vtrm: ret[0]: 0x%x
  4519. init_for_vtrm: ret[1]: 0x%x
  4520. init_for_vtrm: ret[2]: 0x%x
  4521. init_for_vtrm: ret[3]: 0x%x
  4522. init_for_vtrm: ret[4]: 0x%x
  4523. init_for_vtrm: ret[5]: 0x%x
  4524. start signal handler sputimeout
  4525. recv signal (%d) is SIGSPUTIMEOUT. (r4=%d)
  4526. recv signal (%d) is not SIGSPUTIMEOUT. (r4=%d)
  4527. start signal handler spustopsl
  4528. recv signal (%d) is SIGSPUSTOP_SL. (r4=%d)
  4529. recv signal (%d) is not SIGSPUSTOP_SL. (r4=%d)
  4530. start signal handler spumbsl
  4531. recv signal (%d) is SIGSPUMB_SL. (r4=%d)
  4532. recv signal (%d) is not SIGSPUMB_SL. (r4=%d)
  4533. start signal handler spuerr
  4534. recv signal (%d) is SIGSPUERR. (r4=%d)
  4535. recv signal (%d) is not SIGSPUERR. (r4=%d)
  4536. start signal handler spudma
  4537. recv signal (%d) is SIGSPUDMA. (r4=%d)
  4538. recv signal (%d) is not SIGSPUDMA. (r4=%d)
  4539. start signal handler spustop
  4540. recv signal (%d) is SIGSPUSTOP. (r4=%d)
  4541. recv signal (%d) is not SIGSPUSTOP. (r4=%d)
  4542. start signal handler spumb
  4543. recv signal (%d) is SIGSPUMB. (r4=%d)
  4544. recv signal (%d) is not SIGSPUMB. (r4=%d)
  4545.         received seqno:         0x%x
  4546.         received mbmsg:         0x%x
  4547.         received cmd:           0x%x
  4548.         received cmd_data_size: 0x%x
  4549. check_header: seqno invalid
  4550. check_header: mbmsg invalid
  4551. check_header: command invalid
  4552. check_header: exit data len invalid
  4553. send DMA data to SPU
  4554. send_abort: ret[0]: 0x%x
  4555. send_success: ret[0]: 0x%x
  4556.         send_data_size: 0x%llx
  4557.         recv_data_size: 0x%llx
  4558.         buf_size: 0x%x
  4559. sendrecv_process: ret[0]: 0x%x
  4560. sendrecv_process: ret[1]: 0x%x
  4561. check_stop_code: ret[0]: 0x%x
  4562.         stopcode: 0x%x
  4563. check_received_data: ret[0]: 0x%x
  4564. received DMA data from SPU
  4565. check_received_data: seqno invalid
  4566. check_received_data: mbmsg invalid
  4567. check_received_data: command invalid
  4568. API end DMA data
  4569. sc_core: ret[0]: 0x%x
  4570. sc_core: ret[1]: 0x%x
  4571. sc_core: ret[2]: 0x%x
  4572. API start DMA data
  4573. sc_core: ret[3]: 0x%x
  4574. receive_message: seqno invalid
  4575. receive_message: command invalid
  4576. receive_message: get_result: ret[1]: 0x%x
  4577. send_message: ret[0]: 0x%x
  4578. pscm_restore_root_info: get_result: ret[0]: 0x%x
  4579. scm_correct_rtc_factory: get_result: ret[0]: 0x%x
  4580. scm_set_rtc_factory: get_result: ret[0]: 0x%x
  4581. scm_sc_binary_patch: get_result: ret[0]: 0x%x
  4582. scm_set_sc_status: get_result: ret[0]: 0x%x
  4583. scm_init_for_updater: get_result: ret[0]: 0x%x
  4584. scm_set_rtc: get_result: ret[0]: 0x%x
  4585. scm_init_for_vtrm: get_result: ret[0]: 0x%x
  4586. scm_set_srh: get_result: ret[0]: 0x%x
  4587. scm_pmode_srv_auth: get_result: ret[0]: 0x%x
  4588. scm_pmode_srv_auth: get_result: ret[1]: 0x%x
  4589. scm_pmode_srv_auth: get_result: ret[2]: 0x%x
  4590. scm_backup_root_info: get_result: ret[0]: 0x%x
  4591. scm_backup_root_info: get_result: ret[1]: 0x%x
  4592. scm_set_time: get_result: ret[0]: 0x%x
  4593. scm_set_time: get_result: ret[1]: 0x%x
  4594. scm_set_time: get_result: id invalid
  4595. scm_get_time: get_result: ret[0]: 0x%x
  4596. scm_get_time: get_result: ret[1]: 0x%x
  4597. scm_get_time: get_result: id invalid
  4598. scm_get_time: get_result: ret[2]: 0x%x
  4599. scm_get_time: get_result: ret[3]: 0x%x
  4600. scm_set_region_data: get_result: ret[0]: 0x%x
  4601. scm_set_region_data: get_result: ret[1]: 0x%x
  4602. scm_set_region_data: get_result: id invalid
  4603. scm_get_region_data: get_result: ret[0]: 0x%x
  4604. scm_get_region_data: get_result: ret[1]: 0x%x
  4605. scm_get_region_data: get_result: id invalid
  4606. scm_get_region_data: get_result: ret[2]: 0x%x
  4607. scm_get_srh: get_result: ret[0]: 0x%x
  4608. scm_get_srh: get_result: ret[1]: 0x%x
  4609. scm_get_srh: get_result: ret[2]: 0x%x
  4610. scm_decrypt: get_result: ret[0]: 0x%x
  4611. scm_decrypt: get_result: ret[1]: 0x%x
  4612. scm_decrypt: get_result: type field invalid
  4613. scm_decrypt: get_result: ret[2]: 0x%x
  4614. scm_decrypt: get_result: ret[3]: 0x%x
  4615. scm_encrypt: get_result: ret[0]: 0x%x
  4616. scm_encrypt: get_result: ret[1]: 0x%x
  4617. scm_encrypt: get_result: type field invalid
  4618. scm_encrypt: get_result: ret[2]: 0x%x
  4619. scm_encrypt: get_result: ret[3]: 0x%x
  4620. sc_iso.self
  4621. scm_pmode_srv_auth: run: ret[0]: 0x%x
  4622. scm_restore_root_info: run: ret[0]: 0x%x
  4623. scm_backup_root_info: run: ret[0]: 0x%x
  4624. sc_iso_factory.self
  4625. scm_correct_rtc_factory: run: ret[0]: 0x%x
  4626. scm_set_rtc_factory: run: ret[0]: 0x%x
  4627. scm_sc_binary_patch: run: ret[0]: 0x%x
  4628. scm_set_sc_status: run: ret[0]: 0x%x
  4629. scm_get_sc_status: run: ret[0]: 0x%x
  4630. scm_get_property: run: ret[0]: 0x%x
  4631. scm_init_for_updater: run: ret[0]: 0x%x
  4632. scm_set_rtc: run: ret[0]: 0x%x
  4633. scm_set_time: run: ret[0]: 0x%x
  4634. scm_get_time: run: ret[0]: 0x%x
  4635. scm_set_region_data: run: ret[0]: 0x%x
  4636. scm_get_region_data: run: ret[0]: 0x%x
  4637. scm_init_for_vtrm: run: ret[0]: 0x%x
  4638. scm_set_srh: run: ret[0]: 0x%x
  4639. scm_get_srh: run: ret[0]: 0x%x
  4640. scm_decrypt: run: ret[0]: 0x%x
  4641. scm_encrypt: run: ret[0]: 0x%x
  4642. scm_get_sc_status: get_result: ret[0]: 0x%x
  4643. scm_get_sc_status: get_result: ret[1]: 0x%x
  4644. scm_get_sc_status: get_result: ret[2]: 0x%x
  4645.         status: 0x%x
  4646. scm_get_property: get_result: ret[0]: 0x%x
  4647. scm_get_property: get_result: ret[1]: 0x%x
  4648. sc_sendrecv: ret[0]: 0x%x
  4649.         send_data_size:  0x%llx
  4650.         sent_data_size:  0x%llx
  4651.         recv_data_size:  0x%llx
  4652.         recvd_data_size: 0x%llx
  4653.         send_body_size: 0x%x
  4654.         recv_body_size: 0x%x
  4655.         packet_size:    0x%x
  4656. get_service_version: ret[0]: 0x%x
  4657.         recv_size:  0x%x
  4658.         recvd_size: 0x%x
  4659. get_service_version: ret[1]: 0x%x
  4660.         status:           0x%x
  4661.         srecv_service_id: 0x%x
  4662. write_nvs: ret[0]: 0x%x
  4663. write_nvs: ret[1]: 0x%x
  4664.         status:     0x%x
  4665. read_nvs: ret[0]: 0x%x
  4666.         length:     0x%x
  4667. read_nvs: ret[1]: 0x%x
  4668.         size:       0x%x
  4669. sc_proxy_if::sendrecv
  4670. (%d, 0x%x, %d, %d,
  4671. %d, %d, %d)
  4672. In sc_proxy_if::sendrecv:
  4673. id should be %d
  4674. buf_addr should not be NULL
  4675. send_size should be greater than 0
  4676. recv_size should be greater than 0
  4677. buf_size should not be smaller than
  4678. send_buf or recv_buf
  4679. /dev/sc3
  4680. sc_proxy::open failed: ret = %d
  4681. sc_proxy::write failed: ret = %d
  4682. In sc_proxy_if::sendrecv: sc_proxy::close failed: ret = %d
  4683. sc_proxy::read failed: ret = %d
  4684. sc_proxy::close failed: ret = %d
  4685. In sc_proxy::close: close failed: ret = %d, errno = %d
  4686. In timeout_handler of sc_proxy: invalid signal %d
  4687. In sc_proxy::write: buf should not be NULL
  4688. In sc_proxy::write: nbytes should be greater than 0
  4689. In sc_proxy::write: config_manager::initialize failed: ret = %d
  4690. In sc_proxy::write: workaround for SC firmware bug
  4691. In sc_proxy::write: write failed: ret = %d, errno = %d
  4692. In sc_proxy::read: buf should not be NULL
  4693. In sc_proxy::read: nbytes should be greater than 0
  4694. In sc_proxy::read: signal failed
  4695. In sc_proxy::read: old_timeout: %d
  4696. In sc_proxy::read: read failed: ret = %d, errno = %d
  4697. timeout occured
  4698. In sc_proxy::open: flags should be O_RDWR
  4699. In sc_proxy::open: open failed: ret = %d, errno = %d
  4700. ros0
  4701. ros1
  4702. top_toc
  4703. asecure_loader
  4704. eEID
  4705. cISD
  4706. cCSD
  4707. trvk_prg
  4708. trvk_pkg
  4709. cvtrm
  4710. nand_update
  4711. lsp_update
  4712. bdit_firmware
  4713. bdpt_301r_firmware
  4714. bdpt_302r_firmware
  4715. bdpt_303r_firmware
  4716. trvk_prg0
  4717. trvk_prg1
  4718. trvk_pkg0
  4719. trvk_pkg1
  4720. bdpt_304r_firmware
  4721. END_OF_REGION
  4722. composite_region::read(0x%llx, %lld, 0x%llx)
  4723. composite_region::allocate_buffer(%lld)
  4724. composite_region::release_buffer(0x%llx)
  4725. composite_region::cache_all_composite_region_entry()
  4726.         offset = %d
  4727.         header is not cached
  4728.         entry is not cached
  4729. composite_region::get_composite_region_entry_by_index(%d, 0x%llx)
  4730. composite_region::writev()
  4731. blksize = 0x%llx, mask = 0x%llx
  4732. iovec[%d].offset = 0x%llx
  4733. iovec[%d].size = 0x%llx
  4734. iovec[%d].buf = 0x%llx
  4735. [%d] align_offset = 0x%llx
  4736. writev(): flush previous data (0x%llx)
  4737. writev(): read initial data (0x%llx)
  4738. writev(): flush last data (0x%llx)
  4739. OS_BANK:0x%llx, 0x%llx
  4740. OS_BANK repository error:0x%llx
  4741. PRG_RVK_BANK:0x%llx, 0x%llx
  4742. PRG_RVK_BANK repository error:0x%llx
  4743. PKG_RVK_BANK:0x%llx, 0x%llx
  4744. PKG_RVK_BANK repository error:0x%llx
  4745. bank_manager::get_repository_value(m_type = %d)
  4746. settle value mismatched. 0x%llx : 0x%llx
  4747. bank_manager::setup(%d)
  4748. bank repository found
  4749. bank repository not found
  4750. capability_checker::check_product_mode_capability: OK
  4751. capability_checker::check_product_mode_capability: NG
  4752.  !!! if_proto::send_receive error : cannot find port ID for function_id=0x%x
  4753.  # if_proto::send_receive : port_id=%llu
  4754.  !!! if_proto::send_receive error : cannot connect port=%u
  4755.  # ss_responder::terminate
  4756.  # ss_responder::initialize
  4757. !!! ss_responder::initialize : failed
  4758. !!! port_id=%llu, return=%u
  4759.  # ss_responder::initialize : port_id=%d, socket=%d
  4760. # ss_responder::loop_once : sock=%d
  4761.  # port_id_table::function_id2port_id : func ID=0x%llx, portid=0x%llx
  4762. read_nbytes : read errno=%d
  4763. read_nbytes : unexpected EOF.
  4764.  # pme_client::receive : PID=%u
  4765. write_nbytes : write errno=%d
  4766. write : unexpected EOF.
  4767.  # pme_client::disconnect : PID=%u
  4768. !!! pme_client::disconnect : close failed (errno=%d)
  4769.  # pme_client::connect : PID=%u, portid=%u
  4770. !!! pme_client:connect : socket failed (errno=%d)
  4771. !!! pme_client::connect : connect failed (port_id=%u, errno=%d)
  4772.  # pme_client::send : PID=%u
  4773.  # pme_server::disconnect : PID=%u
  4774. !!! pme_server::disconnect : close failed (errno=%d)
  4775.  # pme_server::force_close : PID=%u
  4776.  # pme_server::reply : PID=%u
  4777. !!! pme_server::reply : close failed (errno=%d)
  4778.  # pme_server::accept : PID=%u
  4779. !!! pme_server::accept : accept failed (errno=%d)
  4780. !!! pme_server::accept : read_nbytes failed (return=%d)
  4781.  # pme_server::connect : PID=%u, port_id=%u
  4782. !!! pme_server::connect : socket failed (errno=%d)
  4783. !!! pme_server::connect : bind failed (errno=%d)
  4784. !!! pme_server::connect : listen failed (errno=%d)
  4785. !!! page_bytestring::free_page : unmap_pages failed, page_addr=%p
  4786. !!! page_bytestring::alloc_page : map_pages failed, page_num=%u
  4787. packet_id: 0x%llx
  4788. function_id: 0x%llx
  4789. retval: 0x%x
  4790. subject_id: (0x%llx,0x%llx)
  4791.     # ss_packet::send_receive (CLIENT) : func_id=0x%llx, packet_id=0x%llx, subject_id=(0x%llx,0x%llx)
  4792.     # ss_packet::process_async : packet_id=0x%llx
  4793.  # ss_packet::process_received (SERVER) : sock=%d
  4794. !!! ss_packet::process_received (SERVER) error: packet format error (broken?)
  4795.   # ss_packet::process_received (SERVER) : packet_id=0x%llx, subject_id=(0x%llx,0x%llx)
  4796. !!! ss_packet::process_received (SERVER) error: unknown packet
  4797.     # ss_packet::process_received (SERVER) error: port table inconsistent
  4798.  # ss_packet::accept_reply : accept done. sock=%d
  4799. In ss_init_repository::get_node_value:
  4800.         name:   {
  4801. 0x%llx,
  4802. 0x%llx}
  4803. get_repository_node_value succeeded
  4804.         value:  {
  4805. In ss_init_repository::get_node_value:
  4806. remove_repository_node failed
  4807. In ss_init_repository::create_node:
  4808. creating...
  4809. create_repository_node succeeded
  4810. In ss_init_repository::create_node:
  4811. create_repository_node failed
  4812. 0123456789abcdef
  4813. 0123456789ABCDEF
  4814. (null)
  4815. max system bytes = %10lu
  4816. system bytes     = %10lu
  4817. in use bytes     = %10lu
  4818. /dev/rflash
  4819. /dev/eflash
  4820. /_init_storage/
  4821. /dev/flash_num
  4822. GCC: (GNU) 4.1.1 (SDK420, $Rev: 3547 $)
  4823. GCC: (GNU) 4.1.1 (SDK420, $Rev: 3547 $)
  4824. GCC: (GNU) 4.1.1 (SDK420, $Rev: 3547 $)
  4825. GCC: (GNU) 4.1.1 (SDK420, $Rev: 3547 $)
  4826. GCC: (GNU) 4.1.1 (SDK420, $Rev: 3547 $)
  4827. GCC: (GNU) 4.1.1 (SDK420, $Rev: 3547 $)
  4828. GCC: (GNU) 4.1.1 (SDK420, $Rev: 3547 $)
  4829. GCC: (GNU) 4.1.1 (SDK420, $Rev: 3547 $)
  4830. GCC: (GNU) 4.1.1 (SDK420, $Rev: 3547 $)
  4831. GCC: (GNU) 4.1.1 (SDK420, $Rev: 3547 $)
  4832. GCC: (GNU) 4.1.1 (SDK420, $Rev: 3547 $)
  4833. GCC: (GNU) 4.1.1 (SDK420, $Rev: 3547 $)
  4834. GCC: (GNU) 4.1.1 (SDK420, $Rev: 3547 $)
  4835. GCC: (GNU) 4.1.1 (SDK420, $Rev: 3547 $)
  4836. GCC: (GNU) 4.1.1 (SDK420, $Rev: 3547 $)
  4837. GCC: (GNU) 4.1.1 (SDK420, $Rev: 3547 $)
  4838. GCC: (GNU) 4.1.1 (SDK420, $Rev: 3547 $)
  4839. GCC: (GNU) 4.1.1 (SDK420, $Rev: 3547 $)
  4840. GCC: (GNU) 4.1.1 (SDK420, $Rev: 3547 $)
  4841. GCC: (GNU) 4.1.1 (SDK420, $Rev: 3547 $)
  4842. GCC: (GNU) 4.1.1 (SDK420, $Rev: 3547 $)
  4843. GCC: (GNU) 4.1.1 (SDK420, $Rev: 3547 $)
  4844. GCC: (GNU) 4.1.1 (SDK420, $Rev: 3547 $)
  4845. GCC: (GNU) 4.1.1 (SDK420, $Rev: 3547 $)
  4846. GCC: (GNU) 4.1.1 (SDK420, $Rev: 3547 $)
  4847. GCC: (GNU) 4.1.1 (SDK420, $Rev: 3547 $)
  4848. GCC: (GNU) 4.1.1 (SDK420, $Rev: 3547 $)
  4849. GCC: (GNU) 4.1.1 (SDK420, $Rev: 3547 $)
  4850. GCC: (GNU) 4.1.1 (SDK420, $Rev: 3547 $)
  4851. GCC: (GNU) 4.1.1 (SDK420, $Rev: 3547 $)
  4852. GCC: (GNU) 4.1.1 (SDK420, $Rev: 3547 $)
  4853. GCC: (GNU) 4.1.1 (SDK420, $Rev: 3547 $)
  4854. GCC: (GNU) 4.1.1 (SDK420, $Rev: 3547 $)
  4855. GCC: (GNU) 4.1.1 (SDK420, $Rev: 3547 $)
  4856. GCC: (GNU) 4.1.1 (SDK420, $Rev: 3547 $)
  4857. GCC: (GNU) 4.1.1 (SDK420, $Rev: 3547 $)
  4858. GCC: (GNU) 4.1.1 (SDK420, $Rev: 3547 $)
  4859. GCC: (GNU) 4.1.1 (SDK420, $Rev: 3547 $)
  4860. GCC: (GNU) 4.1.1 (SDK420, $Rev: 3547 $)
  4861. GCC: (GNU) 4.1.1 (SDK420, $Rev: 3547 $)
  4862. GCC: (GNU) 4.1.1 (SDK420, $Rev: 3547 $)
  4863. GCC: (GNU) 4.1.1 (SDK420, $Rev: 3547 $)
  4864. GCC: (GNU) 4.1.1 (SDK420, $Rev: 3547 $)
  4865. GCC: (GNU) 4.1.1 (SDK420, $Rev: 3547 $)
  4866. GCC: (GNU) 4.1.1 (SDK420, $Rev: 3547 $)
  4867. GCC: (GNU) 4.1.1 (SDK420, $Rev: 3547 $)
  4868. GCC: (GNU) 4.1.1 (SDK420, $Rev: 3547 $)
  4869. GCC: (GNU) 4.1.1 (SDK420, $Rev: 3547 $)
  4870. GCC: (GNU) 4.1.1 (SDK420, $Rev: 3547 $)
  4871. GCC: (GNU) 4.1.1 (SDK420, $Rev: 3547 $)
  4872. GCC: (GNU) 4.1.1 (SDK420, $Rev: 3547 $)
  4873. GCC: (GNU) 4.1.1 (SDK420, $Rev: 3547 $)
  4874. GCC: (GNU) 4.1.1 (SDK420, $Rev: 3547 $)
  4875. GCC: (GNU) 4.1.1 (SDK420, $Rev: 3547 $)
  4876. GCC: (GNU) 4.1.1 (SDK420, $Rev: 3547 $)
  4877. GCC: (GNU) 4.1.1 (SDK420, $Rev: 3547 $)
  4878. GCC: (GNU) 4.1.1 (SDK420, $Rev: 3547 $)
  4879. GCC: (GNU) 4.1.1 (SDK420, $Rev: 3547 $)
  4880. GCC: (GNU) 4.1.1 (SDK420, $Rev: 3547 $)
  4881. GCC: (GNU) 4.1.1 (SDK420, $Rev: 3547 $)
  4882. GCC: (GNU) 4.1.1 (SDK420, $Rev: 3547 $)
  4883. GCC: (GNU) 4.1.1 (SDK420, $Rev: 3547 $)
  4884. GCC: (GNU) 4.1.1 (SDK420, $Rev: 3547 $)
  4885. GCC: (GNU) 4.1.1 (SDK420, $Rev: 3547 $)
  4886. GCC: (GNU) 4.1.1 (SDK420, $Rev: 3547 $)
  4887. GCC: (GNU) 4.1.1 (SDK420, $Rev: 3547 $)
  4888. GCC: (GNU) 4.1.1 (SDK420, $Rev: 3547 $)
  4889. GCC: (GNU) 4.1.1 (SDK420, $Rev: 3547 $)
  4890. GCC: (GNU) 4.1.1 (SDK420, $Rev: 3547 $)
  4891. GCC: (GNU) 4.1.1 (SDK420, $Rev: 3547 $)
  4892. GCC: (GNU) 4.1.1 (SDK420, $Rev: 3547 $)
  4893. GCC: (GNU) 4.1.1 (SDK420, $Rev: 3547 $)
  4894. GCC: (GNU) 4.1.1 (SDK420, $Rev: 3547 $)
  4895. GCC: (GNU) 4.1.1 (SDK420, $Rev: 3547 $)
  4896. GCC: (GNU) 4.1.1 (SDK420, $Rev: 3547 $)
  4897. GCC: (GNU) 4.1.1 (SDK420, $Rev: 3547 $)
  4898. GCC: (GNU) 4.1.1 (SDK420, $Rev: 3547 $)
  4899. GCC: (GNU) 4.1.1 (SDK420, $Rev: 3547 $)
  4900. GCC: (GNU) 4.1.1 (SDK420, $Rev: 3547 $)
  4901. GCC: (GNU) 4.1.1 (SDK420, $Rev: 3547 $)
  4902. GCC: (GNU) 4.1.1 (SDK420, $Rev: 3547 $)
  4903. GCC: (GNU) 4.1.1 (SDK420, $Rev: 3547 $)
  4904. GCC: (GNU) 4.1.1 (SDK420, $Rev: 3547 $)
  4905. GCC: (GNU) 4.1.1 (SDK420, $Rev: 3547 $)
  4906. GCC: (GNU) 4.1.1 (SDK420, $Rev: 3547 $)
  4907. GCC: (GNU) 4.1.1 (SDK420, $Rev: 3547 $)
  4908. GCC: (GNU) 4.1.1 (SDK420, $Rev: 3547 $)
  4909. GCC: (GNU) 4.1.1 (SDK420, $Rev: 3547 $)
  4910. GCC: (GNU) 4.1.1 (SDK420, $Rev: 3547 $)
  4911. GCC: (GNU) 4.1.1 (SDK420, $Rev: 3547 $)
  4912. GCC: (GNU) 4.1.1 (SDK420, $Rev: 3547 $)
  4913. GCC: (GNU) 4.1.1 (SDK420, $Rev: 3547 $)
  4914. GCC: (GNU) 4.1.1 (SDK420, $Rev: 3547 $)
  4915. GCC: (GNU) 4.1.1 (SDK420, $Rev: 3547 $)
  4916. GCC: (GNU) 4.1.1 (SDK420, $Rev: 3547 $)
  4917. GCC: (GNU) 4.1.1 (SDK420, $Rev: 3547 $)
  4918. GCC: (GNU) 4.1.1 (SDK420, $Rev: 3547 $)
  4919. GCC: (GNU) 4.1.1 (SDK420, $Rev: 3547 $)
  4920. GCC: (GNU) 4.1.1 (SDK420, $Rev: 3547 $)
  4921. GCC: (GNU) 4.1.1 (SDK420, $Rev: 3547 $)
  4922. GCC: (GNU) 4.1.1 (SDK420, $Rev: 3547 $)
  4923. GCC: (GNU) 4.1.1 (SDK420, $Rev: 3547 $)
  4924. GCC: (GNU) 4.1.1 (SDK420, $Rev: 3547 $)
  4925. GCC: (GNU) 4.1.1 (SDK420, $Rev: 3547 $)
  4926. GCC: (GNU) 4.1.1 (SDK420, $Rev: 3547 $)
  4927. GCC: (GNU) 4.1.1 (SDK420, $Rev: 3547 $)
  4928. GCC: (GNU) 4.1.1 (SDK420, $Rev: 3547 $)
  4929. GCC: (GNU) 4.1.1 (SDK420, $Rev: 3547 $)
  4930. GCC: (GNU) 4.1.1 (SDK420, $Rev: 3547 $)
  4931. GCC: (GNU) 4.1.1 (SDK420, $Rev: 3547 $)
  4932. GCC: (GNU) 4.1.1 (SDK420, $Rev: 3547 $)
  4933. GCC: (GNU) 4.1.1 (SDK420, $Rev: 3547 $)
  4934. GCC: (GNU) 4.1.1 (SDK420, $Rev: 3547 $)
  4935. GCC: (GNU) 4.1.1 (SDK420, $Rev: 3547 $)
  4936. GCC: (GNU) 4.1.1 (SDK420, $Rev: 3547 $)
  4937. GCC: (GNU) 4.1.1 (SDK420, $Rev: 3547 $)
  4938. GCC: (GNU) 4.1.1 (SDK420, $Rev: 3547 $)
  4939. GCC: (GNU) 4.1.1 (SDK420, $Rev: 3547 $)
  4940. GCC: (GNU) 4.1.1 (SDK420, $Rev: 3547 $)
  4941. GCC: (GNU) 4.1.1 (SDK420, $Rev: 3547 $)
  4942. GCC: (GNU) 4.1.1 (SDK420, $Rev: 3547 $)
  4943. .shstrtab
  4944. .text
  4945. .rodata
  4946. .ctors
  4947. .dtors
  4948. .data.rel.ro
  4949. .data
  4950. .opd
  4951. .got
  4952. .bss
  4953. .comment
  4954.  
  4955. SLL:gos_mode (%d)
  4956.   PS2 Emu setup faild: (%d)
  4957.   Guest OS load faild: (%d)
  4958.  load error
  4959. SLL:setup dispatcher done : %d
  4960.   Guest OS load failed : (%d)
  4961.  lpar auth id error
  4962. SLL:try drive auth ..
  4963.  drive setup for ps2 failed
  4964. SLL: load_gos done: %d
  4965.  SLL:unload_gos: lpar_id:%d
  4966.  flags: %llx
  4967.  SLL:delete_lpar_auth_id failed
  4968.  SLL:delete_lpar_auth_id %lu
  4969.  SLL:stop_dispatcher to lpar failed, continue.
  4970.  SLL:prepare to shutdown
  4971. SLL: destruct vuart in lpar:%d for service
  4972.   Destruct Service Port Failed: (%d), continue..
  4973. SLL: construct vuart in lpar:%d for service
  4974.   Construct Service Port Failed: (%d), continue..
  4975. gsboot: load_lv2: filename: %s
  4976. gsboot: load_lv2: lpar_id: %d laid: %d
  4977. SLL:fileloader load faild: %d
  4978. SLL:mmap  orig size: %lu
  4979. SLL:mmap  start address: %lu
  4980. SLL:mmap size: %lu
  4981. SLL:mmap faild: %d
  4982. SLL:mmap to %p
  4983. SLL: auth_lv2 called
  4984. SLL: auth_lv2 fail :%d
  4985. SLL: unmmap EA:%p
  4986. munmap: %d
  4987. SLL: deleting lpar_auth_id
  4988. laid
  4989. remove node: error status = %d
  4990. SLL: setting lpar_auth_id
  4991. create node: error status = %d
  4992. FL: release_buffer for allocate_memory
  4993. FL:munmap: %d
  4994. FL: release: %d addr: %p
  4995. SLL:main memory size: %lu : %lu
  4996. construct memory segment: error status = %d
  4997.    allocated lpar:%d address: %p
  4998. FL:mmap size: %lu
  4999. FL:mmap faild: %d
  5000. FL:mmap to %p
  5001. /rmt
  5002. /local_sys0
  5003. /flh
  5004. FL:vfs open error:%d :toolong
  5005. FL:vfs open error:%d :errno:%d
  5006. FL:vfs size error:%d
  5007. FL:lseek fail, and close fail:fd: %d
  5008. SL:allocate fail:size(%d)
  5009. FL:close fail:fd: %d
  5010. FL: vfs seek error:%d
  5011. FL: vfs size error:%d
  5012. FL:size error:%d  %d
  5013. FL:file loaded :%d
  5014. FL: conf_mgr init err
  5015. offset:%d size: %d
  5016. FL:read error:%d
  5017. /flh/os/
  5018. SL:signal: stop and signal
  5019. problem area: %p
  5020. SPU state:%lu
  5021. stop code = %u
  5022. SL:signal: handler_end
  5023.  * map data buffer:
  5024. /proc/partitions/%d/mem
  5025. couldn't open file...(%s)
  5026. mapped address: %p
  5027. mmap failed: errno = %d
  5028. close error:%d
  5029. SL:signal: spu timeout
  5030.  ----- signal has arrived -----
  5031. SL: timeout_handler:disable_spu_execution failed.
  5032. SL:signal: spu err
  5033. SL: err_handler:disable_spu_execution failed.
  5034. SL:signal: spu dma
  5035. SL: dma_handler:disable_spu_execution failed.
  5036. sleep...
  5037. SL:auth_lv2 shutdown
  5038. SL:SIGSPUSTOP:success
  5039. SL:SIGSPUSTOP:revoked
  5040. SL:SIGSPUSTOP:auth_id error
  5041. SL:SIGSPUSTOP:parameter error
  5042. SL:SIGSPUDMA: error
  5043. SL:SIGSPUTIMEOUT: error
  5044. SL: destruct logial spu error: %d
  5045. SL:auth_lv2 ret_value %d
  5046. # ss_dispatcher::terminate
  5047. select_with_retry : select errno=%d
  5048. # ss_dispatcher::loop
  5049. # ss_dispatcher::loop_once
  5050.  ## ss_dispatcher::loop_once : set sock=%d
  5051. !!! ss_dispatcher::loop_once : select error, r=%d
  5052. !!! ss_dispatcher::loop_once : sanity check error #1
  5053. !!! ss_dispatcher::loop_once : dispatcher_mgr::process_received return=%d
  5054. # ss_dispatcher::initialize
  5055. !!! ss_dispatcher::initialize : memory shortage
  5056. !!! ss_dispatcher::initialize : internal error r=%d
  5057.    # dispatcher_mgr::construct_vuart, la_id=%d, lpar_id=%d
  5058.    # dispatcher_mgr::construct_vuart, port_id=%u, socket=%d
  5059. !!! dispatcher_mgr::pme_received : sanity check error #1
  5060. !!! dispatcher_mgr::pme_received : receive error #2, r=%d
  5061.   # dispatcher_mgr::pme_received : pme_sock=%d => vuart_sock=%d.
  5062. !!! dispatcher_mgr::pme_received : send error, r=%d
  5063.   # dispatcher_mgr::pme_received : pme_sock=%d => vuart_sock=%d(destructed LPAR).
  5064. !!! dispatcher_mgr::pme_received : disconnect error, r=%d
  5065.   # dispatcher_mgr::api_received : api_sock=%d done.
  5066.  # dispatcher_mgr::read_vuart_null
  5067.   # dispatcher_mgr::read_vuart_null r=%d
  5068.  # dispatcher_mgr::reply_retval_only : retval=%d
  5069. !!! dispatcher_mgr::vuart_received : receive error, r=%d
  5070. !!! dispatcher_mgr::vuart_received : cannot map packet ID (0x%llx) to SS ID
  5071. !!! dispatcher_mgr::vuart_received : SPM internal error
  5072. !!! dispacher_mgr::vuart_received : access violation
  5073. !!! dispatcher_mgr::vuart_received : socket connect error, r=%d
  5074. !!! dispatcher_mgr::vuart_received : send error, r=%d
  5075.   # dispatcher_mgr::vuart_received, vuart_sock=%d => pme_sock=%d.
  5076.  # dispatcher_mgr::terminate
  5077. !!! dispatcher_mgr::terminate : io error #1
  5078. !!! dispatcher_mgr::terminate : io error #2
  5079. !!! dispatcher_mgr::terminate : sanity check error #1
  5080. !!! dispatcher_mgr::terminate : io error #3
  5081.  # dispatcher_mgr::init
  5082. !!! dispatcher_mgr::init : io error #1, r=%d
  5083.  # dispatcher_mgr::init_table
  5084.  # dispatcher_mgr::process_received : socket=%d
  5085. # dispatcher_mgr::process_received : unknown entry (%d)
  5086.    # dispatcher_mgr::destruct_vuart, lpar_id=%d
  5087. !!! dispatcher_mgr::destruct_vuart : sanity check error #1
  5088. !!! dispatcher_mgr::destruct_vuart : sanity check error #2
  5089.    # dispatcher_mgr::destruct_vuart, port_id=%u, socket=%d
  5090.  # port_id_table::function_id2port_id : func ID=0x%llx, portid=0x%llx
  5091. write_nbytes : write errno=%d
  5092. write : unexpected EOF.
  5093.  # vuart_pme::send
  5094.  # vuart_pme::send : write error (%d)
  5095. read_nbytes : read errno=%d
  5096. read_nbytes : unexpected EOF.
  5097.  # vuart_pme::disconnect
  5098. !!! vuart_pme::disconnect : destruct_virtual_uart, return=%u
  5099. !!! vuart_pme::disconnect : close failed (errno=%d)
  5100.  # vuart_pme::connect
  5101. !!! vuart_pme::connect : construct_virtual_uart, return=%u
  5102. /proc/partitions/%d/vuart/%d
  5103. !!! vuart_pme::connect : "%s" open failed (errno=%d)
  5104.  # vuart_pme::connect : socket=%d, lparid=0x%llx, portid=0x%llx
  5105.  # vuart_pme::receive
  5106.  # vuart_pme::receive : read error (%d)
  5107. ros0
  5108. ros1
  5109. composite_region::read(0x%llx, %lld, 0x%llx)
  5110. composite_region::allocate_buffer(%lld)
  5111. composite_region::release_buffer(0x%llx)
  5112. composite_region::cache_all_composite_region_entry()
  5113.         offset = %d
  5114.         header is not cached
  5115.         entry is not cached
  5116. composite_region::get_composite_region_entry_by_index(%d, 0x%llx)
  5117. composite_region::writev()
  5118. blksize = 0x%llx, mask = 0x%llx
  5119. iovec[%d].offset = 0x%llx
  5120. iovec[%d].size = 0x%llx
  5121. iovec[%d].buf = 0x%llx
  5122. [%d] align_offset = 0x%llx
  5123. writev(): flush previous data (0x%llx)
  5124. writev(): read initial data (0x%llx)
  5125. writev(): flush last data (0x%llx)
  5126. OS_BANK:0x%llx, 0x%llx
  5127. OS_BANK repository error:0x%llx
  5128. PRG_RVK_BANK:0x%llx, 0x%llx
  5129. PRG_RVK_BANK repository error:0x%llx
  5130. PKG_RVK_BANK:0x%llx, 0x%llx
  5131. PKG_RVK_BANK repository error:0x%llx
  5132. bank_manager::get_repository_value(m_type = %d)
  5133. settle value mismatched. 0x%llx : 0x%llx
  5134. bank_manager::setup(%d)
  5135. bank repository found
  5136. bank repository not found
  5137.  !!! if_proto::send_receive error : cannot find port ID for function_id=0x%x
  5138.  # if_proto::send_receive : port_id=%llu
  5139.  !!! if_proto::send_receive error : cannot connect port=%u
  5140.  # pme_client::receive : PID=%u
  5141.  # pme_client::disconnect : PID=%u
  5142. !!! pme_client::disconnect : close failed (errno=%d)
  5143.  # pme_client::connect : PID=%u, portid=%u
  5144. !!! pme_client:connect : socket failed (errno=%d)
  5145. !!! pme_client::connect : connect failed (port_id=%u, errno=%d)
  5146.  # pme_client::send : PID=%u
  5147.  # pme_server::disconnect : PID=%u
  5148. !!! pme_server::disconnect : close failed (errno=%d)
  5149.  # pme_server::force_close : PID=%u
  5150.  # pme_server::reply : PID=%u
  5151. !!! pme_server::reply : close failed (errno=%d)
  5152.  # pme_server::accept : PID=%u
  5153. !!! pme_server::accept : accept failed (errno=%d)
  5154. !!! pme_server::accept : read_nbytes failed (return=%d)
  5155.  # pme_server::connect : PID=%u, port_id=%u
  5156. !!! pme_server::connect : socket failed (errno=%d)
  5157. !!! pme_server::connect : bind failed (errno=%d)
  5158. !!! pme_server::connect : listen failed (errno=%d)
  5159. !!! page_bytestring::free_page : unmap_pages failed, page_addr=%p
  5160. !!! page_bytestring::alloc_page : map_pages failed, page_num=%u
  5161. packet_id: 0x%llx
  5162. function_id: 0x%llx
  5163. retval: 0x%x
  5164. subject_id: (0x%llx,0x%llx)
  5165.     # ss_packet::send_receive (CLIENT) : func_id=0x%llx, packet_id=0x%llx, subject_id=(0x%llx,0x%llx)
  5166.     # ss_packet::process_async : packet_id=0x%llx
  5167.  # ss_packet::process_received (SERVER) : sock=%d
  5168. !!! ss_packet::process_received (SERVER) error: packet format error (broken?)
  5169.   # ss_packet::process_received (SERVER) : packet_id=0x%llx, subject_id=(0x%llx,0x%llx)
  5170. !!! ss_packet::process_received (SERVER) error: unknown packet
  5171.     # ss_packet::process_received (SERVER) error: port table inconsistent
  5172.  # ss_packet::accept_reply : accept done. sock=%d
  5173. ss_id_attribute[%d] in ss_id_defs.h is invalid.
  5174. In security_policy_manager::request:
  5175. {0x%llx, 0x%llx}, 0x%llx
  5176. security_policy_manager::initialize
  5177. is not called
  5178. m_acm is NULL
  5179. SS ID %lld is invalid
  5180. In security_policy_manager::request: access_control_if::lookup failed: ret = %d, (default deny)
  5181. In security_policy_manager::request: access_control_if::lookup failed: ret = %d
  5182. true
  5183. false
  5184. result: %s
  5185. In security_policy_manager::register_rule:
  5186. entry is NULL
  5187. action %lld is invalid
  5188. cannot specify internal service in SPP
  5189. cannot specify default rule in SPP
  5190. access_control_if::add_entry failed:
  5191. In security_policy_manager::load_additional_policy:
  5192. security_policy_manager::initialize is not called
  5193. SCE_CELLOS_SS_SPM
  5194. secure_profile_loader_if::get_contents_size
  5195. new failed
  5196. secure_profile_loader_if::get_contents
  5197. read_size %d != size %d
  5198. In security_policy_manager::load_additional_policy: received acm:
  5199. 0x%02x
  5200. In security_policy_manager::
  5201. load_additional_policy:
  5202. register_rule failed: ret = %d
  5203. access_control_if::cancel_changes
  5204. access_control_if::commit_changes failed:
  5205. In security_policy_manager::load_internal_policy:
  5206. already initialized. why call me?
  5207. m_internal is NULL
  5208. access_control_if::initialize failed:
  5209. load_internal_policy:
  5210. register_rule failed,
  5211. access_control_if::commit_changes
  5212. In security_policy_manager::initialize:
  5213. initialize is already called
  5214. security_policy_manager::load_internal_policy
  5215. In ss_init_repository::get_node_value:
  5216.         name:   {
  5217. 0x%llx,
  5218. 0x%llx}
  5219. timeout occured
  5220. get_repository_node_value succeeded
  5221.         value:  {
  5222. In ss_init_repository::get_node_value:
  5223. remove_repository_node failed
  5224. In ss_init_repository::create_node:
  5225. creating...
  5226. create_repository_node succeeded
  5227. In ss_init_repository::create_node:
  5228. create_repository_node failed
  5229. In entry::remove_from_queue: head() returns NULL
  5230. In entry::remove_from_queue: not found
  5231. In entry::remove_from_mngq:
  5232. listhead must not be NULL
  5233. In entry::remove_from_mngq: not found
  5234. In entry::insert_to_mngq: head must not be NULL
  5235. In entry::insert_to_mngq: already in mngq
  5236. In access_control_if::get_acm_entry_num:
  5237. not initialized
  5238. invalid section: %d
  5239. In access_control_if::cleanup_rule_entry:
  5240. entry::remove_from_mngq failed: ret = %d
  5241. entry::remove_from_queue failed: ret = %d
  5242. access_control_if::get_memory(%d)
  5243. get_memory: no more memory... call pme_malloc()
  5244. In access_control_if::remove_rule_entry_list:
  5245. object_entry::get_rule_entry_list_head failed:
  5246. In access_control_if::
  5247. remove_rule_entry_list:
  5248. entry::insert_to_mngq failed:
  5249. In access_control_if::remove_object_rule_entry:
  5250. access_control_if::remove_rule_entry_list failed:
  5251. In access_control_if::copy_all_rule_of_section:
  5252. oe is NULL
  5253. object_entry::get_rule_entry_list_head
  5254. In access_control_if::get_acm:
  5255. access_control_if::copy_all_rule_of_section
  5256. buffer should not be NULL
  5257. nentry should be greater than or equal to
  5258. %llu
  5259. object_hashtable::get_first_object_entry failed:
  5260. access_control_if::copy_all_rule
  5261. object_hashtable::get_next_object_entry
  5262. In access_control_if::remove_object_entry:
  5263. object_hashtable::get_object_entry failed:
  5264. there is no object in NORMAL state
  5265. access_control_if::
  5266. remove_object_rule_entry failed: ret = %d
  5267. In access_control_if::lookup:
  5268. object_hashtable::get_object_entry
  5269. returns NULL object_entry
  5270. object_entry::match_rule_entry failed:
  5271. In access_control_if::cleanup_object_entry:
  5272. object_hashtable::remove_object_entry failed:
  5273. In access_control_if::register_new_rule: oe is NULL
  5274. In access_control_if::register_new_rule: new failed
  5275. In access_control_if::register_new_rule:
  5276. object_entry::add_rule_entry failed: ret = %d
  5277. entry::insert_to_mngq failed: ret = %d
  5278. section broken?
  5279. In access_control_if::register_new_object:
  5280. oe is not NULL
  5281. object_hashtable::add_object_entry failed:
  5282. In access_control_if::add_entry:
  5283. entry must not NULL
  5284. mask should not be {0, 0}
  5285. if the section is PRIMARY, SECONDARY
  5286. or TERTIARY
  5287. mask should be {0, 0}
  5288. if the section is DEFAULT
  5289. access_control_if::register_new_object
  5290. In access_control_if::add_entry: oe is NULL
  5291. access_control_if::register_new_rule failed:
  5292. In access_control_if::initialize:
  5293. already initialized
  5294. expected_object_num should not be 0
  5295. object_hashtable::initialize failed:
  5296. In access_control_if::initialize: initialized
  5297. In access_control_if::initialize: new failed
  5298. In access_control_if::remove_entry:
  5299. mask should not be {0, 0}
  5300. In access_control_if::remove_entry: oe is NULL
  5301. object_entry::get_rule_entry failed: ret = %d
  5302. In access_control_if::remove_entry: re is NULL
  5303. there is no rule in NORMAL state
  5304. In access_control_if::add_entry: section broken?
  5305. In access_control_if::remove_all_entry:
  5306. remove_all_entry:
  5307. remove_object_rule_entry failed:
  5308. no rule is registered
  5309. In access_control_if::commit_changes:
  5310. there is no entry
  5311. invalid m_primary_mngq_num:
  5312. invalid m_secondary_mngq_num:
  5313. invalid m_tertiary_mngq_num:
  5314. invalid m_default_mngq_num:
  5315. invalid state (%d) elememnt in mngq
  5316. In access_control_if::cancel_changes:
  5317. In object_entry::get_rule_entry_list_head:
  5318. In object_entry::add_rule_entry:
  5319. elem should not be NULL
  5320. elem is already registered
  5321. In object_hashtable::get_first_object_entry:
  5322. In object_hashtable::get_object_entry:
  5323. In object_hashtable::initialize:
  5324. In object_hashtable::initialize: m_table is NULL
  5325. In object_hashtable::remove_object_entry:
  5326. elem->head() is NULL
  5327. object_entry not found, list is broken?
  5328. In object_hashtable::get_next_object_entry:
  5329. In object_hashtable::add_object_entry:
  5330. DEFAULT.SPP
  5331. 0123456789abcdef
  5332. 0123456789ABCDEF
  5333. (null)
  5334. max system bytes = %10lu
  5335. system bytes     = %10lu
  5336. in use bytes     = %10lu
  5337. /dev/rflash
  5338. /dev/eflash
  5339. /_init_storage/
  5340. /dev/flash_num
  5341. GCC: (GNU) 4.1.1 (SDK420, $Rev: 3547 $)
  5342. GCC: (GNU) 4.1.1 (SDK420, $Rev: 3547 $)
  5343. GCC: (GNU) 4.1.1 (SDK420, $Rev: 3547 $)
  5344. GCC: (GNU) 4.1.1 (SDK420, $Rev: 3547 $)
  5345. GCC: (GNU) 4.1.1 (SDK420, $Rev: 3547 $)
  5346. GCC: (GNU) 4.1.1 (SDK420, $Rev: 3547 $)
  5347. GCC: (GNU) 4.1.1 (SDK420, $Rev: 3547 $)
  5348. GCC: (GNU) 4.1.1 (SDK420, $Rev: 3547 $)
  5349. GCC: (GNU) 4.1.1 (SDK420, $Rev: 3547 $)
  5350. GCC: (GNU) 4.1.1 (SDK420, $Rev: 3547 $)
  5351. GCC: (GNU) 4.1.1 (SDK420, $Rev: 3547 $)
  5352. GCC: (GNU) 4.1.1 (SDK420, $Rev: 3547 $)
  5353. GCC: (GNU) 4.1.1 (SDK420, $Rev: 3547 $)
  5354. GCC: (GNU) 4.1.1 (SDK420, $Rev: 3547 $)
  5355. GCC: (GNU) 4.1.1 (SDK420, $Rev: 3547 $)
  5356. GCC: (GNU) 4.1.1 (SDK420, $Rev: 3547 $)
  5357. GCC: (GNU) 4.1.1 (SDK420, $Rev: 3547 $)
  5358. GCC: (GNU) 4.1.1 (SDK420, $Rev: 3547 $)
  5359. GCC: (GNU) 4.1.1 (SDK420, $Rev: 3547 $)
  5360. GCC: (GNU) 4.1.1 (SDK420, $Rev: 3547 $)
  5361. GCC: (GNU) 4.1.1 (SDK420, $Rev: 3547 $)
  5362. GCC: (GNU) 4.1.1 (SDK420, $Rev: 3547 $)
  5363. GCC: (GNU) 4.1.1 (SDK420, $Rev: 3547 $)
  5364. GCC: (GNU) 4.1.1 (SDK420, $Rev: 3547 $)
  5365. GCC: (GNU) 4.1.1 (SDK420, $Rev: 3547 $)
  5366. GCC: (GNU) 4.1.1 (SDK420, $Rev: 3547 $)
  5367. GCC: (GNU) 4.1.1 (SDK420, $Rev: 3547 $)
  5368. GCC: (GNU) 4.1.1 (SDK420, $Rev: 3547 $)
  5369. GCC: (GNU) 4.1.1 (SDK420, $Rev: 3547 $)
  5370. GCC: (GNU) 4.1.1 (SDK420, $Rev: 3547 $)
  5371. GCC: (GNU) 4.1.1 (SDK420, $Rev: 3547 $)
  5372. GCC: (GNU) 4.1.1 (SDK420, $Rev: 3547 $)
  5373. GCC: (GNU) 4.1.1 (SDK420, $Rev: 3547 $)
  5374. GCC: (GNU) 4.1.1 (SDK420, $Rev: 3547 $)
  5375. GCC: (GNU) 4.1.1 (SDK420, $Rev: 3547 $)
  5376. GCC: (GNU) 4.1.1 (SDK420, $Rev: 3547 $)
  5377. GCC: (GNU) 4.1.1 (SDK420, $Rev: 3547 $)
  5378. GCC: (GNU) 4.1.1 (SDK420, $Rev: 3547 $)
  5379. GCC: (GNU) 4.1.1 (SDK420, $Rev: 3547 $)
  5380. GCC: (GNU) 4.1.1 (SDK420, $Rev: 3547 $)
  5381. GCC: (GNU) 4.1.1 (SDK420, $Rev: 3547 $)
  5382. GCC: (GNU) 4.1.1 (SDK420, $Rev: 3547 $)
  5383. GCC: (GNU) 4.1.1 (SDK420, $Rev: 3547 $)
  5384. GCC: (GNU) 4.1.1 (SDK420, $Rev: 3547 $)
  5385. GCC: (GNU) 4.1.1 (SDK420, $Rev: 3547 $)
  5386. GCC: (GNU) 4.1.1 (SDK420, $Rev: 3547 $)
  5387. GCC: (GNU) 4.1.1 (SDK420, $Rev: 3547 $)
  5388. GCC: (GNU) 4.1.1 (SDK420, $Rev: 3547 $)
  5389. GCC: (GNU) 4.1.1 (SDK420, $Rev: 3547 $)
  5390. GCC: (GNU) 4.1.1 (SDK420, $Rev: 3547 $)
  5391. GCC: (GNU) 4.1.1 (SDK420, $Rev: 3547 $)
  5392. GCC: (GNU) 4.1.1 (SDK420, $Rev: 3547 $)
  5393. GCC: (GNU) 4.1.1 (SDK420, $Rev: 3547 $)
  5394. GCC: (GNU) 4.1.1 (SDK420, $Rev: 3547 $)
  5395. GCC: (GNU) 4.1.1 (SDK420, $Rev: 3547 $)
  5396. GCC: (GNU) 4.1.1 (SDK420, $Rev: 3547 $)
  5397. GCC: (GNU) 4.1.1 (SDK420, $Rev: 3547 $)
  5398. GCC: (GNU) 4.1.1 (SDK420, $Rev: 3547 $)
  5399. GCC: (GNU) 4.1.1 (SDK420, $Rev: 3547 $)
  5400. GCC: (GNU) 4.1.1 (SDK420, $Rev: 3547 $)
  5401. GCC: (GNU) 4.1.1 (SDK420, $Rev: 3547 $)
  5402. GCC: (GNU) 4.1.1 (SDK420, $Rev: 3547 $)
  5403. GCC: (GNU) 4.1.1 (SDK420, $Rev: 3547 $)
  5404. GCC: (GNU) 4.1.1 (SDK420, $Rev: 3547 $)
  5405. GCC: (GNU) 4.1.1 (SDK420, $Rev: 3547 $)
  5406. GCC: (GNU) 4.1.1 (SDK420, $Rev: 3547 $)
  5407. GCC: (GNU) 4.1.1 (SDK420, $Rev: 3547 $)
  5408. GCC: (GNU) 4.1.1 (SDK420, $Rev: 3547 $)
  5409. GCC: (GNU) 4.1.1 (SDK420, $Rev: 3547 $)
  5410. GCC: (GNU) 4.1.1 (SDK420, $Rev: 3547 $)
  5411. GCC: (GNU) 4.1.1 (SDK420, $Rev: 3547 $)
  5412. GCC: (GNU) 4.1.1 (SDK420, $Rev: 3547 $)
  5413. GCC: (GNU) 4.1.1 (SDK420, $Rev: 3547 $)
  5414. GCC: (GNU) 4.1.1 (SDK420, $Rev: 3547 $)
  5415. GCC: (GNU) 4.1.1 (SDK420, $Rev: 3547 $)
  5416. GCC: (GNU) 4.1.1 (SDK420, $Rev: 3547 $)
  5417. GCC: (GNU) 4.1.1 (SDK420, $Rev: 3547 $)
  5418. GCC: (GNU) 4.1.1 (SDK420, $Rev: 3547 $)
  5419. GCC: (GNU) 4.1.1 (SDK420, $Rev: 3547 $)
  5420. GCC: (GNU) 4.1.1 (SDK420, $Rev: 3547 $)
  5421. GCC: (GNU) 4.1.1 (SDK420, $Rev: 3547 $)
  5422. GCC: (GNU) 4.1.1 (SDK420, $Rev: 3547 $)
  5423. GCC: (GNU) 4.1.1 (SDK420, $Rev: 3547 $)
  5424. GCC: (GNU) 4.1.1 (SDK420, $Rev: 3547 $)
  5425. GCC: (GNU) 4.1.1 (SDK420, $Rev: 3547 $)
  5426. GCC: (GNU) 4.1.1 (SDK420, $Rev: 3547 $)
  5427. GCC: (GNU) 4.1.1 (SDK420, $Rev: 3547 $)
  5428. GCC: (GNU) 4.1.1 (SDK420, $Rev: 3547 $)
  5429. GCC: (GNU) 4.1.1 (SDK420, $Rev: 3547 $)
  5430. GCC: (GNU) 4.1.1 (SDK420, $Rev: 3547 $)
  5431. GCC: (GNU) 4.1.1 (SDK420, $Rev: 3547 $)
  5432. GCC: (GNU) 4.1.1 (SDK420, $Rev: 3547 $)
  5433. GCC: (GNU) 4.1.1 (SDK420, $Rev: 3547 $)
  5434. GCC: (GNU) 4.1.1 (SDK420, $Rev: 3547 $)
  5435. GCC: (GNU) 4.1.1 (SDK420, $Rev: 3547 $)
  5436. GCC: (GNU) 4.1.1 (SDK420, $Rev: 3547 $)
  5437. GCC: (GNU) 4.1.1 (SDK420, $Rev: 3547 $)
  5438. GCC: (GNU) 4.1.1 (SDK420, $Rev: 3547 $)
  5439. GCC: (GNU) 4.1.1 (SDK420, $Rev: 3547 $)
  5440. .shstrtab
  5441. .text
  5442. .rodata
  5443. .ctors
  5444. .dtors
  5445. .data.rel.ro
  5446. .data
  5447. .opd
  5448. .got
  5449. .bss
  5450. .comment
  5451. .unknown
RAW Paste Data
We use cookies for various purposes including analytics. By continuing to use Pastebin, you agree to our use of cookies as described in the Cookies Policy. OK, I Understand
 
Top