Guest User

Nvidia-470xx-dkms AUR linux-7.2.2-arch1-1

a guest
Aug 31st, 2026
102
0
Never
Not a member of Pastebin yet? Sign Up, it unlocks many cool features!
text 12.93 KB | None | 0 0
  1. DKMS (dkms-3.4.3) make.log for nvidia/470.256.02 for kernel 7.2.2-arch1-1 (x86_64)
  2. Mon Aug 31 07:03:25 PM IST 2026
  3.  
  4. Building module(s)
  5. # command: 'make' -j4 IGNORE_PREEMPT_RT_PRESENCE=1 NV_EXCLUDE_BUILD_MODULES='__EXCLUDE_MODULES' KERNEL_UNAME=7.2.2-arch1-1 IGNORE_CC_MISMATCH='__IGNORE_CC_MISMATCH' modules
  6. make[1]: Entering directory '/usr/lib/modules/7.2.2-arch1-1/build'
  7. make[2]: Entering directory '/var/lib/dkms/nvidia/470.256.02/build'
  8. SYMLINK nvidia/nv-kernel.o
  9. SYMLINK nvidia-modeset/nv-modeset-kernel.o
  10. CONFTEST: hash__remap_4k_pfn
  11. CONFTEST: set_pages_uc
  12. CONFTEST: list_is_first
  13. CONFTEST: set_memory_uc
  14. CONFTEST: set_memory_array_uc
  15. CONFTEST: set_pages_array_uc
  16. CONFTEST: acquire_console_sem
  17. CONFTEST: console_lock
  18. CONFTEST: ioremap_cache
  19. CONFTEST: ioremap_wc
  20. CONFTEST: acpi_walk_namespace
  21. CONFTEST: sg_alloc_table
  22. CONFTEST: pci_get_domain_bus_and_slot
  23. CONFTEST: get_num_physpages
  24. CONFTEST: efi_enabled
  25. CONFTEST: pde_data
  26. CONFTEST: PDE_DATA
  27. CONFTEST: proc_remove
  28. CONFTEST: pm_vt_switch_required
  29. CONFTEST: xen_ioemu_inject_msi
  30. CONFTEST: phys_to_dma
  31. CONFTEST: get_dma_ops
  32. CONFTEST: dma_attr_macros
  33. CONFTEST: dma_map_page_attrs
  34. CONFTEST: write_cr4
  35. CONFTEST: of_get_property
  36. CONFTEST: of_find_node_by_phandle
  37. CONFTEST: of_node_to_nid
  38. CONFTEST: pnv_pci_get_npu_dev
  39. CONFTEST: of_get_ibm_chip_id
  40. CONFTEST: node_end_pfn
  41. CONFTEST: pci_bus_address
  42. CONFTEST: pci_stop_and_remove_bus_device
  43. CONFTEST: pci_remove_bus_device
  44. CONFTEST: register_cpu_notifier
  45. CONFTEST: cpuhp_setup_state
  46. CONFTEST: dma_map_resource
  47. CONFTEST: backlight_device_register
  48. CONFTEST: get_backlight_device_by_name
  49. CONFTEST: timer_setup
  50. CONFTEST: pci_enable_msix_range
  51. CONFTEST: kernel_read_has_pointer_pos_arg
  52. CONFTEST: kernel_write
  53. CONFTEST: kthread_create_on_node
  54. CONFTEST: of_find_matching_node
  55. CONFTEST: dev_is_pci
  56. CONFTEST: dma_direct_map_resource
  57. CONFTEST: tegra_get_platform
  58. CONFTEST: tegra_bpmp_send_receive
  59. CONFTEST: flush_cache_all
  60. CONFTEST: vmf_insert_pfn
  61. CONFTEST: jiffies_to_timespec
  62. CONFTEST: ktime_get_raw_ts64
  63. CONFTEST: ktime_get_real_ts64
  64. CONFTEST: full_name_hash
  65. CONFTEST: hlist_for_each_entry
  66. CONFTEST: pci_enable_atomic_ops_to_root
  67. CONFTEST: vga_tryget
  68. CONFTEST: pgprot_decrypted
  69. CONFTEST: cc_mkdec
  70. CONFTEST: iterate_fd
  71. CONFTEST: seq_read_iter
  72. CONFTEST: sg_page_iter_page
  73. CONFTEST: follow_pfn
  74. CONFTEST: drm_gem_object_get
  75. CONFTEST: drm_gem_object_put_unlocked
  76. CONFTEST: set_close_on_exec
  77. CONFTEST: dma_set_coherent_mask
  78. CONFTEST: acpi_bus_get_device
  79. CONFTEST: get_task_ioprio
  80. CONFTEST: address_space_init_once
  81. CONFTEST: kbasename
  82. CONFTEST: vzalloc
  83. CONFTEST: wait_on_bit_lock_argument_count
  84. CONFTEST: bitmap_clear
  85. CONFTEST: usleep_range
  86. CONFTEST: radix_tree_empty
  87. CONFTEST: radix_tree_replace_slot
  88. CONFTEST: pnv_npu2_init_context
  89. CONFTEST: cpumask_of_node
  90. CONFTEST: acpi_video_backlight_use_native
  91. CONFTEST: drm_dev_unref
  92. CONFTEST: drm_reinit_primary_mode_group
  93. CONFTEST: get_user_pages_remote
  94. CONFTEST: get_user_pages
  95. CONFTEST: drm_gem_object_lookup
  96. CONFTEST: drm_atomic_state_ref_counting
  97. CONFTEST: drm_driver_has_gem_prime_res_obj
  98. CONFTEST: drm_atomic_helper_connector_dpms
  99. CONFTEST: drm_connector_funcs_have_mode_in_name
  100. CONFTEST: drm_framebuffer_get
  101. CONFTEST: drm_dev_put
  102. CONFTEST: drm_format_num_planes
  103. CONFTEST: drm_connector_for_each_possible_encoder
  104. CONFTEST: drm_rotation_available
  105. CONFTEST: drm_vma_offset_exact_lookup_locked
  106. CONFTEST: is_export_symbol_gpl_of_node_to_nid
  107. CONFTEST: is_export_symbol_gpl_sme_active
  108. CONFTEST: is_export_symbol_present_swiotlb_map_sg_attrs
  109. CONFTEST: is_export_symbol_present_swiotlb_dma_ops
  110. CONFTEST: is_export_symbol_present___close_fd
  111. CONFTEST: is_export_symbol_present_close_fd
  112. CONFTEST: is_export_symbol_present_get_unused_fd
  113. CONFTEST: is_export_symbol_present_get_unused_fd_flags
  114. CONFTEST: is_export_symbol_present_nvhost_get_default_device
  115. CONFTEST: is_export_symbol_present_nvhost_syncpt_unit_interface_get_byte_offset
  116. CONFTEST: is_export_symbol_present_nvhost_syncpt_unit_interface_get_aperture
  117. CONFTEST: is_export_symbol_present_tegra_dce_register_ipc_client
  118. CONFTEST: is_export_symbol_present_tegra_dce_unregister_ipc_client
  119. CONFTEST: is_export_symbol_present_tegra_dce_client_ipc_send_recv
  120. CONFTEST: is_export_symbol_present_dram_clk_to_mc_clk
  121. CONFTEST: is_export_symbol_present_get_dram_num_channels
  122. CONFTEST: is_export_symbol_present_tegra_dram_types
  123. CONFTEST: is_export_symbol_present_screen_info
  124. CONFTEST: is_export_symbol_gpl_screen_info
  125. CONFTEST: is_export_symbol_present_kthread_create_on_node
  126. CONFTEST: acpi_op_remove
  127. CONFTEST: file_operations
  128. CONFTEST: file_inode
  129. CONFTEST: kuid_t
  130. CONFTEST: dma_ops
  131. CONFTEST: swiotlb_dma_ops
  132. CONFTEST: noncoherent_swiotlb_dma_ops
  133. CONFTEST: vm_fault_has_address
  134. CONFTEST: backlight_properties_type
  135. CONFTEST: vm_insert_pfn_prot
  136. CONFTEST: vmf_insert_pfn_prot
  137. CONFTEST: vm_ops_fault_removed_vma_arg
  138. CONFTEST: vmbus_channel_has_ringbuffer_page
  139. CONFTEST: device_driver_of_match_table
  140. CONFTEST: device_of_node
  141. CONFTEST: node_states_n_memory
  142. CONFTEST: kmem_cache_has_kobj_remove_work
  143. CONFTEST: sysfs_slab_unlink
  144. CONFTEST: proc_ops
  145. CONFTEST: timespec64
  146. CONFTEST: vmalloc_has_pgprot_t_arg
  147. CONFTEST: acpi_fadt_low_power_s0
  148. CONFTEST: mm_has_mmap_lock
  149. CONFTEST: num_registered_fb
  150. CONFTEST: pci_channel_state
  151. CONFTEST: vm_area_struct_has_const_vm_flags
  152. CONFTEST: address_space
  153. CONFTEST: backing_dev_info
  154. CONFTEST: mm_context_t
  155. CONFTEST: vm_fault_t
  156. CONFTEST: mmu_notifier_ops_invalidate_range
  157. CONFTEST: drm_bus_present
  158. CONFTEST: drm_bus_has_bus_type
  159. CONFTEST: drm_bus_has_get_irq
  160. CONFTEST: drm_bus_has_get_name
  161. CONFTEST: drm_driver_has_device_list
  162. CONFTEST: drm_driver_has_legacy_dev_list
  163. CONFTEST: drm_driver_has_set_busid
  164. CONFTEST: drm_crtc_state_has_connectors_changed
  165. CONFTEST: drm_init_function_args
  166. CONFTEST: drm_helper_mode_fill_fb_struct
  167. CONFTEST: drm_master_drop_has_from_release_arg
  168. CONFTEST: drm_driver_unload_has_int_return_type
  169. CONFTEST: drm_atomic_helper_crtc_destroy_state_has_crtc_arg
  170. CONFTEST: drm_atomic_helper_plane_destroy_state_has_plane_arg
  171. CONFTEST: drm_mode_object_find_has_file_priv_arg
  172. CONFTEST: dma_buf_owner
  173. CONFTEST: drm_connector_list_iter
  174. CONFTEST: drm_atomic_helper_swap_state_has_stall_arg
  175. CONFTEST: drm_driver_prime_flag_present
  176. CONFTEST: drm_gem_object_has_resv
  177. CONFTEST: drm_crtc_state_has_async_flip
  178. CONFTEST: drm_crtc_state_has_pageflip_flags
  179. CONFTEST: drm_format_modifiers_present
  180. CONFTEST: drm_vma_node_is_allowed_has_tag_arg
  181. CONFTEST: drm_vma_offset_node_has_readonly
  182. CONFTEST: drm_display_mode_has_vrefresh
  183. CONFTEST: drm_driver_master_set_has_int_return_type
  184. CONFTEST: drm_driver_has_gem_free_object
  185. CONFTEST: drm_prime_pages_to_sg_has_drm_device_arg
  186. CONFTEST: drm_driver_has_gem_prime_callbacks
  187. CONFTEST: drm_crtc_atomic_check_has_atomic_state_arg
  188. CONFTEST: drm_gem_object_vmap_has_map_arg
  189. CONFTEST: drm_plane_atomic_check_has_atomic_state_arg
  190. CONFTEST: drm_device_has_pdev
  191. CONFTEST: drm_mode_config_has_allow_fb_modifiers
  192. CONFTEST: dma_resv_add_fence
  193. CONFTEST: dma_resv_reserve_fences
  194. CONFTEST: reservation_object_reserve_shared_has_num_fences_arg
  195. CONFTEST: drm_connector_has_override_edid
  196. CONFTEST: drm_driver_has_dumb_destroy
  197. CONFTEST: drm_unlocked_ioctl_flag_present
  198. CONFTEST: dom0_kernel_present
  199. CONFTEST: nvidia_vgpu_kvm_build
  200. CONFTEST: nvidia_grid_build
  201. CONFTEST: nvidia_grid_csp_build
  202. CONFTEST: pm_runtime_available
  203. CONFTEST: pci_class_multimedia_hd_audio
  204. CONFTEST: drm_available
  205. CONFTEST: drm_atomic_available
  206. CONFTEST: is_export_symbol_gpl_refcount_inc
  207. CONFTEST: is_export_symbol_gpl_refcount_dec_and_test
  208. CONFTEST: drm_alpha_blending_available
  209. CONFTEST: is_export_symbol_present_drm_gem_prime_fd_to_handle
  210. CONFTEST: is_export_symbol_present_drm_gem_prime_handle_to_fd
  211. CONFTEST: ib_peer_memory_symbols
  212. CC [M] nvidia/nv.o
  213. CC [M] nvidia/nv-pci.o
  214. CC [M] nvidia/nv-acpi.o
  215. CC [M] nvidia/nv-cray.o
  216. CC [M] nvidia/nv-dma.o
  217. nvidia/nv.c:739:12: warning: no previous prototype for ‘nvidia_init_module’ [-Wmissing-prototypes]
  218. 739 | int __init nvidia_init_module(void)
  219. | ^~~~~~~~~~~~~~~~~~
  220. nvidia/nv.c:860:6: warning: no previous prototype for ‘nvidia_exit_module’ [-Wmissing-prototypes]
  221. 860 | void nvidia_exit_module(void)
  222. | ^~~~~~~~~~~~~~~~~~
  223. nvidia/nv.c:1263:23: warning: no previous prototype for ‘nv_get_num_dpaux_instances’ [-Wmissing-prototypes]
  224. 1263 | NV_STATUS NV_API_CALL nv_get_num_dpaux_instances(nv_state_t *nv, NvU32 *num_instances)
  225. | ^~~~~~~~~~~~~~~~~~~~~~~~~~
  226. nvidia/nv.c:3660:13: warning: no previous prototype for ‘nv_firmware_path’ [-Wmissing-prototypes]
  227. 3660 | const char *nv_firmware_path(
  228. | ^~~~~~~~~~~~~~~~
  229. CC [M] nvidia/nv-i2c.o
  230. CC [M] nvidia/nv-mmap.o
  231. nvidia/nv-dma.c:269:6: warning: no previous prototype for ‘nv_load_dma_map_scatterlist’ [-Wmissing-prototypes]
  232. 269 | void nv_load_dma_map_scatterlist(
  233. | ^~~~~~~~~~~~~~~~~~~~~~~~~~~
  234. nvidia/nv-dma.c:465:23: warning: no previous prototype for ‘nv_dma_unmap_sgt’ [-Wmissing-prototypes]
  235. 465 | NV_STATUS NV_API_CALL nv_dma_unmap_sgt(
  236. | ^~~~~~~~~~~~~~~~
  237. nvidia/nv-dma.c:970:9: warning: ‘IMPORT_SGT_STUBS_NEEDED’ redefined
  238. 970 | #define IMPORT_SGT_STUBS_NEEDED 0
  239. | ^~~~~~~~~~~~~~~~~~~~~~~
  240. nvidia/nv-dma.c:964:9: note: this is the location of the previous definition
  241. 964 | #define IMPORT_SGT_STUBS_NEEDED 1
  242. | ^~~~~~~~~~~~~~~~~~~~~~~
  243. CC [M] nvidia/nv-p2p.o
  244. CC [M] nvidia/nv-pat.o
  245. nvidia/nv-mmap.c:302:5: warning: conflicting types for ‘nv_encode_caching’ due to enum/integer mismatch; have ‘int(pgprot_t *, NvU32, nv_memory_type_t)’ {aka ‘int(struct pgprot *, unsigned int, nv_memory_type_t)’} [-Wenum-int-mismatch]
  246. 302 | int nv_encode_caching(
  247. | ^~~~~~~~~~~~~~~~~
  248. In file included from ././common/inc/nv-linux.h:1796,
  249. from nvidia/nv-mmap.c:14:
  250. ././common/inc/nv-proto.h:40:13: note: previous declaration of ‘nv_encode_caching’ with type ‘int(pgprot_t *, NvU32, NvU32)’ {aka ‘int(struct pgprot *, unsigned int, unsigned int)’}
  251. 40 | int nv_encode_caching (pgprot_t *, NvU32, NvU32);
  252. | ^~~~~~~~~~~~~~~~~
  253. nvidia/nv-mmap.c:363:1: warning: ‘static’ is not at beginning of declaration [-Wold-style-declaration]
  254. 363 | int static nvidia_mmap_peer_io(
  255. | ^~~
  256. nvidia/nv-mmap.c:384:1: warning: ‘static’ is not at beginning of declaration [-Wold-style-declaration]
  257. 384 | int static nvidia_mmap_sysmem(
  258. | ^~~
  259. nvidia/nv-mmap.c: In function ‘nv_encode_caching’:
  260. nvidia/nv-mmap.c:351:16: warning: this statement may fall through [-Wimplicit-fallthrough=]
  261. 351 | if (NV_ALLOW_CACHING(memory_type))
  262. | ^
  263. nvidia/nv-mmap.c:354:9: note: here
  264. 354 | default:
  265. | ^~~~~~~
  266. CC [M] nvidia/nv-procfs.o
  267. CC [M] nvidia/nv-procfs-utils.o
  268. CC [M] nvidia/nv-usermap.o
  269. CC [M] nvidia/nv-vm.o
  270. CC [M] nvidia/nv-vtophys.o
  271. nvidia/nv-procfs.c:689:1: warning: no previous prototype for ‘exercise_error_forwarding_va’ [-Wmissing-prototypes]
  272. 689 | exercise_error_forwarding_va(
  273. | ^~~~~~~~~~~~~~~~~~~~~~~~~~~~
  274. CC [M] nvidia/os-interface.o
  275. CC [M] nvidia/os-mlock.o
  276. CC [M] nvidia/os-pci.o
  277. CC [M] nvidia/os-registry.o
  278. nvidia/os-interface.c:276:7: warning: no previous prototype for ‘os_mem_copy_custom’ [-Wmissing-prototypes]
  279. 276 | void *os_mem_copy_custom(
  280. | ^~~~~~~~~~~~~~~~~~
  281. nvidia/os-interface.c: In function ‘os_get_current_process_name’:
  282. nvidia/os-interface.c:648:5: error: implicit declaration of function ‘strncpy’ [-Wimplicit-function-declaration]
  283. 648 | strncpy(buf, current->comm, len - 1);
  284. | ^~~~~~~
  285. nvidia/os-interface.c:17:1: note: include ‘<string.h>’ or provide a declaration of ‘strncpy’
  286. 16 | #include "nv-time.h"
  287. +++ |+#include <string.h>
  288. 17 |
  289. nvidia/os-interface.c:648:5: warning: incompatible implicit declaration of built-in function ‘strncpy’ [-Wbuiltin-declaration-mismatch]
  290. 648 | strncpy(buf, current->comm, len - 1);
  291. | ^~~~~~~
  292. nvidia/os-interface.c:648:5: note: include ‘<string.h>’ or provide a declaration of ‘strncpy’
  293. make[4]: *** [/usr/lib/modules/7.2.2-arch1-1/build/scripts/Makefile.build:289: nvidia/os-interface.o] Error 1
  294. make[4]: *** Waiting for unfinished jobs....
  295. make[3]: *** [/usr/lib/modules/7.2.2-arch1-1/build/Makefile:2187: .] Error 2
  296. make[2]: *** [/usr/lib/modules/7.2.2-arch1-1/build/Makefile:248: __sub-make] Error 2
  297. make[2]: Leaving directory '/var/lib/dkms/nvidia/470.256.02/build'
  298. make[1]: *** [Makefile:248: __sub-make] Error 2
  299. make[1]: Leaving directory '/usr/lib/modules/7.2.2-arch1-1/build'
  300. make: *** [Makefile:80: modules] Error 2
  301.  
  302. # exit code: 2
  303. # elapsed time: 00:00:49
  304. ----------------------------------------------------------------
Advertisement
Add Comment
Please, Sign In to add comment