Guest User

Untitled

a guest
Aug 9th, 2020
10
Never
Not a member of Pastebin yet? Sign Up, it unlocks many cool features!
  1. [INFO] ------------------------------------------------------------------------
  2. [INFO] Reactor Summary for Household Module 1.0.2-SNAPSHOT:
  3. [INFO]
  4. [INFO] Household Module ................................... SUCCESS [ 0.279 s]
  5. [INFO] Household Module API ............................... SUCCESS [ 9.270 s]
  6. [INFO] Household Module OMOD .............................. FAILURE [ 4.929 s]
  7. [INFO] ------------------------------------------------------------------------
  8. [INFO] BUILD FAILURE
  9. [INFO] ------------------------------------------------------------------------
  10. [INFO] Total time: 15.876 s
  11. [INFO] Finished at: 2020-08-09T23:25:37+07:00
  12. [INFO] ------------------------------------------------------------------------
  13. [ERROR] Failed to execute goal org.apache.maven.plugins:maven-surefire-plugin:2.5:test (default-test) on project household-omod: There are test failures.
  14. [ERROR]
  15. [ERROR] Please refer to /home/phong/Desktop/openmrs-module-household-master/omod/target/surefire-reports for the individual test results.
  16. [ERROR] -> [Help 1]
  17. org.apache.maven.lifecycle.LifecycleExecutionException: Failed to execute goal org.apache.maven.plugins:maven-surefire-plugin:2.5:test (default-test) on project household-omod: There are test failures.
  18.  
  19. Please refer to /home/phong/Desktop/openmrs-module-household-master/omod/target/surefire-reports for the individual test results.
  20. at org.apache.maven.lifecycle.internal.MojoExecutor.execute (MojoExecutor.java:215)
  21. at org.apache.maven.lifecycle.internal.MojoExecutor.execute (MojoExecutor.java:156)
  22. at org.apache.maven.lifecycle.internal.MojoExecutor.execute (MojoExecutor.java:148)
  23. at org.apache.maven.lifecycle.internal.LifecycleModuleBuilder.buildProject (LifecycleModuleBuilder.java:117)
  24. at org.apache.maven.lifecycle.internal.LifecycleModuleBuilder.buildProject (LifecycleModuleBuilder.java:81)
  25. at org.apache.maven.lifecycle.internal.builder.singlethreaded.SingleThreadedBuilder.build (SingleThreadedBuilder.java:56)
  26. at org.apache.maven.lifecycle.internal.LifecycleStarter.execute (LifecycleStarter.java:128)
  27. at org.apache.maven.DefaultMaven.doExecute (DefaultMaven.java:305)
  28. at org.apache.maven.DefaultMaven.doExecute (DefaultMaven.java:192)
  29. at org.apache.maven.DefaultMaven.execute (DefaultMaven.java:105)
  30. at org.apache.maven.cli.MavenCli.execute (MavenCli.java:957)
  31. at org.apache.maven.cli.MavenCli.doMain (MavenCli.java:289)
  32. at org.apache.maven.cli.MavenCli.main (MavenCli.java:193)
  33. at sun.reflect.NativeMethodAccessorImpl.invoke0 (Native Method)
  34. at sun.reflect.NativeMethodAccessorImpl.invoke (NativeMethodAccessorImpl.java:62)
  35. at sun.reflect.DelegatingMethodAccessorImpl.invoke (DelegatingMethodAccessorImpl.java:43)
  36. at java.lang.reflect.Method.invoke (Method.java:498)
  37. at org.codehaus.plexus.classworlds.launcher.Launcher.launchEnhanced (Launcher.java:282)
  38. at org.codehaus.plexus.classworlds.launcher.Launcher.launch (Launcher.java:225)
  39. at org.codehaus.plexus.classworlds.launcher.Launcher.mainWithExitCode (Launcher.java:406)
  40. at org.codehaus.plexus.classworlds.launcher.Launcher.main (Launcher.java:347)
  41. Caused by: org.apache.maven.plugin.MojoFailureException: There are test failures.
  42.  
  43. Please refer to /home/phong/Desktop/openmrs-module-household-master/omod/target/surefire-reports for the individual test results.
  44. at org.apache.maven.plugin.surefire.SurefirePlugin.execute (SurefirePlugin.java:629)
  45. at org.apache.maven.plugin.DefaultBuildPluginManager.executeMojo (DefaultBuildPluginManager.java:137)
  46. at org.apache.maven.lifecycle.internal.MojoExecutor.execute (MojoExecutor.java:210)
  47. at org.apache.maven.lifecycle.internal.MojoExecutor.execute (MojoExecutor.java:156)
  48. at org.apache.maven.lifecycle.internal.MojoExecutor.execute (MojoExecutor.java:148)
  49. at org.apache.maven.lifecycle.internal.LifecycleModuleBuilder.buildProject (LifecycleModuleBuilder.java:117)
  50. at org.apache.maven.lifecycle.internal.LifecycleModuleBuilder.buildProject (LifecycleModuleBuilder.java:81)
  51. at org.apache.maven.lifecycle.internal.builder.singlethreaded.SingleThreadedBuilder.build (SingleThreadedBuilder.java:56)
  52. at org.apache.maven.lifecycle.internal.LifecycleStarter.execute (LifecycleStarter.java:128)
  53. at org.apache.maven.DefaultMaven.doExecute (DefaultMaven.java:305)
  54. at org.apache.maven.DefaultMaven.doExecute (DefaultMaven.java:192)
  55. at org.apache.maven.DefaultMaven.execute (DefaultMaven.java:105)
  56. at org.apache.maven.cli.MavenCli.execute (MavenCli.java:957)
  57. at org.apache.maven.cli.MavenCli.doMain (MavenCli.java:289)
  58. at org.apache.maven.cli.MavenCli.main (MavenCli.java:193)
  59. at sun.reflect.NativeMethodAccessorImpl.invoke0 (Native Method)
  60. at sun.reflect.NativeMethodAccessorImpl.invoke (NativeMethodAccessorImpl.java:62)
  61. at sun.reflect.DelegatingMethodAccessorImpl.invoke (DelegatingMethodAccessorImpl.java:43)
  62. at java.lang.reflect.Method.invoke (Method.java:498)
  63. at org.codehaus.plexus.classworlds.launcher.Launcher.launchEnhanced (Launcher.java:282)
  64. at org.codehaus.plexus.classworlds.launcher.Launcher.launch (Launcher.java:225)
  65. at org.codehaus.plexus.classworlds.launcher.Launcher.mainWithExitCode (Launcher.java:406)
  66. at org.codehaus.plexus.classworlds.launcher.Launcher.main (Launcher.java:347)
  67. [ERROR]
  68. [ERROR] Re-run Maven using the -X switch to enable full debug logging.
  69. [ERROR]
  70. [ERROR] For more information about the errors and possible solutions, please read the following articles:
  71. [ERROR] [Help 1] http://cwiki.apache.org/confluence/display/MAVEN/MojoFailureException
  72. [ERROR]
  73. [ERROR] After correcting the problems, you can resume the build with the command
  74. [ERROR] mvn <args> -rf :household-omod
  75.  
RAW Paste Data